"kenteken","voertuigsoort","merk","handelsbenaming","vervaldatum_apk","datum_tenaamstelling","bruto_bpm","inrichting","aantal_zitplaatsen","eerste_kleur","tweede_kleur","aantal_cilinders","cilinderinhoud","massa_ledig_voertuig","toegestane_maximum_massa_voertuig","massa_rijklaar","maximum_massa_trekken_ongeremd","maximum_trekken_massa_geremd","datum_eerste_toelating","datum_eerste_tenaamstelling_in_nederland","wacht_op_keuren","catalogusprijs","wam_verzekerd","maximale_constructiesnelheid","laadvermogen","oplegger_geremd","aanhangwagen_autonoom_geremd","aanhangwagen_middenas_geremd","aantal_staanplaatsen","aantal_deuren","aantal_wielen","afstand_hart_koppeling_tot_achterzijde_voertuig","afstand_voorzijde_voertuig_tot_hart_koppeling","afwijkende_maximum_snelheid","lengte","breedte","europese_voertuigcategorie","europese_voertuigcategorie_toevoeging","europese_uitvoeringcategorie_toevoeging","plaats_chassisnummer","technische_max_massa_voertuig","type","type_gasinstallatie","typegoedkeuringsnummer","variant","uitvoering","volgnummer_wijziging_eu_typegoedkeuring","vermogen_massarijklaar","wielbasis","export_indicator","openstaande_terugroepactie_indicator","vervaldatum_tachograaf","taxi_indicator","maximum_massa_samenstelling","aantal_rolstoelplaatsen","maximum_ondersteunende_snelheid","jaar_laatste_registratie_tellerstand","tellerstandoordeel","code_toelichting_tellerstandoordeel","tenaamstellen_mogelijk","vervaldatum_apk_dt","datum_tenaamstelling_dt","datum_eerste_toelating_dt","datum_eerste_tenaamstelling_in_nederland_dt","vervaldatum_tachograaf_dt","maximum_last_onder_de_vooras_sen_tezamen_koppeling","type_remsysteem_voertuig_code","rupsonderstelconfiguratiecode","wielbasis_voertuig_minimum","wielbasis_voertuig_maximum","lengte_voertuig_minimum","lengte_voertuig_maximum","breedte_voertuig_minimum","breedte_voertuig_maximum","hoogte_voertuig","hoogte_voertuig_minimum","hoogte_voertuig_maximum","massa_bedrijfsklaar_minimaal","massa_bedrijfsklaar_maximaal","technisch_toelaatbaar_massa_koppelpunt","maximum_massa_technisch_maximaal","maximum_massa_technisch_minimaal","subcategorie_nederland","verticale_belasting_koppelpunt_getrokken_voertuig","zuinigheidsclassificatie","registratie_datum_goedkeuring_afschrijvingsmoment_bpm","registratie_datum_goedkeuring_afschrijvingsmoment_bpm_dt","gem_lading_wrde","aerodyn_voorz","massa_alt_aandr","verl_cab_ind","api_gekentekende_voertuigen_assen","api_gekentekende_voertuigen_brandstof","api_gekentekende_voertuigen_carrosserie","api_gekentekende_voertuigen_carrosserie_specifiek","api_gekentekende_voertuigen_voertuigklasse"
"00YE89","Personenauto","CHRYSLER","NEW YORKER","20241020",,,"sedan","6","BLAUW","Niet geregistreerd","8","7200","2274","2925","2374",,,"19750228","20221025","Geen verstrekking in Open Data",,"Nee",,,,,,,"4","4",,,,,,"M1",,,"r. bodemplaat kofferruimte","2925",,,,,,,"0.07","316","Ja","Nee",,"Nee",,,,"2022","Geen oordeel","05","Nee","2024-10-20T00:00:00.000",,"1975-02-28T00:00:00.000","2022-10-25T00:00:00.000",,,,,,,,,,,,,,,,,,,,,,"20221020","2022-10-20T00:00:00.000",,,,,"https://opendata.rdw.nl/resource/3huj-srit.json","https://opendata.rdw.nl/resource/8ys7-d773.json","https://opendata.rdw.nl/resource/vezc-m2t6.json","https://opendata.rdw.nl/resource/jhie-znh9.json","https://opendata.rdw.nl/resource/kmfi-hrps.json"
"01NTDS","Personenauto","CHRYSLER","SEBRING","20230426",,"6468","sedan","5","GRIJS","Niet geregistreerd","4","1996","1440","1950","1540","450","455","20040223","20040223","Geen verstrekking in Open Data",,"Nee",,,,,,,"4","4","0","0",,"484","0","M1",,,"op r. schroefveerkoker onder motorkap","1950",,,"e11*98/14*0138*06","LB6Y","4","0","0.07","274","Ja","Nee",,"Nee","2405","0",,"2023","Logisch","00","Nee","2023-04-26T00:00:00.000",,"2004-02-23T00:00:00.000","2004-02-23T00:00:00.000",,,,,,,,,,,,,,,,,,,,,"E",,,,,,,"https://opendata.rdw.nl/resource/3huj-srit.json","https://opendata.rdw.nl/resource/8ys7-d773.json","https://opendata.rdw.nl/resource/vezc-m2t6.json","https://opendata.rdw.nl/resource/jhie-znh9.json","https://opendata.rdw.nl/resource/kmfi-hrps.json"
"01PVP1","Personenauto","CHRYSLER","300 HEMI C AUTO","20240627",,"16245","sedan","9","GRIJS","Niet geregistreerd","6","3518","2777","3500","2877",,,"20050303","20110328","Geen verstrekking in Open Data",,"Nee",,,,,,,"4","4",,,,,,"M1",,,"bodemplaat r. kofferruimte","3855",,,,,,,"0.07","650","Ja","Ja",,"Nee",,,,"2023","Geen oordeel","05","Nee","2024-06-27T00:00:00.000",,"2005-03-03T00:00:00.000","2011-03-28T00:00:00.000",,"0",,,,,,,,,,,,,,,,,,,,,,,,,,"https://opendata.rdw.nl/resource/3huj-srit.json","https://opendata.rdw.nl/resource/8ys7-d773.json","https://opendata.rdw.nl/resource/vezc-m2t6.json","https://opendata.rdw.nl/resource/jhie-znh9.json","https://opendata.rdw.nl/resource/kmfi-hrps.json"
"01PVXH","Personenauto","CHRYSLER","SEBRING","20230530","20230622","6345","sedan","5","ZWART","Niet geregistreerd","4","1996","1410","1920","1510","450","455","20050111","20050111","Geen verstrekking in Open Data","27949","Ja",,,,,,,"4","4","0","0",,"484","0","M1",,,"op r. schroefveerkoker onder motorkap","1920",,,"e11*98/14*0138*07","LN6Y","4","0","0.07","274","Ja","Nee",,"Nee","2375","0",,"2024","Onlogisch","04","Nee","2023-05-30T00:00:00.000","2023-06-22T00:00:00.000","2005-01-11T00:00:00.000","2005-01-11T00:00:00.000",,,,,,,,,,,,,,,,,,,,,"C",,,,,,,"https://opendata.rdw.nl/resource/3huj-srit.json","https://opendata.rdw.nl/resource/8ys7-d773.json","https://opendata.rdw.nl/resource/vezc-m2t6.json","https://opendata.rdw.nl/resource/jhie-znh9.json","https://opendata.rdw.nl/resource/kmfi-hrps.json"
"01ZSF7","Personenauto","CHRYSLER","300 C","20230126",,"35811","sedan","5","ZWART","Niet geregistreerd","6","3604","1768","2314","1868","450",,"20130116","20130116","Geen verstrekking in Open Data","76342","Nee",,,,,,,"4","4",,,,,,"M1",,,"r. schroefveerkoker","2314",,"G2 gasinstallatie",,,,,"0.12","306","Ja","Ja",,"Nee",,,,"2022","Onlogisch","04","Nee","2023-01-26T00:00:00.000",,"2013-01-16T00:00:00.000","2013-01-16T00:00:00.000",,"0",,,,,,,,,,,,,,,,,,,,,,,,,,"https://opendata.rdw.nl/resource/3huj-srit.json","https://opendata.rdw.nl/resource/8ys7-d773.json","https://opendata.rdw.nl/resource/vezc-m2t6.json","https://opendata.rdw.nl/resource/jhie-znh9.json","https://opendata.rdw.nl/resource/kmfi-hrps.json"
"02HHFK","Personenauto","CHRYSLER","SEBRING","20230705",,"8189","sedan","5","GRIJS","Niet geregistreerd","6","2736","1475","1990","1575","450","455","20010705","20010705","Geen verstrekking in Open Data",,"Nee",,,,,,,"4","4","0","0",,"484","0","M1",,,"op r. schroefveerkoker onder motorkap","1990",,,"e11*98/14*0138*01","LB6U","1","1","0.09","274","Ja","Nee",,"Nee","2445","0",,"2023","Logisch","00","Nee","2023-07-05T00:00:00.000",,"2001-07-05T00:00:00.000","2001-07-05T00:00:00.000",,,,,,,,,,,,,,,,,,,,,"E",,,,,,,"https://opendata.rdw.nl/resource/3huj-srit.json","https://opendata.rdw.nl/resource/8ys7-d773.json","https://opendata.rdw.nl/resource/vezc-m2t6.json","https://opendata.rdw.nl/resource/jhie-znh9.json","https://opendata.rdw.nl/resource/kmfi-hrps.json"
"03NHZL","Personenauto","CHRYSLER","SEBRING",,,"5962","sedan","5","GRIJS","Niet geregistreerd","4","1996","1410","1920","1510","450","455","20031010","20031010","Geen verstrekking in Open Data",,"Nee",,,,,,,"4","4","0","0",,"484","0","M1",,,"op r. schroefveerkoker onder motorkap","1920",,,"e11*98/14*0138*05","LN6Y","2","0","0.07","274","Ja","Nee",,"Nee","2375","0",,"2022","Onlogisch","04","Nee",,,"2003-10-10T00:00:00.000","2003-10-10T00:00:00.000",,,,,,,,,,,,,,,,,,,,,"C",,,,,,,"https://opendata.rdw.nl/resource/3huj-srit.json","https://opendata.rdw.nl/resource/8ys7-d773.json","https://opendata.rdw.nl/resource/vezc-m2t6.json","https://opendata.rdw.nl/resource/jhie-znh9.json","https://opendata.rdw.nl/resource/kmfi-hrps.json"
"04DNTD","Personenauto","CHRYSLER","300M",,,"11185","sedan","5","GRIJS","Niet geregistreerd","6","2736","1540","2120","1640","450","900","19991015","19991015","Geen verstrekking in Open Data",,"Nee",,,,,,,"4","4","0","0",,"500","0","M1",,,"op r. schroefveerkoker onder motorkap","2120",,,"e11*93/81*0056*02","EB6R","X","1","0.09","287","Ja","Nee",,"Nee","2975","0",,"2022","Logisch","00","Nee",,,"1999-10-15T00:00:00.000","1999-10-15T00:00:00.000",,,,,,,,,,,,,,,,,,,,,,,,,,,,"https://opendata.rdw.nl/resource/3huj-srit.json","https://opendata.rdw.nl/resource/8ys7-d773.json","https://opendata.rdw.nl/resource/vezc-m2t6.json","https://opendata.rdw.nl/resource/jhie-znh9.json","https://opendata.rdw.nl/resource/kmfi-hrps.json"
"05SJXK","Personenauto","CHRYSLER","300C","20231123","20240320","12983","sedan","5","ZWART","Niet geregistreerd","6","2736","1705","2170","1805","450","1425","20060127","20060127","Geen verstrekking in Open Data","51220","Ja",,,,,,,"4","4","0","0",,"502","0","M1",,,"op r. schroefveerkoker onder motorkap","2170",,,"e11*2001/116*0141*04","AB3R","2","0","0.08","305","Ja","Ja",,"Nee","3670","0",,"2024","Onlogisch","04","Nee","2023-11-23T00:00:00.000","2024-03-20T00:00:00.000","2006-01-27T00:00:00.000","2006-01-27T00:00:00.000",,,,,,,,,,,,,,,,,,,,,"D",,,,,,,"https://opendata.rdw.nl/resource/3huj-srit.json","https://opendata.rdw.nl/resource/8ys7-d773.json","https://opendata.rdw.nl/resource/vezc-m2t6.json","https://opendata.rdw.nl/resource/jhie-znh9.json","https://opendata.rdw.nl/resource/kmfi-hrps.json"
"05ZDFR","Personenauto","CHRYSLER","300C","20240112",,"15658","sedan","5","BLAUW","Niet geregistreerd","6","3518","1715","2180","1815","450","1640","20070112","20080119","Geen verstrekking in Open Data",,"Nee",,,,,,,"4","4","0","0",,"502","0","M1",,,"op r. schroefveerkoker onder motorkap","2180",,,"e11*2001/116*0141*07","AE3G","3","0","0.10","305","Ja","Nee",,"Nee","3905","0",,"2023","Geen oordeel","05","Nee","2024-01-12T00:00:00.000",,"2007-01-12T00:00:00.000","2008-01-19T00:00:00.000",,,,,,,,,,,,,,,,,,,,,"E",,,,,,,"https://opendata.rdw.nl/resource/3huj-srit.json","https://opendata.rdw.nl/resource/8ys7-d773.json","https://opendata.rdw.nl/resource/vezc-m2t6.json","https://opendata.rdw.nl/resource/jhie-znh9.json","https://opendata.rdw.nl/resource/kmfi-hrps.json"
"06KLJ4","Personenauto","CHRYSLER","300C","20230607",,"19443","sedan","5","BLAUW","Niet geregistreerd","6","2987","1810","2385","1910","450","1900","20100105","20100105","Geen verstrekking in Open Data","58824","Nee",,,,,,,"4","4","0","0",,"502","0","M1",,,"op r. schroefveerkoker onder motorkap","2385",,,"e11*2001/116*0141*08","AE3D","H1","0","0.08","305","Ja","Nee",,"Nee","4385","0","0.00","2022","Onlogisch","04","Nee","2023-06-07T00:00:00.000",,"2010-01-05T00:00:00.000","2010-01-05T00:00:00.000",,,,,,,,,,,,,,,,,,,,,"E",,,,,,,"https://opendata.rdw.nl/resource/3huj-srit.json","https://opendata.rdw.nl/resource/8ys7-d773.json","https://opendata.rdw.nl/resource/vezc-m2t6.json","https://opendata.rdw.nl/resource/jhie-znh9.json","https://opendata.rdw.nl/resource/kmfi-hrps.json"
"08JJNF","Personenauto","CHRYSLER","SEBRING","20231026",,"5511","sedan","5","ZWART","Niet geregistreerd","4","1996","1410","1920","1510","450","455","20020426","20020426","Geen verstrekking in Open Data",,"Nee",,,,,,,"4","4","0","0",,"484","0","M1",,,"op r. schroefveerkoker onder motorkap","1920",,,"e11*98/14*0138*03","LN6Y","1","0","0.07","274","Ja","Nee",,"Nee","2445","0",,"2023","Logisch","00","Nee","2023-10-26T00:00:00.000",,"2002-04-26T00:00:00.000","2002-04-26T00:00:00.000",,,,,,,,,,,,,,,,,,,,,"C",,,,,,,"https://opendata.rdw.nl/resource/3huj-srit.json","https://opendata.rdw.nl/resource/8ys7-d773.json","https://opendata.rdw.nl/resource/vezc-m2t6.json","https://opendata.rdw.nl/resource/jhie-znh9.json","https://opendata.rdw.nl/resource/kmfi-hrps.json"
"12HBZL","Personenauto","CHRYSLER","NEON","20241111","20210709","4610","sedan","5","GROEN","Niet geregistreerd","4","1996","1145","1650","1245","450","1000","20010521","20010521","Geen verstrekking in Open Data",,"Nee",,,,,,,"4","4","0","0",,"439","0","M1",,,"op r. schroefveerkoker onder motorkap","1650",,,"e11*98/14*0057*03","SM6C","L2","1","0.08","267","Ja","Nee",,"Nee","2600","0",,"2023","Logisch","00","Nee","2024-11-11T00:00:00.000","2021-07-09T00:00:00.000","2001-05-21T00:00:00.000","2001-05-21T00:00:00.000",,,,,,,,,,,,,,,,,,,,,"D",,,,,,,"https://opendata.rdw.nl/resource/3huj-srit.json","https://opendata.rdw.nl/resource/8ys7-d773.json","https://opendata.rdw.nl/resource/vezc-m2t6.json","https://opendata.rdw.nl/resource/jhie-znh9.json","https://opendata.rdw.nl/resource/kmfi-hrps.json"
"13FFHK","Personenauto","CHRYSLER","NEON","20230310",,"3519","sedan","5","BRUIN","Niet geregistreerd","4","1996","1145","1650","1245","450","1000","20000224","20000224","Geen verstrekking in Open Data",,"Nee",,,,,,,"4","4","0","0",,"439","0","M1",,,"r. op binnenbalk in kofferruimte a. achterzitting","1650",,,"e11*98/14*0057*01","SM6C","L","1","0.08","267","Ja","Nee",,"Nee","2600","0",,"2022","Logisch","00","Nee","2023-03-10T00:00:00.000",,"2000-02-24T00:00:00.000","2000-02-24T00:00:00.000",,,,,,,,,,,,,,,,,,,,,,,,,,,,"https://opendata.rdw.nl/resource/3huj-srit.json","https://opendata.rdw.nl/resource/8ys7-d773.json","https://opendata.rdw.nl/resource/vezc-m2t6.json","https://opendata.rdw.nl/resource/jhie-znh9.json","https://opendata.rdw.nl/resource/kmfi-hrps.json"
"13TLZV","Personenauto","CHRYSLER","300C","20221205",,"16121","sedan","5","BLAUW","Niet geregistreerd","6","2987","1810","2385","1910","450","1900","20061110","20061110","Geen verstrekking in Open Data","59569","Nee",,,,,,,"4","4","0","0",,"502","0","M1",,,"op r. schroefveerkoker onder motorkap","2385",,,"e11*2001/116*0141*05","AE3D","H1","0","0.08","305","Ja","Ja",,"Nee","4385","0","0.00","2022","Logisch","00","Nee","2022-12-05T00:00:00.000",,"2006-11-10T00:00:00.000","2006-11-10T00:00:00.000",,,,,,,,,,,,,,,,,,,,,"E",,,,,,,"https://opendata.rdw.nl/resource/3huj-srit.json","https://opendata.rdw.nl/resource/8ys7-d773.json","https://opendata.rdw.nl/resource/vezc-m2t6.json","https://opendata.rdw.nl/resource/jhie-znh9.json","https://opendata.rdw.nl/resource/kmfi-hrps.json"
"14XXHF","Personenauto","CHRYSLER","300C","20230303",,"15900","sedan","5","BLAUW","Niet geregistreerd","8","5654","1810","2280","1910","450","1640","20071026","20071026","Geen verstrekking in Open Data","60749","Nee",,,,,,,"4","4","0","0",,"502","0","M1",,,"op r. schroefveerkoker onder motorkap","2280",,,"e11*2001/116*0141*07","AE3H","3","2","0.13","305","Ja","Nee",,"Nee","4005","0",,"2022","Logisch","00","Nee","2023-03-03T00:00:00.000",,"2007-10-26T00:00:00.000","2007-10-26T00:00:00.000",,,,,,,,,,,,,,,,,,,,,"F",,,,,,,"https://opendata.rdw.nl/resource/3huj-srit.json","https://opendata.rdw.nl/resource/8ys7-d773.json","https://opendata.rdw.nl/resource/vezc-m2t6.json","https://opendata.rdw.nl/resource/jhie-znh9.json","https://opendata.rdw.nl/resource/kmfi-hrps.json"
"17GBB3","Personenauto","CHRYSLER","300C","20230624",,"18706","sedan","5","GRIJS","Niet geregistreerd","6","2987","1810","2385","1910","450","1900","20080523","20080523","Geen verstrekking in Open Data","61380","Nee",,,,,,,"4","4","0","0",,"502","0","M1",,,"op r. schroefveerkoker onder motorkap","2385",,,"e11*2001/116*0141*08","AE3D","HS1","0","0.08","305","Ja","Ja",,"Nee","4385","0","0.00","2023","Logisch","00","Nee","2023-06-24T00:00:00.000",,"2008-05-23T00:00:00.000","2008-05-23T00:00:00.000",,,,,,,,,,,,,,,,,,,,,"E",,,,,,,"https://opendata.rdw.nl/resource/3huj-srit.json","https://opendata.rdw.nl/resource/8ys7-d773.json","https://opendata.rdw.nl/resource/vezc-m2t6.json","https://opendata.rdw.nl/resource/jhie-znh9.json","https://opendata.rdw.nl/resource/kmfi-hrps.json"
"17HTNF","Personenauto","CHRYSLER","NEON","20230413",,"3772","sedan","5","GRIJS","Niet geregistreerd","4","1598","1165","1650","1265","450","1000","20011127","20011127","Geen verstrekking in Open Data",,"Nee",,,,,,,"4","4","0","0",,"439","0","M1",,,"op r. schroefveerkoker onder motorkap","1650",,,"e11*98/14*0057*03","SN6P","L","0","0.07","267","Ja","Nee",,"Nee","2600","0",,"2022","Logisch","00","Nee","2023-04-13T00:00:00.000",,"2001-11-27T00:00:00.000","2001-11-27T00:00:00.000",,,,,,,,,,,,,,,,,,,,,"C",,,,,,,"https://opendata.rdw.nl/resource/3huj-srit.json","https://opendata.rdw.nl/resource/8ys7-d773.json","https://opendata.rdw.nl/resource/vezc-m2t6.json","https://opendata.rdw.nl/resource/jhie-znh9.json","https://opendata.rdw.nl/resource/kmfi-hrps.json"
"18HBJ9","Personenauto","CHRYSLER","SEBRING","20231014",,"10369","sedan","5","ZWART","Niet geregistreerd","4","1968","1535","2040","1635","450","1500","20081014","20081014","Geen verstrekking in Open Data","31080","Nee",,,,,,,"4","4","0","0",,"485","0","M1",,,"r. op deurdorpel by voorzitting","2040",,,"e11*2001/116*0143*01","CSCAA","L","0","0.06","277","Ja","Nee",,"Nee","3540","0",,"2023","Logisch","00","Nee","2023-10-14T00:00:00.000",,"2008-10-14T00:00:00.000","2008-10-14T00:00:00.000",,,,,,,,,,,,,,,,,,,,,"C",,,,,,,"https://opendata.rdw.nl/resource/3huj-srit.json","https://opendata.rdw.nl/resource/8ys7-d773.json","https://opendata.rdw.nl/resource/vezc-m2t6.json","https://opendata.rdw.nl/resource/jhie-znh9.json","https://opendata.rdw.nl/resource/kmfi-hrps.json"
"18SFNK","Personenauto","CHRYSLER","300C",,,"15513","sedan","5","ZWART","Niet geregistreerd","6","2987","1810","2385","1910","450","1900","20060102","20060102","Geen verstrekking in Open Data","57072","Nee",,,,,,,"4","4","0","0",,"502","0","M1",,,"op r. schroefveerkoker onder motorkap","2385",,,"e11*2001/116*0141*04","AE3D","H1","0","0.08","305","Ja","Ja",,"Nee","4385","0","0.00","2022","Logisch","00","Nee",,,"2006-01-02T00:00:00.000","2006-01-02T00:00:00.000",,,,,,,,,,,,,,,,,,,,,"E",,,,,,,"https://opendata.rdw.nl/resource/3huj-srit.json","https://opendata.rdw.nl/resource/8ys7-d773.json","https://opendata.rdw.nl/resource/vezc-m2t6.json","https://opendata.rdw.nl/resource/jhie-znh9.json","https://opendata.rdw.nl/resource/kmfi-hrps.json"
"20PGJN","Personenauto","CHRYSLER","300C","20240525",,"17694","sedan","5","GRIJS","Niet geregistreerd","8","5654","1810","2280","1910","450","1425","20040609","20040609","Geen verstrekking in Open Data",,"Nee",,,,,,,"4","4","0","0",,"502","0","M1",,,"op r. schroefveerkoker onder motorkap","2280",,,"e11*2001/116*0141*00","AE3H","L","0","0.13","305","Ja","Nee",,"Nee","3705","0",,"2024","Onlogisch","04","Nee","2024-05-25T00:00:00.000",,"2004-06-09T00:00:00.000","2004-06-09T00:00:00.000",,,,,,,,,,,,,,,,,,,,,"G",,,,,,,"https://opendata.rdw.nl/resource/3huj-srit.json","https://opendata.rdw.nl/resource/8ys7-d773.json","https://opendata.rdw.nl/resource/vezc-m2t6.json","https://opendata.rdw.nl/resource/jhie-znh9.json","https://opendata.rdw.nl/resource/kmfi-hrps.json"
"21TBBB","Personenauto","CHRYSLER","300C","20240503","20231030","15513","sedan","5","GRIJS","Niet geregistreerd","6","2987","1810","2385","1910","450","1900","20060626","20060626","Geen verstrekking in Open Data","57072","Ja",,,,,,,"4","4","0","0",,"502","0","M1",,,"op r. schroefveerkoker onder motorkap","2385",,,"e11*2001/116*0141*05","AE3D","H1","0","0.08","305","Ja","Nee",,"Nee","4385","0","0.00","2024","Niet geregistreerd","NG","Nee","2024-05-03T00:00:00.000","2023-10-30T00:00:00.000","2006-06-26T00:00:00.000","2006-06-26T00:00:00.000",,,,,,,,,,,,,,,,,,,,,"E",,,,,,,"https://opendata.rdw.nl/resource/3huj-srit.json","https://opendata.rdw.nl/resource/8ys7-d773.json","https://opendata.rdw.nl/resource/vezc-m2t6.json","https://opendata.rdw.nl/resource/jhie-znh9.json","https://opendata.rdw.nl/resource/kmfi-hrps.json"
"24HDS3","Personenauto","CHRYSLER","SEBRING","20241011",,"5234","sedan","5","GRIJS","Niet geregistreerd","4","1998","1455","2040","1555","450","1000","20081025","20081025","Geen verstrekking in Open Data","25985","Nee",,,,,,,"4","4","0","0",,"485","0","M1",,,"r. op deurdorpel by voorzitting","2040",,,"e11*2001/116*0143*01","CSNAB","L","0","0.07","277","Ja","Nee",,"Nee","3040","0",,"2023","Logisch","00","Nee","2024-10-11T00:00:00.000",,"2008-10-25T00:00:00.000","2008-10-25T00:00:00.000",,,,,,,,,,,,,,,,,,,,,"B",,,,,,,"https://opendata.rdw.nl/resource/3huj-srit.json","https://opendata.rdw.nl/resource/8ys7-d773.json","https://opendata.rdw.nl/resource/vezc-m2t6.json","https://opendata.rdw.nl/resource/jhie-znh9.json","https://opendata.rdw.nl/resource/kmfi-hrps.json"
"24SKNF","Personenauto","CHRYSLER","300C","20230603",,"15965","sedan","5","ZWART","Niet geregistreerd","6","2987","1810","2385","1910","450","1900","20060210","20060210","Geen verstrekking in Open Data","58714","Nee",,,,,,,"4","4","0","0",,"502","0","M1",,,"op r. schroefveerkoker onder motorkap","2385",,,"e11*2001/116*0141*04","AE3D","H1","0","0.08","305","Ja","Nee",,"Nee","4385","0","0.00","2023","Niet geregistreerd","NG","Nee","2023-06-03T00:00:00.000",,"2006-02-10T00:00:00.000","2006-02-10T00:00:00.000",,,,,,,,,,,,,,,,,,,,,"E","20221208","2022-12-08T00:00:00.000",,,,,"https://opendata.rdw.nl/resource/3huj-srit.json","https://opendata.rdw.nl/resource/8ys7-d773.json","https://opendata.rdw.nl/resource/vezc-m2t6.json","https://opendata.rdw.nl/resource/jhie-znh9.json","https://opendata.rdw.nl/resource/kmfi-hrps.json"
"29ZDVF","Personenauto","CHRYSLER","300C","20231021",,"15864","sedan","5","GRIJS","Niet geregistreerd","6","2987","1810","2385","1910","450","1900","20080102","20080102","Geen verstrekking in Open Data","57635","Nee",,,,,,,"4","4","0","0",,"502","0","M1",,,"op r. schroefveerkoker onder motorkap","2385",,,"e11*2001/116*0141*07","AE3D","H1","2","0.08","305","Ja","Ja",,"Nee","4385","0","0.00","2023","Onlogisch","04","Nee","2023-10-21T00:00:00.000",,"2008-01-02T00:00:00.000","2008-01-02T00:00:00.000",,,,,,,,,,,,,,,,,,,,,"E",,,,,,,"https://opendata.rdw.nl/resource/3huj-srit.json","https://opendata.rdw.nl/resource/8ys7-d773.json","https://opendata.rdw.nl/resource/vezc-m2t6.json","https://opendata.rdw.nl/resource/jhie-znh9.json","https://opendata.rdw.nl/resource/kmfi-hrps.json"
"30XTSP","Personenauto","CHRYSLER","300C","20231028",,"11860","sedan","5","ZWART","Niet geregistreerd","6","2736","1705","2170","1805","450","1425","20071012","20071012","Geen verstrekking in Open Data","46785","Nee",,,,,,,"4","4","0","0",,"502","0","M1",,,"op r. schroefveerkoker onder motorkap","2170",,,"e11*2001/116*0141*07","AB3R","3","2","0.08","305","Ja","Nee",,"Nee","3670","0",,"2023","Logisch","00","Nee","2023-10-28T00:00:00.000",,"2007-10-12T00:00:00.000","2007-10-12T00:00:00.000",,,,,,,,,,,,,,,,,,,,,"D",,,,,,,"https://opendata.rdw.nl/resource/3huj-srit.json","https://opendata.rdw.nl/resource/8ys7-d773.json","https://opendata.rdw.nl/resource/vezc-m2t6.json","https://opendata.rdw.nl/resource/jhie-znh9.json","https://opendata.rdw.nl/resource/kmfi-hrps.json"
"31KNB4","Personenauto","CHRYSLER","300C",,,"17338","sedan","5","GRIJS","Niet geregistreerd","6","2987","1810","2385","1910","450","1900","20100114","20100114","Geen verstrekking in Open Data","47577","Nee",,,,,,,"4","4","0","0",,"502","0","M1",,,,"2385",,,"e11*2001/116*0141*08","AE3D","H2","0","0.08","305","Ja","Ja",,"Nee","4385","0","0.00","2023","Logisch","00","Nee",,,"2010-01-14T00:00:00.000","2010-01-14T00:00:00.000",,,,,,,,,,,,,,,,,,,,,"E",,,,,,,"https://opendata.rdw.nl/resource/3huj-srit.json","https://opendata.rdw.nl/resource/8ys7-d773.json","https://opendata.rdw.nl/resource/vezc-m2t6.json","https://opendata.rdw.nl/resource/jhie-znh9.json","https://opendata.rdw.nl/resource/kmfi-hrps.json"