"kenteken","voertuigsoort","merk","handelsbenaming","vervaldatum_apk","datum_tenaamstelling","bruto_bpm","inrichting","aantal_zitplaatsen","eerste_kleur","tweede_kleur","aantal_cilinders","cilinderinhoud","massa_ledig_voertuig","toegestane_maximum_massa_voertuig","massa_rijklaar","maximum_massa_trekken_ongeremd","maximum_trekken_massa_geremd","datum_eerste_toelating","datum_eerste_tenaamstelling_in_nederland","wacht_op_keuren","catalogusprijs","wam_verzekerd","maximale_constructiesnelheid","laadvermogen","oplegger_geremd","aanhangwagen_autonoom_geremd","aanhangwagen_middenas_geremd","aantal_staanplaatsen","aantal_deuren","aantal_wielen","afstand_hart_koppeling_tot_achterzijde_voertuig","afstand_voorzijde_voertuig_tot_hart_koppeling","afwijkende_maximum_snelheid","lengte","breedte","europese_voertuigcategorie","europese_voertuigcategorie_toevoeging","europese_uitvoeringcategorie_toevoeging","plaats_chassisnummer","technische_max_massa_voertuig","type","type_gasinstallatie","typegoedkeuringsnummer","variant","uitvoering","volgnummer_wijziging_eu_typegoedkeuring","vermogen_massarijklaar","wielbasis","export_indicator","openstaande_terugroepactie_indicator","vervaldatum_tachograaf","taxi_indicator","maximum_massa_samenstelling","aantal_rolstoelplaatsen","maximum_ondersteunende_snelheid","jaar_laatste_registratie_tellerstand","tellerstandoordeel","code_toelichting_tellerstandoordeel","tenaamstellen_mogelijk","vervaldatum_apk_dt","datum_tenaamstelling_dt","datum_eerste_toelating_dt","datum_eerste_tenaamstelling_in_nederland_dt","vervaldatum_tachograaf_dt","maximum_last_onder_de_vooras_sen_tezamen_koppeling","type_remsysteem_voertuig_code","rupsonderstelconfiguratiecode","wielbasis_voertuig_minimum","wielbasis_voertuig_maximum","lengte_voertuig_minimum","lengte_voertuig_maximum","breedte_voertuig_minimum","breedte_voertuig_maximum","hoogte_voertuig","hoogte_voertuig_minimum","hoogte_voertuig_maximum","massa_bedrijfsklaar_minimaal","massa_bedrijfsklaar_maximaal","technisch_toelaatbaar_massa_koppelpunt","maximum_massa_technisch_maximaal","maximum_massa_technisch_minimaal","subcategorie_nederland","verticale_belasting_koppelpunt_getrokken_voertuig","zuinigheidsclassificatie","registratie_datum_goedkeuring_afschrijvingsmoment_bpm","registratie_datum_goedkeuring_afschrijvingsmoment_bpm_dt","gem_lading_wrde","aerodyn_voorz","massa_alt_aandr","verl_cab_ind","api_gekentekende_voertuigen_assen","api_gekentekende_voertuigen_brandstof","api_gekentekende_voertuigen_carrosserie","api_gekentekende_voertuigen_carrosserie_specifiek","api_gekentekende_voertuigen_voertuigklasse"
"8TVG68","Personenauto","BMW","M550D XDRIVE","20240316",,"14718","stationwagen","5","GRIJS","Niet geregistreerd","6","2993","1984","2580","2084","750","2000","20120215","20140515","Geen verstrekking in Open Data","128318","Nee",,,,,,,"4","4",,,,,,"M1",,,"r. motorruimte","2580",,,,,,,"0.13","297","Ja","Nee",,"Nee","4660",,,"2023","Geen oordeel","05","Nee","2024-03-16T00:00:00.000",,"2012-02-15T00:00:00.000","2014-05-15T00:00:00.000",,"0",,,,,,,,,,,,,,,,,,,,,,,,,,"https://opendata.rdw.nl/resource/3huj-srit.json","https://opendata.rdw.nl/resource/8ys7-d773.json","https://opendata.rdw.nl/resource/vezc-m2t6.json","https://opendata.rdw.nl/resource/jhie-znh9.json","https://opendata.rdw.nl/resource/kmfi-hrps.json"
"G892XT","Personenauto","BMW","M550D XDRIVE","20230816",,"13647","sedan","5","GRIJS","Niet geregistreerd","6","2993","1835","2470","1935","750","2000","20190717","20191217","Geen verstrekking in Open Data","151913","Nee","250",,,,,,"4","4","0","0",,"496","187","M1",,,,"2470","G5L",,"e1*2007/46*1688*09","JD71","DAW500LM","0","0.15","298","Ja","Nee",,"Nee","4470","0","0.00","2023","Geen oordeel","05","Nee","2023-08-16T00:00:00.000",,"2019-07-17T00:00:00.000","2019-12-17T00:00:00.000",,,,,,,,,,,"148",,,,,,,,,,,,,,,,,"https://opendata.rdw.nl/resource/3huj-srit.json","https://opendata.rdw.nl/resource/8ys7-d773.json","https://opendata.rdw.nl/resource/vezc-m2t6.json","https://opendata.rdw.nl/resource/jhie-znh9.json","https://opendata.rdw.nl/resource/kmfi-hrps.json"
"N177HG","Personenauto","BMW","M550D XDRIVE","20221015",,"16611","stationwagen","5","GRIJS","Niet geregistreerd","6","2993","1930","2620","2030","750","2000","20180516","20211011","Geen verstrekking in Open Data","130499","Nee","250",,,,,,"4","4","0","0",,"496","187","M1",,,,"2620","G5K",,"e1*2007/46*1750*03","JN91","CAW50000","0","0.14","298","Ja","Nee",,"Nee","4620","0","0.00","2022","Geen oordeel","05","Nee","2022-10-15T00:00:00.000",,"2018-05-16T00:00:00.000","2021-10-11T00:00:00.000",,,,,,,,,,,"149",,,,,,,,,,,,,,,,,"https://opendata.rdw.nl/resource/3huj-srit.json","https://opendata.rdw.nl/resource/8ys7-d773.json","https://opendata.rdw.nl/resource/vezc-m2t6.json","https://opendata.rdw.nl/resource/jhie-znh9.json","https://opendata.rdw.nl/resource/kmfi-hrps.json"
"PR773B","Personenauto","BMW","M550D XDRIVE","20230825",,"19471","sedan","5","GRIJS","Niet geregistreerd","6","2993","1820","2470","1920","750","2000","20170825","20170825","Geen verstrekking in Open Data","133259","Nee",,,,,,,"4","4","0","0",,"496","0","M1",,,"r. motorruimte","2470","G5L",,"e1*2007/46*1688*02","JD71","CA250800","0","0.15","298","Ja","Nee",,"Nee","4560","0","0.00","2023","Logisch","00","Nee","2023-08-25T00:00:00.000",,"2017-08-25T00:00:00.000","2017-08-25T00:00:00.000",,,,,,,,,,,,,,,,,,,,,"F",,,,,,,"https://opendata.rdw.nl/resource/3huj-srit.json","https://opendata.rdw.nl/resource/8ys7-d773.json","https://opendata.rdw.nl/resource/vezc-m2t6.json","https://opendata.rdw.nl/resource/jhie-znh9.json","https://opendata.rdw.nl/resource/kmfi-hrps.json"
"RD511F","Personenauto","BMW","M550D XDRIVE","20240621",,"19471","sedan","5","GRIJS","Niet geregistreerd","6","2993","1820","2470","1920","750","2000","20171102","20171102","Geen verstrekking in Open Data","154108","Nee",,,,,,,"4","4","0","0",,"496","187","M1",,,"in motorruimte r.","2470","G5L",,"e1*2007/46*1688*02","JD71","CA250800","0","0.15","298","Ja","Nee",,"Nee","4560","0","0.00","2023","Logisch","00","Nee","2024-06-21T00:00:00.000",,"2017-11-02T00:00:00.000","2017-11-02T00:00:00.000",,,,,,,,,,,"147",,,,,,,,,,"F",,,,,,,"https://opendata.rdw.nl/resource/3huj-srit.json","https://opendata.rdw.nl/resource/8ys7-d773.json","https://opendata.rdw.nl/resource/vezc-m2t6.json","https://opendata.rdw.nl/resource/jhie-znh9.json","https://opendata.rdw.nl/resource/kmfi-hrps.json"
"RH482Z","Personenauto","BMW","M550D XDRIVE","20221201",,"19471","sedan","5","ZWART","Niet geregistreerd","6","2993","1820","2470","1920","750","2000","20171201","20171201","Geen verstrekking in Open Data","151517","Nee",,,,,,,"4","4","0","0",,"496","187","M1",,,"in motorruimte r.","2470","G5L",,"e1*2007/46*1688*02","JD71","CA250800","0","0.15","298","Ja","Nee",,"Nee","4560","0","0.00","2022","Logisch","00","Nee","2022-12-01T00:00:00.000",,"2017-12-01T00:00:00.000","2017-12-01T00:00:00.000",,,,,,,,,,,"147",,,,,,,,,,"F",,,,,,,"https://opendata.rdw.nl/resource/3huj-srit.json","https://opendata.rdw.nl/resource/8ys7-d773.json","https://opendata.rdw.nl/resource/vezc-m2t6.json","https://opendata.rdw.nl/resource/jhie-znh9.json","https://opendata.rdw.nl/resource/kmfi-hrps.json"
"RK942R","Personenauto","BMW","M550D XDRIVE","20240629",,"19471","sedan","5","ZWART","Niet geregistreerd","6","2993","1820","2470","1920","750","2000","20180104","20180104","Geen verstrekking in Open Data","152736","Nee",,,,,,,"4","4","0","0",,"496","187","M1",,,"in motorruimte r.","2470","G5L",,"e1*2007/46*1688*03","JD71","CA250800","0","0.15","298","Ja","Nee",,"Nee","4560","0","0.00","2023","Logisch","00","Nee","2024-06-29T00:00:00.000",,"2018-01-04T00:00:00.000","2018-01-04T00:00:00.000",,,,,,,,,,,"147",,,,,,,,,,"G",,,,,,,"https://opendata.rdw.nl/resource/3huj-srit.json","https://opendata.rdw.nl/resource/8ys7-d773.json","https://opendata.rdw.nl/resource/vezc-m2t6.json","https://opendata.rdw.nl/resource/jhie-znh9.json","https://opendata.rdw.nl/resource/kmfi-hrps.json"
"RL853J","Personenauto","BMW","M550D XDRIVE","20230115",,"19471","sedan","5","ZWART","Niet geregistreerd","6","2993","1820","2470","1920","750","2000","20180115","20180115","Geen verstrekking in Open Data","135079","Nee",,,,,,,"4","4","0","0",,"496","0","M1",,,"in motorruimte r.","2470","G5L",,"e1*2007/46*1688*02","JD71","CA250800","0","0.15","298","Ja","Nee",,"Nee","4560","0","0.00","2022","Logisch","00","Nee","2023-01-15T00:00:00.000",,"2018-01-15T00:00:00.000","2018-01-15T00:00:00.000",,,,,,,,,,,,,,,,,,,,,"G",,,,,,,"https://opendata.rdw.nl/resource/3huj-srit.json","https://opendata.rdw.nl/resource/8ys7-d773.json","https://opendata.rdw.nl/resource/vezc-m2t6.json","https://opendata.rdw.nl/resource/jhie-znh9.json","https://opendata.rdw.nl/resource/kmfi-hrps.json"
"RN116R","Personenauto","BMW","M550D XDRIVE","20240105",,"25202","stationwagen","5","GRIJS","Niet geregistreerd","6","2993","1930","2620","2030","750","2000","20180105","20180105","Geen verstrekking in Open Data","151668","Nee",,,,,,,"4","4","0","0",,"496","187","M1",,,"in motorruimte r.","2620","G5K",,"e1*2007/46*1750*02","JN91","CA250000","0","0.14","298","Ja","Nee",,"Nee","4710","0","0.00","2023","Logisch","00","Nee","2024-01-05T00:00:00.000",,"2018-01-05T00:00:00.000","2018-01-05T00:00:00.000",,,,,,,,,,,"149",,,,,,,,,,"G",,,,,,,"https://opendata.rdw.nl/resource/3huj-srit.json","https://opendata.rdw.nl/resource/8ys7-d773.json","https://opendata.rdw.nl/resource/vezc-m2t6.json","https://opendata.rdw.nl/resource/jhie-znh9.json","https://opendata.rdw.nl/resource/kmfi-hrps.json"
"RN131R","Personenauto","BMW","M550D XDRIVE","20230112",,"22394","stationwagen","5","ZWART","Niet geregistreerd","6","2993","1930","2620","2030","750","2000","20180112","20180112","Geen verstrekking in Open Data","154271","Nee",,,,,,,"4","4","0","0",,"496","187","M1",,,"in motorruimte r.","2620","G5K",,"e1*2007/46*1750*02","JN91","CA150000","0","0.14","298","Ja","Nee",,"Nee","4710","0","0.00","2023","Logisch","00","Nee","2023-01-12T00:00:00.000",,"2018-01-12T00:00:00.000","2018-01-12T00:00:00.000",,,,,,,,,,,"149",,,,,,,,,,"G",,,,,,,"https://opendata.rdw.nl/resource/3huj-srit.json","https://opendata.rdw.nl/resource/8ys7-d773.json","https://opendata.rdw.nl/resource/vezc-m2t6.json","https://opendata.rdw.nl/resource/jhie-znh9.json","https://opendata.rdw.nl/resource/kmfi-hrps.json"
"RT627L","Personenauto","BMW","M550D XDRIVE","20230131",,"24515","stationwagen","5","WIT","Niet geregistreerd","6","2993","1930","2620","2030","750","2000","20180131","20180131","Geen verstrekking in Open Data","144796","Nee",,,,,,,"4","4","0","0",,"496","0","M1",,,"in motorruimte r.","2620","G5K",,"e1*2007/46*1750*02","JN91","CA150000","0","0.14","298","Ja","Nee",,"Nee","4710","0","0.00","2022","Logisch","00","Nee","2023-01-31T00:00:00.000",,"2018-01-31T00:00:00.000","2018-01-31T00:00:00.000",,,,,,,,,,,,,,,,,,,,,"G",,,,,,,"https://opendata.rdw.nl/resource/3huj-srit.json","https://opendata.rdw.nl/resource/8ys7-d773.json","https://opendata.rdw.nl/resource/vezc-m2t6.json","https://opendata.rdw.nl/resource/jhie-znh9.json","https://opendata.rdw.nl/resource/kmfi-hrps.json"
"SG890D","Personenauto","BMW","M550D XDRIVE","20240504",,"20294","sedan","5","ZWART","Niet geregistreerd","6","2993","1820","2470","1920","750","2000","20180328","20180328","Geen verstrekking in Open Data","153310","Nee",,,,,,,"4","4","0","0",,"496","187","M1",,,"in motorruimte r.","2470","G5L",,"e1*2007/46*1688*03","JD71","CA250800","0","0.15","298","Ja","Nee",,"Nee","4560","0","0.00","2023","Logisch","00","Nee","2024-05-04T00:00:00.000",,"2018-03-28T00:00:00.000","2018-03-28T00:00:00.000",,,,,,,,,,,"147",,,,,,,,,,"G",,,,,,,"https://opendata.rdw.nl/resource/3huj-srit.json","https://opendata.rdw.nl/resource/8ys7-d773.json","https://opendata.rdw.nl/resource/vezc-m2t6.json","https://opendata.rdw.nl/resource/jhie-znh9.json","https://opendata.rdw.nl/resource/kmfi-hrps.json"
"TH251L","Personenauto","BMW","M550D XDRIVE","20230803",,"28878","stationwagen","5","GRIJS","Niet geregistreerd","6","2993","1930","2620","2030","750","2000","20180803","20180803","Geen verstrekking in Open Data","140270","Nee",,,,,,,"4","4","0","0",,"496","186","M1",,,,"2620","G5K",,"e1*2007/46*1750*04","JN91","CAW50000","0","0.14","298","Ja","Nee",,"Nee","4620","0","0.00","2023","Logisch","00","Nee","2023-08-03T00:00:00.000",,"2018-08-03T00:00:00.000","2018-08-03T00:00:00.000",,,,,,,,,,,"148",,,,,,,,,,,,,,,,,"https://opendata.rdw.nl/resource/3huj-srit.json","https://opendata.rdw.nl/resource/8ys7-d773.json","https://opendata.rdw.nl/resource/vezc-m2t6.json","https://opendata.rdw.nl/resource/jhie-znh9.json","https://opendata.rdw.nl/resource/kmfi-hrps.json"
"TZ980G","Personenauto","BMW","M550D XDRIVE","20230326",,"21883","stationwagen","5","ZWART","Niet geregistreerd","6","2993","1930","2620","2030","750","2000","20180326","20181115","Geen verstrekking in Open Data","148856","Nee",,,,,,,"4","4","0","0",,"496","0","M1",,,,"2620","G5K",,"e1*2007/46*1750*03","JN91","CAW50000","0","0.14","298","Ja","Nee",,"Nee","4620","0","0.00","2022","Geen oordeel","05","Nee","2023-03-26T00:00:00.000",,"2018-03-26T00:00:00.000","2018-11-15T00:00:00.000",,,,,,,,,,,,,,,,,,,,,,,,,,,,"https://opendata.rdw.nl/resource/3huj-srit.json","https://opendata.rdw.nl/resource/8ys7-d773.json","https://opendata.rdw.nl/resource/vezc-m2t6.json","https://opendata.rdw.nl/resource/jhie-znh9.json","https://opendata.rdw.nl/resource/kmfi-hrps.json"
"XK215L","Personenauto","BMW","M550D XDRIVE","20240721",,"20739","stationwagen","5","BLAUW","Niet geregistreerd","6","2993","1930","2620","2030","750","2000","20180622","20190911","Geen verstrekking in Open Data","142740","Nee",,,,,,,"4","4","0","0",,"496","0","M1",,,,"2620","G5K",,"e1*2007/46*1750*03","JN91","CAW50000","0","0.14","298","Ja","Nee",,"Nee","4620","0","0.00","2024","Geen oordeel","05","Nee","2024-07-21T00:00:00.000",,"2018-06-22T00:00:00.000","2019-09-11T00:00:00.000",,,,,,,,,,,,,,,,,,,,,,,,,,,,"https://opendata.rdw.nl/resource/3huj-srit.json","https://opendata.rdw.nl/resource/8ys7-d773.json","https://opendata.rdw.nl/resource/vezc-m2t6.json","https://opendata.rdw.nl/resource/jhie-znh9.json","https://opendata.rdw.nl/resource/kmfi-hrps.json"
"XT097H","Personenauto","BMW","M550D XDRIVE","20240331",,"24936","sedan","5","GRIJS","Niet geregistreerd","6","2993","1835","2470","1935","750","2000","20190325","20190325","Geen verstrekking in Open Data","144329","Nee",,,,,,,"4","4","0","0",,"496","186","M1",,,,"2470","G5L",,"e1*2007/46*1688*07","JD71","DAW50000","0","0.15","298","Ja","Nee",,"Nee","4470","0","0.00","2023","Logisch","00","Nee","2024-03-31T00:00:00.000",,"2019-03-25T00:00:00.000","2019-03-25T00:00:00.000",,,,,,,,,,,"146",,,,,,,,,,,,,,,,,"https://opendata.rdw.nl/resource/3huj-srit.json","https://opendata.rdw.nl/resource/8ys7-d773.json","https://opendata.rdw.nl/resource/vezc-m2t6.json","https://opendata.rdw.nl/resource/jhie-znh9.json","https://opendata.rdw.nl/resource/kmfi-hrps.json"
"XZ379K","Personenauto","BMW","M550D XDRIVE","20240201",,"30110","stationwagen","5","GRIJS","Niet geregistreerd","6","2993","1930","2620","2030","750","2000","20190412","20190412","Geen verstrekking in Open Data","163200","Nee",,,,,,,"4","4","0","0",,"496","186","M1",,,,"2620","G5K",,"e1*2007/46*1750*03","JN91","CAW50000","0","0.14","298","Ja","Nee",,"Nee","4620","0","0.00","2024","Logisch","00","Nee","2024-02-01T00:00:00.000",,"2019-04-12T00:00:00.000","2019-04-12T00:00:00.000",,,,,,,,,,,"148",,,,,,,,,,,,,,,,,"https://opendata.rdw.nl/resource/3huj-srit.json","https://opendata.rdw.nl/resource/8ys7-d773.json","https://opendata.rdw.nl/resource/vezc-m2t6.json","https://opendata.rdw.nl/resource/jhie-znh9.json","https://opendata.rdw.nl/resource/kmfi-hrps.json"
