"kenteken","voertuigsoort","merk","handelsbenaming","vervaldatum_apk","datum_tenaamstelling","bruto_bpm","inrichting","aantal_zitplaatsen","eerste_kleur","tweede_kleur","aantal_cilinders","cilinderinhoud","massa_ledig_voertuig","toegestane_maximum_massa_voertuig","massa_rijklaar","maximum_massa_trekken_ongeremd","maximum_trekken_massa_geremd","datum_eerste_toelating","datum_eerste_tenaamstelling_in_nederland","wacht_op_keuren","catalogusprijs","wam_verzekerd","maximale_constructiesnelheid","laadvermogen","oplegger_geremd","aanhangwagen_autonoom_geremd","aanhangwagen_middenas_geremd","aantal_staanplaatsen","aantal_deuren","aantal_wielen","afstand_hart_koppeling_tot_achterzijde_voertuig","afstand_voorzijde_voertuig_tot_hart_koppeling","afwijkende_maximum_snelheid","lengte","breedte","europese_voertuigcategorie","europese_voertuigcategorie_toevoeging","europese_uitvoeringcategorie_toevoeging","plaats_chassisnummer","technische_max_massa_voertuig","type","type_gasinstallatie","typegoedkeuringsnummer","variant","uitvoering","volgnummer_wijziging_eu_typegoedkeuring","vermogen_massarijklaar","wielbasis","export_indicator","openstaande_terugroepactie_indicator","vervaldatum_tachograaf","taxi_indicator","maximum_massa_samenstelling","aantal_rolstoelplaatsen","maximum_ondersteunende_snelheid","jaar_laatste_registratie_tellerstand","tellerstandoordeel","code_toelichting_tellerstandoordeel","tenaamstellen_mogelijk","vervaldatum_apk_dt","datum_tenaamstelling_dt","datum_eerste_toelating_dt","datum_eerste_tenaamstelling_in_nederland_dt","vervaldatum_tachograaf_dt","maximum_last_onder_de_vooras_sen_tezamen_koppeling","type_remsysteem_voertuig_code","rupsonderstelconfiguratiecode","wielbasis_voertuig_minimum","wielbasis_voertuig_maximum","lengte_voertuig_minimum","lengte_voertuig_maximum","breedte_voertuig_minimum","breedte_voertuig_maximum","hoogte_voertuig","hoogte_voertuig_minimum","hoogte_voertuig_maximum","massa_bedrijfsklaar_minimaal","massa_bedrijfsklaar_maximaal","technisch_toelaatbaar_massa_koppelpunt","maximum_massa_technisch_maximaal","maximum_massa_technisch_minimaal","subcategorie_nederland","verticale_belasting_koppelpunt_getrokken_voertuig","zuinigheidsclassificatie","registratie_datum_goedkeuring_afschrijvingsmoment_bpm","registratie_datum_goedkeuring_afschrijvingsmoment_bpm_dt","gem_lading_wrde","aerodyn_voorz","massa_alt_aandr","verl_cab_ind","api_gekentekende_voertuigen_assen","api_gekentekende_voertuigen_brandstof","api_gekentekende_voertuigen_carrosserie","api_gekentekende_voertuigen_carrosserie_specifiek","api_gekentekende_voertuigen_voertuigklasse"
"J588NS","Personenauto","BMW","330E IPERFORMANCE","20241203",,"435","sedan","5","GRIJS","Niet geregistreerd","4","1998","1635","2195","1735",,,"20161121","20200916","Geen verstrekking in Open Data","44787","Nee","225",,,,,,"4","4","0","0",,"463","181","M1",,,,"2195","3L",,"e1*2007/46*0314*20","8E11","6A350000","0","0.03","281","Ja","Nee",,"Nee","0","0","0.00","2024","Geen oordeel","05","Nee","2024-12-03T00:00:00.000",,"2016-11-21T00:00:00.000","2020-09-16T00:00:00.000",,,,,,,,,,,"143",,,,,,,,,,"A",,,,,,,"https://opendata.rdw.nl/resource/3huj-srit.json","https://opendata.rdw.nl/resource/8ys7-d773.json","https://opendata.rdw.nl/resource/vezc-m2t6.json","https://opendata.rdw.nl/resource/jhie-znh9.json","https://opendata.rdw.nl/resource/kmfi-hrps.json"
"JZ300X","Personenauto","BMW","330E IPERFORMANCE","20240719",,"469","sedan","5","ZWART","Niet geregistreerd","4","1998","1635","2195","1735",,,"20160719","20160719","Geen verstrekking in Open Data","64239","Nee",,,,,,,"4","4","0","0",,"463","181","M1",,,"in motorruimte r.","2195","3L",,"e1*2007/46*0314*20","8E11","6A350000","0","0.08","281","Ja","Nee",,"Nee","0","0","0.00","2023","Logisch","00","Nee","2024-07-19T00:00:00.000",,"2016-07-19T00:00:00.000","2016-07-19T00:00:00.000",,,,,,,,,,,"143",,,,,,,,,,"A",,,,,,,"https://opendata.rdw.nl/resource/3huj-srit.json","https://opendata.rdw.nl/resource/8ys7-d773.json","https://opendata.rdw.nl/resource/vezc-m2t6.json","https://opendata.rdw.nl/resource/jhie-znh9.json","https://opendata.rdw.nl/resource/kmfi-hrps.json"
"JZ383T","Personenauto","BMW","330E IPERFORMANCE","20240509","20240508","469","sedan","5","BLAUW","Niet geregistreerd","4","1998","1635","2195","1735",,,"20160721","20160721","Geen verstrekking in Open Data","61265","Nee",,,,,,,"4","4","0","0",,"463","181","M1",,,"in motorruimte r.","2195","3L",,"e1*2007/46*0314*20","8E11","6A350000","0","0.08","281","Ja","Nee",,"Nee","0","0","0.00","2024","Logisch","00","Nee","2024-05-09T00:00:00.000","2024-05-08T00:00:00.000","2016-07-21T00:00:00.000","2016-07-21T00:00:00.000",,,,,,,,,,,"143",,,,,,,,,,"A",,,,,,,"https://opendata.rdw.nl/resource/3huj-srit.json","https://opendata.rdw.nl/resource/8ys7-d773.json","https://opendata.rdw.nl/resource/vezc-m2t6.json","https://opendata.rdw.nl/resource/jhie-znh9.json","https://opendata.rdw.nl/resource/kmfi-hrps.json"
"KB914F","Personenauto","BMW","330E IPERFORMANCE","20240721",,"445","sedan","5","WIT","Niet geregistreerd","4","1998","1635","2195","1735",,,"20160721","20160721","Geen verstrekking in Open Data","54062","Nee",,,,,,,"4","4","0","0",,"463","181","M1",,,"in motorruimte r.","2195","3L",,"e1*2007/46*0314*20","8E11","6A250000","0","0.08","281","Ja","Nee",,"Nee","0","0","0.00","2023","Logisch","00","Nee","2024-07-21T00:00:00.000",,"2016-07-21T00:00:00.000","2016-07-21T00:00:00.000",,,,,,,,,,,"143",,,,,,,,,,"A",,,,,,,"https://opendata.rdw.nl/resource/3huj-srit.json","https://opendata.rdw.nl/resource/8ys7-d773.json","https://opendata.rdw.nl/resource/vezc-m2t6.json","https://opendata.rdw.nl/resource/jhie-znh9.json","https://opendata.rdw.nl/resource/kmfi-hrps.json"
"KD282V","Personenauto","BMW","330E IPERFORMANCE","20240812",,"445","sedan","5","ZWART","Niet geregistreerd","4","1998","1635","2195","1735",,,"20160812","20160812","Geen verstrekking in Open Data","59381","Nee",,,,,,,"4","4","0","0",,"463","181","M1",,,"in motorruimte r.","2195","3L",,"e1*2007/46*0314*20","8E11","6A250000","0","0.08","281","Ja","Nee",,"Nee","0","0","0.00","2022","Logisch","00","Nee","2024-08-12T00:00:00.000",,"2016-08-12T00:00:00.000","2016-08-12T00:00:00.000",,,,,,,,,,,"143",,,,,,,,,,"A",,,,,,,"https://opendata.rdw.nl/resource/3huj-srit.json","https://opendata.rdw.nl/resource/8ys7-d773.json","https://opendata.rdw.nl/resource/vezc-m2t6.json","https://opendata.rdw.nl/resource/jhie-znh9.json","https://opendata.rdw.nl/resource/kmfi-hrps.json"
"KG298B","Personenauto","BMW","330E IPERFORMANCE","20240824","20240215","469","sedan","5","ZWART","Niet geregistreerd","4","1998","1635","2195","1735",,,"20160824","20160824","Geen verstrekking in Open Data","66372","Ja",,,,,,,"4","4","0","0",,"463","181","M1",,,"in motorruimte r.","2195","3L",,"e1*2007/46*0314*20","8E11","6A350700","0","0.08","281","Ja","Nee",,"Nee","0","0","0.00","2024","Logisch","00","Nee","2024-08-24T00:00:00.000","2024-02-15T00:00:00.000","2016-08-24T00:00:00.000","2016-08-24T00:00:00.000",,,,,,,,,,,"143",,,,,,,,,,"A",,,,,,,"https://opendata.rdw.nl/resource/3huj-srit.json","https://opendata.rdw.nl/resource/8ys7-d773.json","https://opendata.rdw.nl/resource/vezc-m2t6.json","https://opendata.rdw.nl/resource/jhie-znh9.json","https://opendata.rdw.nl/resource/kmfi-hrps.json"
"KG698J","Personenauto","BMW","330E IPERFORMANCE",,,"469","sedan","5","WIT","Niet geregistreerd","4","1998","1635","2195","1735",,,"20160831","20160831","Geen verstrekking in Open Data","52628","Nee",,,,,,,"4","4","0","0",,"463","0","M1",,,"in motorruimte r.","2195","3L",,"e1*2007/46*0314*20","8E11","6A350000","0","0.08","281","Ja","Nee",,"Nee","0","0","0.00","2022","Logisch","00","Nee",,,"2016-08-31T00:00:00.000","2016-08-31T00:00:00.000",,,,,,,,,,,,,,,,,,,,,"A",,,,,,,"https://opendata.rdw.nl/resource/3huj-srit.json","https://opendata.rdw.nl/resource/8ys7-d773.json","https://opendata.rdw.nl/resource/vezc-m2t6.json","https://opendata.rdw.nl/resource/jhie-znh9.json","https://opendata.rdw.nl/resource/kmfi-hrps.json"
"KH385R","Personenauto","BMW","330E IPERFORMANCE","20240523",,"469","sedan","5","BLAUW","Niet geregistreerd","4","1998","1635","2195","1735",,,"20160914","20160914","Geen verstrekking in Open Data","55563","Nee",,,,,,,"4","4","0","0",,"463","181","M1",,,"in motorruimte r.","2195","3L",,"e1*2007/46*0314*20","8E11","6A350000","0","0.08","281","Ja","Nee",,"Nee","0","0","0.00","2022","Logisch","00","Nee","2024-05-23T00:00:00.000",,"2016-09-14T00:00:00.000","2016-09-14T00:00:00.000",,,,,,,,,,,"143",,,,,,,,,,"A",,,,,,,"https://opendata.rdw.nl/resource/3huj-srit.json","https://opendata.rdw.nl/resource/8ys7-d773.json","https://opendata.rdw.nl/resource/vezc-m2t6.json","https://opendata.rdw.nl/resource/jhie-znh9.json","https://opendata.rdw.nl/resource/kmfi-hrps.json"
"KH703V","Personenauto","BMW","330E IPERFORMANCE",,,"469","sedan","5","WIT","Niet geregistreerd","4","1998","1635","2195","1735",,,"20160923","20160923","Geen verstrekking in Open Data","50118","Nee",,,,,,,"4","4","0","0",,"463","0","M1",,,"in motorruimte r.","2195","3L",,"e1*2007/46*0314*20","8E11","6A350000","0","0.08","281","Ja","Nee",,"Nee","0","0","0.00","2022","Logisch","00","Nee",,,"2016-09-23T00:00:00.000","2016-09-23T00:00:00.000",,,,,,,,,,,,,,,,,,,,,"A",,,,,,,"https://opendata.rdw.nl/resource/3huj-srit.json","https://opendata.rdw.nl/resource/8ys7-d773.json","https://opendata.rdw.nl/resource/vezc-m2t6.json","https://opendata.rdw.nl/resource/jhie-znh9.json","https://opendata.rdw.nl/resource/kmfi-hrps.json"
"KJ548S","Personenauto","BMW","330E IPERFORMANCE",,,"445","sedan","5","ZWART","Niet geregistreerd","4","1998","1635","2195","1735",,,"20160926","20160926","Geen verstrekking in Open Data","48853","Nee",,,,,,,"4","4","0","0",,"463","0","M1",,,"in motorruimte r.","2195","3L",,"e1*2007/46*0314*20","8E11","6A250000","0","0.08","281","Ja","Nee",,"Nee","0","0","0.00","2022","Logisch","00","Nee",,,"2016-09-26T00:00:00.000","2016-09-26T00:00:00.000",,,,,,,,,,,,,,,,,,,,,"A",,,,,,,"https://opendata.rdw.nl/resource/3huj-srit.json","https://opendata.rdw.nl/resource/8ys7-d773.json","https://opendata.rdw.nl/resource/vezc-m2t6.json","https://opendata.rdw.nl/resource/jhie-znh9.json","https://opendata.rdw.nl/resource/kmfi-hrps.json"
"KJ915V","Personenauto","BMW","330E IPERFORMANCE",,,"469","sedan","5","GRIJS","Niet geregistreerd","4","1998","1635","2195","1735",,,"20160929","20160929","Geen verstrekking in Open Data","54507","Nee",,,,,,,"4","4","0","0",,"463","0","M1",,,"in motorruimte r.","2195","3L",,"e1*2007/46*0314*20","8E11","6A350000","0","0.08","281","Ja","Nee",,"Nee","0","0","0.00","2022","Logisch","00","Nee",,,"2016-09-29T00:00:00.000","2016-09-29T00:00:00.000",,,,,,,,,,,,,,,,,,,,,"A",,,,,,,"https://opendata.rdw.nl/resource/3huj-srit.json","https://opendata.rdw.nl/resource/8ys7-d773.json","https://opendata.rdw.nl/resource/vezc-m2t6.json","https://opendata.rdw.nl/resource/jhie-znh9.json","https://opendata.rdw.nl/resource/kmfi-hrps.json"
"KJ958N","Personenauto","BMW","330E IPERFORMANCE","20240327",,"469","sedan","5","GRIJS","Niet geregistreerd","4","1998","1635","2195","1735",,,"20161004","20161004","Geen verstrekking in Open Data","59416","Nee",,,,,,,"4","4","0","0",,"463","181","M1",,,"in motorruimte r.","2195","3L",,"e1*2007/46*0314*20","8E11","6A350700","0","0.08","281","Ja","Nee",,"Nee","0","0","0.00","2023","Logisch","00","Nee","2024-03-27T00:00:00.000",,"2016-10-04T00:00:00.000","2016-10-04T00:00:00.000",,,,,,,,,,,"143",,,,,,,,,,"A",,,,,,,"https://opendata.rdw.nl/resource/3huj-srit.json","https://opendata.rdw.nl/resource/8ys7-d773.json","https://opendata.rdw.nl/resource/vezc-m2t6.json","https://opendata.rdw.nl/resource/jhie-znh9.json","https://opendata.rdw.nl/resource/kmfi-hrps.json"
"KJ967N","Personenauto","BMW","330E IPERFORMANCE","20231012",,"445","sedan","5","WIT","Niet geregistreerd","4","1998","1635","2195","1735",,,"20161001","20161001","Geen verstrekking in Open Data","52587","Nee",,,,,,,"4","4","0","0",,"463","181","M1",,,"in motorruimte r.","2195","3L",,"e1*2007/46*0314*20","8E11","6A250000","0","0.08","281","Ja","Nee",,"Nee","0","0","0.00","2023","Logisch","00","Nee","2023-10-12T00:00:00.000",,"2016-10-01T00:00:00.000","2016-10-01T00:00:00.000",,,,,,,,,,,"143",,,,,,,,,,"A",,,,,,,"https://opendata.rdw.nl/resource/3huj-srit.json","https://opendata.rdw.nl/resource/8ys7-d773.json","https://opendata.rdw.nl/resource/vezc-m2t6.json","https://opendata.rdw.nl/resource/jhie-znh9.json","https://opendata.rdw.nl/resource/kmfi-hrps.json"
"KJ977N","Personenauto","BMW","330E IPERFORMANCE","20241026","20240216","469","sedan","5","ZWART","Niet geregistreerd","4","1998","1635","2195","1735",,,"20160923","20160923","Geen verstrekking in Open Data","61410","Ja",,,,,,,"4","4","0","0",,"463","181","M1",,,"in motorruimte r.","2195","3L",,"e1*2007/46*0314*20","8E11","6A350000","0","0.08","281","Ja","Nee",,"Nee","0","0","0.00","2024","Logisch","00","Nee","2024-10-26T00:00:00.000","2024-02-16T00:00:00.000","2016-09-23T00:00:00.000","2016-09-23T00:00:00.000",,,,,,,,,,,"143",,,,,,,,,,"A",,,,,,,"https://opendata.rdw.nl/resource/3huj-srit.json","https://opendata.rdw.nl/resource/8ys7-d773.json","https://opendata.rdw.nl/resource/vezc-m2t6.json","https://opendata.rdw.nl/resource/jhie-znh9.json","https://opendata.rdw.nl/resource/kmfi-hrps.json"
"KK491G","Personenauto","BMW","330E IPERFORMANCE",,,"469","sedan","5","GRIJS","Niet geregistreerd","4","1998","1635","2195","1735",,,"20161017","20161017","Geen verstrekking in Open Data","62990","Nee",,,,,,,"4","4","0","0",,"463","0","M1",,,"in motorruimte r.","2195","3L",,"e1*2007/46*0314*20","8E11","6A350700","0","0.08","281","Ja","Nee",,"Nee","0","0","0.00","2022","Logisch","00","Nee",,,"2016-10-17T00:00:00.000","2016-10-17T00:00:00.000",,,,,,,,,,,,,,,,,,,,,"A",,,,,,,"https://opendata.rdw.nl/resource/3huj-srit.json","https://opendata.rdw.nl/resource/8ys7-d773.json","https://opendata.rdw.nl/resource/vezc-m2t6.json","https://opendata.rdw.nl/resource/jhie-znh9.json","https://opendata.rdw.nl/resource/kmfi-hrps.json"
"KK806L","Personenauto","BMW","330E IPERFORMANCE","20241003",,"469","sedan","5","ZWART","Niet geregistreerd","4","1998","1635","2195","1735",,,"20161003","20161003","Geen verstrekking in Open Data","55947","Nee",,,,,,,"4","4","0","0",,"463","181","M1",,,"in motorruimte r.","2195","3L",,"e1*2007/46*0314*20","8E11","6A350000","0","0.08","281","Ja","Nee",,"Nee","0","0","0.00","2022","Logisch","00","Nee","2024-10-03T00:00:00.000",,"2016-10-03T00:00:00.000","2016-10-03T00:00:00.000",,,,,,,,,,,"143",,,,,,,,,,"A",,,,,,,"https://opendata.rdw.nl/resource/3huj-srit.json","https://opendata.rdw.nl/resource/8ys7-d773.json","https://opendata.rdw.nl/resource/vezc-m2t6.json","https://opendata.rdw.nl/resource/jhie-znh9.json","https://opendata.rdw.nl/resource/kmfi-hrps.json"
"KL380Z","Personenauto","BMW","330E IPERFORMANCE","20241013",,"445","sedan","5","GRIJS","Niet geregistreerd","4","1998","1635","2195","1735",,,"20161013","20161013","Geen verstrekking in Open Data","50134","Nee",,,,,,,"4","4","0","0",,"463","181","M1",,,"in motorruimte r.","2195","3L",,"e1*2007/46*0314*20","8E11","6A250000","0","0.08","281","Ja","Nee",,"Nee","0","0","0.00","2023","Logisch","00","Nee","2024-10-13T00:00:00.000",,"2016-10-13T00:00:00.000","2016-10-13T00:00:00.000",,,,,,,,,,,"143",,,,,,,,,,"A",,,,,,,"https://opendata.rdw.nl/resource/3huj-srit.json","https://opendata.rdw.nl/resource/8ys7-d773.json","https://opendata.rdw.nl/resource/vezc-m2t6.json","https://opendata.rdw.nl/resource/jhie-znh9.json","https://opendata.rdw.nl/resource/kmfi-hrps.json"
"KN140T","Personenauto","BMW","330E IPERFORMANCE",,,"469","sedan","5","ZWART","Niet geregistreerd","4","1998","1635","2195","1735",,,"20161021","20161021","Geen verstrekking in Open Data","54558","Nee",,,,,,,"4","4","0","0",,"463","0","M1",,,"in motorruimte r.","2195","3L",,"e1*2007/46*0314*20","8E11","6A350000","0","0.08","281","Ja","Nee",,"Nee","0","0","0.00","2022","Logisch","00","Nee",,,"2016-10-21T00:00:00.000","2016-10-21T00:00:00.000",,,,,,,,,,,,,,,,,,,,,"A",,,,,,,"https://opendata.rdw.nl/resource/3huj-srit.json","https://opendata.rdw.nl/resource/8ys7-d773.json","https://opendata.rdw.nl/resource/vezc-m2t6.json","https://opendata.rdw.nl/resource/jhie-znh9.json","https://opendata.rdw.nl/resource/kmfi-hrps.json"
"KN189G","Personenauto","BMW","330E IPERFORMANCE","20241020",,"469","sedan","5","ZWART","Niet geregistreerd","4","1998","1635","2195","1735",,,"20161020","20161020","Geen verstrekking in Open Data","58271","Nee",,,,,,,"4","4","0","0",,"463","181","M1",,,"in motorruimte r.","2195","3L",,"e1*2007/46*0314*20","8E11","6A350000","0","0.08","281","Ja","Nee",,"Nee","0","0","0.00","2023","Logisch","00","Nee","2024-10-20T00:00:00.000",,"2016-10-20T00:00:00.000","2016-10-20T00:00:00.000",,,,,,,,,,,"143",,,,,,,,,,"A",,,,,,,"https://opendata.rdw.nl/resource/3huj-srit.json","https://opendata.rdw.nl/resource/8ys7-d773.json","https://opendata.rdw.nl/resource/vezc-m2t6.json","https://opendata.rdw.nl/resource/jhie-znh9.json","https://opendata.rdw.nl/resource/kmfi-hrps.json"
"KN192G","Personenauto","BMW","330E IPERFORMANCE",,,"469","sedan","5","GRIJS","Niet geregistreerd","4","1998","1635","2195","1735",,,"20161026","20161026","Geen verstrekking in Open Data","53378","Nee",,,,,,,"4","4","0","0",,"463","0","M1",,,"in motorruimte r.","2195","3L",,"e1*2007/46*0314*20","8E11","6A350000","0","0.08","281","Ja","Nee",,"Nee","0","0","0.00","2022","Logisch","00","Nee",,,"2016-10-26T00:00:00.000","2016-10-26T00:00:00.000",,,,,,,,,,,,,,,,,,,,,"A",,,,,,,"https://opendata.rdw.nl/resource/3huj-srit.json","https://opendata.rdw.nl/resource/8ys7-d773.json","https://opendata.rdw.nl/resource/vezc-m2t6.json","https://opendata.rdw.nl/resource/jhie-znh9.json","https://opendata.rdw.nl/resource/kmfi-hrps.json"
"KP252F","Personenauto","BMW","330E IPERFORMANCE",,,"469","sedan","5","WIT","Niet geregistreerd","4","1998","1635","2195","1735",,,"20161027","20161027","Geen verstrekking in Open Data","53608","Nee",,,,,,,"4","4","0","0",,"463","0","M1",,,"in motorruimte r.","2195","3L",,"e1*2007/46*0314*20","8E11","6A350000","0","0.08","281","Ja","Nee",,"Nee","0","0","0.00","2022","Logisch","00","Nee",,,"2016-10-27T00:00:00.000","2016-10-27T00:00:00.000",,,,,,,,,,,,,,,,,,,,,"A",,,,,,,"https://opendata.rdw.nl/resource/3huj-srit.json","https://opendata.rdw.nl/resource/8ys7-d773.json","https://opendata.rdw.nl/resource/vezc-m2t6.json","https://opendata.rdw.nl/resource/jhie-znh9.json","https://opendata.rdw.nl/resource/kmfi-hrps.json"
"KP392R","Personenauto","BMW","330E IPERFORMANCE",,,"445","sedan","5","GRIJS","Niet geregistreerd","4","1998","1635","2195","1735",,,"20161103","20161103","Geen verstrekking in Open Data","54466","Nee",,,,,,,"4","4","0","0",,"463","0","M1",,,"in motorruimte r.","2195","3L",,"e1*2007/46*0314*20","8E11","6A250000","0","0.08","281","Ja","Nee",,"Nee","0","0","0.00","2022","Logisch","00","Nee",,,"2016-11-03T00:00:00.000","2016-11-03T00:00:00.000",,,,,,,,,,,,,,,,,,,,,"A",,,,,,,"https://opendata.rdw.nl/resource/3huj-srit.json","https://opendata.rdw.nl/resource/8ys7-d773.json","https://opendata.rdw.nl/resource/vezc-m2t6.json","https://opendata.rdw.nl/resource/jhie-znh9.json","https://opendata.rdw.nl/resource/kmfi-hrps.json"
"KP660H","Personenauto","BMW","330E IPERFORMANCE","20241115","20240402","445","sedan","5","WIT","Niet geregistreerd","4","1998","1635","2195","1735",,,"20161101","20161101","Geen verstrekking in Open Data","46727","Ja",,,,,,,"4","4","0","0",,"463","181","M1",,,"in motorruimte r.","2195","3L",,"e1*2007/46*0314*20","8E11","6A250000","0","0.08","281","Ja","Nee",,"Nee","0","0","0.00","2024","Logisch","00","Nee","2024-11-15T00:00:00.000","2024-04-02T00:00:00.000","2016-11-01T00:00:00.000","2016-11-01T00:00:00.000",,,,,,,,,,,"143",,,,,,,,,,"A",,,,,,,"https://opendata.rdw.nl/resource/3huj-srit.json","https://opendata.rdw.nl/resource/8ys7-d773.json","https://opendata.rdw.nl/resource/vezc-m2t6.json","https://opendata.rdw.nl/resource/jhie-znh9.json","https://opendata.rdw.nl/resource/kmfi-hrps.json"
"KR127P","Personenauto","BMW","330E IPERFORMANCE","20241117",,"469","sedan","5","BRUIN","Niet geregistreerd","4","1998","1635","2195","1735",,,"20161014","20161103","Geen verstrekking in Open Data","53012","Nee",,,,,,,"4","4","0","0",,"463","0","M1",,,"r. motorruimte","2195","3L",,"e1*2007/46*0314*20","8E11","6A350000","0","0.03","281","Ja","Nee",,"Nee","0","0","0.00","2023","Logisch","00","Nee","2024-11-17T00:00:00.000",,"2016-10-14T00:00:00.000","2016-11-03T00:00:00.000",,,,,,,,,,,,,,,,,,,,,"A",,,,,,,"https://opendata.rdw.nl/resource/3huj-srit.json","https://opendata.rdw.nl/resource/8ys7-d773.json","https://opendata.rdw.nl/resource/vezc-m2t6.json","https://opendata.rdw.nl/resource/jhie-znh9.json","https://opendata.rdw.nl/resource/kmfi-hrps.json"
"KR234J","Personenauto","BMW","330E IPERFORMANCE",,,"469","sedan","5","GRIJS","Niet geregistreerd","4","1998","1635","2195","1735",,,"20161203","20161203","Geen verstrekking in Open Data","50842","Nee",,,,,,,"4","4","0","0",,"463","0","M1",,,"in motorruimte r.","2195","3L",,"e1*2007/46*0314*20","8E11","6A350000","0","0.08","281","Ja","Nee",,"Nee","0","0","0.00","2022","Logisch","00","Nee",,,"2016-12-03T00:00:00.000","2016-12-03T00:00:00.000",,,,,,,,,,,,,,,,,,,,,"A",,,,,,,"https://opendata.rdw.nl/resource/3huj-srit.json","https://opendata.rdw.nl/resource/8ys7-d773.json","https://opendata.rdw.nl/resource/vezc-m2t6.json","https://opendata.rdw.nl/resource/jhie-znh9.json","https://opendata.rdw.nl/resource/kmfi-hrps.json"
"KR705N","Personenauto","BMW","330E IPERFORMANCE","20231027",,"469","sedan","5","ZWART","Niet geregistreerd","4","1998","1635","2195","1735",,,"20161104","20161104","Geen verstrekking in Open Data","63707","Nee",,,,,,,"4","4","0","0",,"463","0","M1",,,"in motorruimte r.","2195","3L",,"e1*2007/46*0314*20","8E11","6A350700","0","0.08","281","Ja","Nee",,"Nee","0","0","0.00","2022","Logisch","00","Nee","2023-10-27T00:00:00.000",,"2016-11-04T00:00:00.000","2016-11-04T00:00:00.000",,,,,,,,,,,,,,,,,,,,,"A",,,,,,,"https://opendata.rdw.nl/resource/3huj-srit.json","https://opendata.rdw.nl/resource/8ys7-d773.json","https://opendata.rdw.nl/resource/vezc-m2t6.json","https://opendata.rdw.nl/resource/jhie-znh9.json","https://opendata.rdw.nl/resource/kmfi-hrps.json"
"KR975K","Personenauto","BMW","330E IPERFORMANCE","20231123",,"469","sedan","5","ZWART","Niet geregistreerd","4","1998","1635","2195","1735",,,"20161104","20161104","Geen verstrekking in Open Data","66937","Nee",,,,,,,"4","4","0","0",,"463","181","M1",,,"in motorruimte r.","2195","3L",,"e1*2007/46*0314*20","8E11","6A350700","0","0.08","281","Ja","Nee",,"Nee","0","0","0.00","2023","Logisch","00","Nee","2023-11-23T00:00:00.000",,"2016-11-04T00:00:00.000","2016-11-04T00:00:00.000",,,,,,,,,,,"143",,,,,,,,,,"A","20220830","2022-08-30T00:00:00.000",,,,,"https://opendata.rdw.nl/resource/3huj-srit.json","https://opendata.rdw.nl/resource/8ys7-d773.json","https://opendata.rdw.nl/resource/vezc-m2t6.json","https://opendata.rdw.nl/resource/jhie-znh9.json","https://opendata.rdw.nl/resource/kmfi-hrps.json"
"KS255K","Personenauto","BMW","330E IPERFORMANCE",,,"445","sedan","5","BRUIN","Niet geregistreerd","4","1998","1635","2195","1735",,,"20161123","20161123","Geen verstrekking in Open Data","52320","Nee",,,,,,,"4","4","0","0",,"463","181","M1",,,"in motorruimte r.","2195","3L",,"e1*2007/46*0314*20","8E11","6A250000","0","0.08","281","Ja","Nee",,"Nee","0","0","0.00","2022","Logisch","00","Nee",,,"2016-11-23T00:00:00.000","2016-11-23T00:00:00.000",,,,,,,,,,,"143",,,,,,,,,,"A",,,,,,,"https://opendata.rdw.nl/resource/3huj-srit.json","https://opendata.rdw.nl/resource/8ys7-d773.json","https://opendata.rdw.nl/resource/vezc-m2t6.json","https://opendata.rdw.nl/resource/jhie-znh9.json","https://opendata.rdw.nl/resource/kmfi-hrps.json"