"kenteken","voertuigsoort","merk","handelsbenaming","vervaldatum_apk","datum_tenaamstelling","bruto_bpm","inrichting","aantal_zitplaatsen","eerste_kleur","tweede_kleur","aantal_cilinders","cilinderinhoud","massa_ledig_voertuig","toegestane_maximum_massa_voertuig","massa_rijklaar","maximum_massa_trekken_ongeremd","maximum_trekken_massa_geremd","datum_eerste_toelating","datum_eerste_tenaamstelling_in_nederland","wacht_op_keuren","catalogusprijs","wam_verzekerd","maximale_constructiesnelheid","laadvermogen","oplegger_geremd","aanhangwagen_autonoom_geremd","aanhangwagen_middenas_geremd","aantal_staanplaatsen","aantal_deuren","aantal_wielen","afstand_hart_koppeling_tot_achterzijde_voertuig","afstand_voorzijde_voertuig_tot_hart_koppeling","afwijkende_maximum_snelheid","lengte","breedte","europese_voertuigcategorie","europese_voertuigcategorie_toevoeging","europese_uitvoeringcategorie_toevoeging","plaats_chassisnummer","technische_max_massa_voertuig","type","type_gasinstallatie","typegoedkeuringsnummer","variant","uitvoering","volgnummer_wijziging_eu_typegoedkeuring","vermogen_massarijklaar","wielbasis","export_indicator","openstaande_terugroepactie_indicator","vervaldatum_tachograaf","taxi_indicator","maximum_massa_samenstelling","aantal_rolstoelplaatsen","maximum_ondersteunende_snelheid","jaar_laatste_registratie_tellerstand","tellerstandoordeel","code_toelichting_tellerstandoordeel","tenaamstellen_mogelijk","vervaldatum_apk_dt","datum_tenaamstelling_dt","datum_eerste_toelating_dt","datum_eerste_tenaamstelling_in_nederland_dt","vervaldatum_tachograaf_dt","maximum_last_onder_de_vooras_sen_tezamen_koppeling","type_remsysteem_voertuig_code","rupsonderstelconfiguratiecode","wielbasis_voertuig_minimum","wielbasis_voertuig_maximum","lengte_voertuig_minimum","lengte_voertuig_maximum","breedte_voertuig_minimum","breedte_voertuig_maximum","hoogte_voertuig","hoogte_voertuig_minimum","hoogte_voertuig_maximum","massa_bedrijfsklaar_minimaal","massa_bedrijfsklaar_maximaal","technisch_toelaatbaar_massa_koppelpunt","maximum_massa_technisch_maximaal","maximum_massa_technisch_minimaal","subcategorie_nederland","verticale_belasting_koppelpunt_getrokken_voertuig","zuinigheidsclassificatie","registratie_datum_goedkeuring_afschrijvingsmoment_bpm","registratie_datum_goedkeuring_afschrijvingsmoment_bpm_dt","gem_lading_wrde","aerodyn_voorz","massa_alt_aandr","verl_cab_ind","api_gekentekende_voertuigen_assen","api_gekentekende_voertuigen_brandstof","api_gekentekende_voertuigen_carrosserie","api_gekentekende_voertuigen_carrosserie_specifiek","api_gekentekende_voertuigen_voertuigklasse"
"G293RH","Personenauto","MERCEDES-BENZ","GLA 180 D","20241120","20191111","4599","stationwagen","5","GRIJS","Niet geregistreerd","4","1461","1370","1960","1470","735","1200","20160113","20191111","Geen verstrekking in Open Data","48833","Ja","190",,,,,,"5","4","0","0",,"0","180","M1",,,,"1960","245 G",,"e1*2001/116*0470*15","2712P2","MZAAA501","0","0.05","270","Nee","Nee",,"Nee","3205","0","0.00","2023","Geen oordeel","05","Ja","2024-11-20T00:00:00.000","2019-11-11T00:00:00.000","2016-01-13T00:00:00.000","2019-11-11T00:00:00.000",,,,,,,,,,,,,,,,,,,,,"D",,,,,,,"https://opendata.rdw.nl/resource/3huj-srit.json","https://opendata.rdw.nl/resource/8ys7-d773.json","https://opendata.rdw.nl/resource/vezc-m2t6.json","https://opendata.rdw.nl/resource/jhie-znh9.json","https://opendata.rdw.nl/resource/kmfi-hrps.json"
"G471SG","Personenauto","MERCEDES-BENZ","GLA 180 D","20250125","20191122","482","stationwagen","5","ZWART","Niet geregistreerd","4","1461","1370","1960","1470","735","1200","20160309","20191122","Geen verstrekking in Open Data","42131","Ja","190",,,,,,"5","4","0","0",,"0","180","M1",,,,"1960","245 G",,"e1*2001/116*0470*15","2712P2","MZAAA501","0","0.05","270","Nee","Nee",,"Nee","3205","0","0.00","2024","Geen oordeel","05","Ja","2025-01-25T00:00:00.000","2019-11-22T00:00:00.000","2016-03-09T00:00:00.000","2019-11-22T00:00:00.000",,,,,,,,,,,,,,,,,,,,,"D",,,,,,,"https://opendata.rdw.nl/resource/3huj-srit.json","https://opendata.rdw.nl/resource/8ys7-d773.json","https://opendata.rdw.nl/resource/vezc-m2t6.json","https://opendata.rdw.nl/resource/jhie-znh9.json","https://opendata.rdw.nl/resource/kmfi-hrps.json"
"G750DS","Personenauto","MERCEDES-BENZ","GLA 180 D","20250319","20190902","2487","stationwagen","5","ZWART","Niet geregistreerd","4","1461","1340","1970","1440","720","1200","20180216","20190902","Geen verstrekking in Open Data","51507","Ja","190",,,,,,"5","4","0","0",,"0","180","M1",,,,"1970","245 G",,"e1*2001/116*0470*20","2712P2","AZAA15A1","0","0.06","270","Nee","Ja",,"Nee","3205","0","0.00","2024","Geen oordeel","05","Ja","2025-03-19T00:00:00.000","2019-09-02T00:00:00.000","2018-02-16T00:00:00.000","2019-09-02T00:00:00.000",,,,,,,,,,,,,,,,,,,,,"D",,,,,,,"https://opendata.rdw.nl/resource/3huj-srit.json","https://opendata.rdw.nl/resource/8ys7-d773.json","https://opendata.rdw.nl/resource/vezc-m2t6.json","https://opendata.rdw.nl/resource/jhie-znh9.json","https://opendata.rdw.nl/resource/kmfi-hrps.json"
"GX196Z","Personenauto","MERCEDES-BENZ","GLA 180 D","20240517","20210526","5264","stationwagen","5","WIT","Niet geregistreerd","4","1461","1340","1960","1440","720","1200","20150914","20150914","Geen verstrekking in Open Data","38995","Ja",,,,,,,"5","4","0","0",,"0","0","M1",,,"by dwarsbalk r. voorzitting","1960","245 G",,"e1*2001/116*0470*15","2712P2","AZAAA501","0","0.06","270","Nee","Nee",,"Nee","3205","0","0.00","2024","Logisch","00","Ja","2024-05-17T00:00:00.000","2021-05-26T00:00:00.000","2015-09-14T00:00:00.000","2015-09-14T00:00:00.000",,,,,,,,,,,,,,,,,,,,,"C",,,,,,,"https://opendata.rdw.nl/resource/3huj-srit.json","https://opendata.rdw.nl/resource/8ys7-d773.json","https://opendata.rdw.nl/resource/vezc-m2t6.json","https://opendata.rdw.nl/resource/jhie-znh9.json","https://opendata.rdw.nl/resource/kmfi-hrps.json"
"GZ295Z","Personenauto","MERCEDES-BENZ","GLA 180 D","20250226","20200303","6633","stationwagen","5","ZWART","Niet geregistreerd","4","1461","1340","1960","1440","720","1200","20150928","20150928","Geen verstrekking in Open Data","47442","Ja",,,,,,,"5","4","0","0",,"0","0","M1",,,"by dwarsbalk r. voorzitting","1960","245 G",,"e1*2001/116*0470*15","2712P2","AZAAA502","0","0.06","270","Nee","Nee",,"Nee","3205","0","0.00","2024","Logisch","00","Ja","2025-02-26T00:00:00.000","2020-03-03T00:00:00.000","2015-09-28T00:00:00.000","2015-09-28T00:00:00.000",,,,,,,,,,,,,,,,,,,,,"D",,,,,,,"https://opendata.rdw.nl/resource/3huj-srit.json","https://opendata.rdw.nl/resource/8ys7-d773.json","https://opendata.rdw.nl/resource/vezc-m2t6.json","https://opendata.rdw.nl/resource/jhie-znh9.json","https://opendata.rdw.nl/resource/kmfi-hrps.json"
"H421VN","Personenauto","MERCEDES-BENZ","GLA 180 D","20240615","20200604","5660","stationwagen","5","ZWART","Niet geregistreerd","4","1461","1370","1960","1470","735","1200","20170102","20200604","Geen verstrekking in Open Data","41536","Ja","190",,,,,,"5","4","0","0",,"0","180","M1",,,,"1960","245 G",,"e1*2001/116*0470*16","2712P2","MZAA1501","0","0.05","270","Nee","Ja",,"Nee","3205","0","0.00","2023","Geen oordeel","05","Ja","2024-06-15T00:00:00.000","2020-06-04T00:00:00.000","2017-01-02T00:00:00.000","2020-06-04T00:00:00.000",,,,,,,,,,,,,,,,,,,,,"D",,,,,,,"https://opendata.rdw.nl/resource/3huj-srit.json","https://opendata.rdw.nl/resource/8ys7-d773.json","https://opendata.rdw.nl/resource/vezc-m2t6.json","https://opendata.rdw.nl/resource/jhie-znh9.json","https://opendata.rdw.nl/resource/kmfi-hrps.json"
"HD977T","Personenauto","MERCEDES-BENZ","GLA 180 D","20240610","20200622","5264","stationwagen","5","ZWART","Niet geregistreerd","4","1461","1340","1960","1440","720","1200","20151008","20151008","Geen verstrekking in Open Data","39709","Ja",,,,,,,"5","4","0","0",,"0","0","M1",,,"by dwarsbalk r. voorzitting","1960","245 G",,"e1*2001/116*0470*15","2712P2","AZAAA501","0","0.06","270","Nee","Nee",,"Nee","3205","0","0.00","2023","Logisch","00","Ja","2024-06-10T00:00:00.000","2020-06-22T00:00:00.000","2015-10-08T00:00:00.000","2015-10-08T00:00:00.000",,,,,,,,,,,,,,,,,,,,,"C",,,,,,,"https://opendata.rdw.nl/resource/3huj-srit.json","https://opendata.rdw.nl/resource/8ys7-d773.json","https://opendata.rdw.nl/resource/vezc-m2t6.json","https://opendata.rdw.nl/resource/jhie-znh9.json","https://opendata.rdw.nl/resource/kmfi-hrps.json"
"HG108K","Personenauto","MERCEDES-BENZ","GLA 180 D","20250412","20190429","4954","stationwagen","5","GRIJS","Niet geregistreerd","4","1461","1370","1960","1470","735","1200","20151029","20151029","Geen verstrekking in Open Data","46150","Ja",,,,,,,"5","4","0","0",,"447","180","M1",,,"onder r. voorzitting","1960","245 G",,"e1*2001/116*0470*15","2712P2","MZAAA501","0","0.05","270","Nee","Nee",,"Nee","3205","0","0.00","2024","Logisch","00","Ja","2025-04-12T00:00:00.000","2019-04-29T00:00:00.000","2015-10-29T00:00:00.000","2015-10-29T00:00:00.000",,,,,,,,,,,"154",,,,,,,,,,"C",,,,,,,"https://opendata.rdw.nl/resource/3huj-srit.json","https://opendata.rdw.nl/resource/8ys7-d773.json","https://opendata.rdw.nl/resource/vezc-m2t6.json","https://opendata.rdw.nl/resource/jhie-znh9.json","https://opendata.rdw.nl/resource/kmfi-hrps.json"
"HJ727R","Personenauto","MERCEDES-BENZ","GLA 180 D","20250213","20220121","4954","stationwagen","5","GRIJS","Niet geregistreerd","4","1461","1370","1960","1470","735","1200","20151118","20151118","Geen verstrekking in Open Data","41613","Ja",,,,,,,"5","4","0","0",,"447","180","M1",,,"onder r. voorzitting","1960","245 G",,"e1*2001/116*0470*15","2712P2","MZAAA501","0","0.05","270","Nee","Nee",,"Nee","3205","0","0.00","2024","Logisch","00","Ja","2025-02-13T00:00:00.000","2022-01-21T00:00:00.000","2015-11-18T00:00:00.000","2015-11-18T00:00:00.000",,,,,,,,,,,"154",,,,,,,,,,"C",,,,,,,"https://opendata.rdw.nl/resource/3huj-srit.json","https://opendata.rdw.nl/resource/8ys7-d773.json","https://opendata.rdw.nl/resource/vezc-m2t6.json","https://opendata.rdw.nl/resource/jhie-znh9.json","https://opendata.rdw.nl/resource/kmfi-hrps.json"
"HJ948T","Personenauto","MERCEDES-BENZ","GLA 180 D","20241119","20200226","4954","stationwagen","5","WIT","Niet geregistreerd","4","1461","1370","1960","1470","735","1200","20151119","20151119","Geen verstrekking in Open Data","46719","Ja",,,,,,,"5","4","0","0",,"447","180","M1",,,"onder r. voorzitting","1960","245 G",,"e1*2001/116*0470*15","2712P2","MZAAA501","0","0.05","270","Nee","Nee",,"Nee","3205","0","0.00","2023","Logisch","00","Ja","2024-11-19T00:00:00.000","2020-02-26T00:00:00.000","2015-11-19T00:00:00.000","2015-11-19T00:00:00.000",,,,,,,,,,,"154",,,,,,,,,,"C",,,,,,,"https://opendata.rdw.nl/resource/3huj-srit.json","https://opendata.rdw.nl/resource/8ys7-d773.json","https://opendata.rdw.nl/resource/vezc-m2t6.json","https://opendata.rdw.nl/resource/jhie-znh9.json","https://opendata.rdw.nl/resource/kmfi-hrps.json"
"HJ967T","Personenauto","MERCEDES-BENZ","GLA 180 D","20240929","20231014","4954","stationwagen","5","PAARS","Niet geregistreerd","4","1461","1370","1960","1470","735","1200","20151118","20151118","Geen verstrekking in Open Data","52333","Ja",,,,,,,"5","4","0","0",,"447","180","M1",,,"onder r. voorzitting","1960","245 G",,"e1*2001/116*0470*15","2712P2","MZAAA501","0","0.05","270","Nee","Nee",,"Nee","3205","0","0.00","2024","Logisch","00","Ja","2024-09-29T00:00:00.000","2023-10-14T00:00:00.000","2015-11-18T00:00:00.000","2015-11-18T00:00:00.000",,,,,,,,,,,"154",,,,,,,,,,"C",,,,,,,"https://opendata.rdw.nl/resource/3huj-srit.json","https://opendata.rdw.nl/resource/8ys7-d773.json","https://opendata.rdw.nl/resource/vezc-m2t6.json","https://opendata.rdw.nl/resource/jhie-znh9.json","https://opendata.rdw.nl/resource/kmfi-hrps.json"
"HR937Z","Personenauto","MERCEDES-BENZ","GLA 180 D","20250107","20230503","4954","stationwagen","5","GRIJS","Niet geregistreerd","4","1461","1370","1960","1470","735","1200","20160107","20160107","Geen verstrekking in Open Data","41613","Ja",,,,,,,"5","4","0","0",,"447","180","M1",,,"onder r. voorzitting","1960","245 G",,"e1*2001/116*0470*15","2712P2","MZAAA501","0","0.05","270","Nee","Nee",,"Nee","3205","0","0.00","2023","Logisch","00","Ja","2025-01-07T00:00:00.000","2023-05-03T00:00:00.000","2016-01-07T00:00:00.000","2016-01-07T00:00:00.000",,,,,,,,,,,"154",,,,,,,,,,"D",,,,,,,"https://opendata.rdw.nl/resource/3huj-srit.json","https://opendata.rdw.nl/resource/8ys7-d773.json","https://opendata.rdw.nl/resource/vezc-m2t6.json","https://opendata.rdw.nl/resource/jhie-znh9.json","https://opendata.rdw.nl/resource/kmfi-hrps.json"
"HV968R","Personenauto","MERCEDES-BENZ","GLA 180 D","20250128","20240426","4954","stationwagen","5","GROEN","Niet geregistreerd","4","1461","1370","1960","1470","735","1200","20160128","20160128","Geen verstrekking in Open Data","50252","Ja",,,,,,,"5","4","0","0",,"447","180","M1",,,"onder r. voorzitting","1960","245 G",,"e1*2001/116*0470*15","2712P2","MZAAA501","0","0.05","270","Nee","Nee",,"Nee","3205","0","0.00","2024","Logisch","00","Ja","2025-01-28T00:00:00.000","2024-04-26T00:00:00.000","2016-01-28T00:00:00.000","2016-01-28T00:00:00.000",,,,,,,,,,,"154",,,,,,,,,,"D",,,,,,,"https://opendata.rdw.nl/resource/3huj-srit.json","https://opendata.rdw.nl/resource/8ys7-d773.json","https://opendata.rdw.nl/resource/vezc-m2t6.json","https://opendata.rdw.nl/resource/jhie-znh9.json","https://opendata.rdw.nl/resource/kmfi-hrps.json"
"HX105X","Personenauto","MERCEDES-BENZ","GLA 180 D","20250224","20170106","4954","stationwagen","5","ZWART","Niet geregistreerd","4","1461","1370","1960","1470","735","1200","20160224","20160224","Geen verstrekking in Open Data","41613","Ja",,,,,,,"5","4","0","0",,"447","180","M1",,,"onder r. voorzitting","1960","245 G",,"e1*2001/116*0470*15","2712P2","MZAAA501","0","0.05","270","Nee","Nee",,"Nee","3205","0","0.00","2024","Logisch","00","Ja","2025-02-24T00:00:00.000","2017-01-06T00:00:00.000","2016-02-24T00:00:00.000","2016-02-24T00:00:00.000",,,,,,,,,,,"154",,,,,,,,,,"D",,,,,,,"https://opendata.rdw.nl/resource/3huj-srit.json","https://opendata.rdw.nl/resource/8ys7-d773.json","https://opendata.rdw.nl/resource/vezc-m2t6.json","https://opendata.rdw.nl/resource/jhie-znh9.json","https://opendata.rdw.nl/resource/kmfi-hrps.json"
"HX250N","Personenauto","MERCEDES-BENZ","GLA 180 D","20241108","20211211","5264","stationwagen","5","ZWART","Niet geregistreerd","4","1461","1340","1960","1440","720","1200","20160115","20160115","Geen verstrekking in Open Data","42068","Ja",,,,,,,"5","4","0","0",,"447","180","M1",,,"onder r. voorzitting","1960","245 G",,"e1*2001/116*0470*15","2712P2","AZAAA501","0","0.06","270","Nee","Ja",,"Nee","3205","0","0.00","2023","Logisch","00","Ja","2024-11-08T00:00:00.000","2021-12-11T00:00:00.000","2016-01-15T00:00:00.000","2016-01-15T00:00:00.000",,,,,,,,,,,"154",,,,,,,,,,"D",,,,,,,"https://opendata.rdw.nl/resource/3huj-srit.json","https://opendata.rdw.nl/resource/8ys7-d773.json","https://opendata.rdw.nl/resource/vezc-m2t6.json","https://opendata.rdw.nl/resource/jhie-znh9.json","https://opendata.rdw.nl/resource/kmfi-hrps.json"
"HZ142G","Personenauto","MERCEDES-BENZ","GLA 180 D","20250227","20211231","5727","stationwagen","5","ZWART","Niet geregistreerd","4","1461","1340","1960","1440","720","1200","20160112","20160112","Geen verstrekking in Open Data","40172","Ja",,,,,,,"5","4","0","0",,"447","180","M1",,,"onder r. voorzitting","1960","245 G",,"e1*2001/116*0470*15","2712P2","AZAAA501","0","0.06","270","Nee","Nee",,"Nee","3205","0","0.00","2024","Logisch","00","Ja","2025-02-27T00:00:00.000","2021-12-31T00:00:00.000","2016-01-12T00:00:00.000","2016-01-12T00:00:00.000",,,,,,,,,,,"154",,,,,,,,,,"D",,,,,,,"https://opendata.rdw.nl/resource/3huj-srit.json","https://opendata.rdw.nl/resource/8ys7-d773.json","https://opendata.rdw.nl/resource/vezc-m2t6.json","https://opendata.rdw.nl/resource/jhie-znh9.json","https://opendata.rdw.nl/resource/kmfi-hrps.json"
"HZ837X","Personenauto","MERCEDES-BENZ","GLA 180 D","20241229","20231125","5727","stationwagen","5","ZWART","Niet geregistreerd","4","1461","1340","1960","1440","720","1200","20160129","20160129","Geen verstrekking in Open Data","40608","Ja",,,,,,,"5","4","0","0",,"447","180","M1",,,"onder r. voorzitting","1960","245 G",,"e1*2001/116*0470*15","2712P2","AZAAA501","0","0.06","270","Nee","Nee",,"Nee","3205","0","0.00","2023","Logisch","00","Ja","2024-12-29T00:00:00.000","2023-11-25T00:00:00.000","2016-01-29T00:00:00.000","2016-01-29T00:00:00.000",,,,,,,,,,,"154",,,,,,,,,,"D",,,,,,,"https://opendata.rdw.nl/resource/3huj-srit.json","https://opendata.rdw.nl/resource/8ys7-d773.json","https://opendata.rdw.nl/resource/vezc-m2t6.json","https://opendata.rdw.nl/resource/jhie-znh9.json","https://opendata.rdw.nl/resource/kmfi-hrps.json"
"J004FV","Personenauto","MERCEDES-BENZ","GLA 180 D","20250108","20200716","940","stationwagen","5","ZWART","Niet geregistreerd","4","1461","1340","1970","1440","720","1200","20180105","20200716","Geen verstrekking in Open Data","46013","Ja","190",,,,,,"5","4",,,,,"180","M1",,,,"1970","245 G",,"e1*2001/116*0470*19","2712P2","AZAA15A1","0","0.06","270","Nee","Ja",,"Nee","3205",,,"2024","Geen oordeel","05","Ja","2025-01-08T00:00:00.000","2020-07-16T00:00:00.000","2018-01-05T00:00:00.000","2020-07-16T00:00:00.000",,,,,,,,,,,,,,,,,,,,,"D",,,,,,,"https://opendata.rdw.nl/resource/3huj-srit.json","https://opendata.rdw.nl/resource/8ys7-d773.json","https://opendata.rdw.nl/resource/vezc-m2t6.json","https://opendata.rdw.nl/resource/jhie-znh9.json","https://opendata.rdw.nl/resource/kmfi-hrps.json"
"J279SF","Personenauto","MERCEDES-BENZ","GLA 180 D","20241009","20220211","6512","stationwagen","5","ZWART","Niet geregistreerd","4","1461","1370","1960","1470","735","1200","20160617","20201002","Geen verstrekking in Open Data","46254","Ja",,,,,,,"5","4","0","0",,"447","180","M1",,,"by dwarsbalk r. voorzitting","1960","245 G",,"e1*2001/116*0470*15","2712P2","MZAAA502","0","0.05","270","Nee","Nee",,"Nee","3205","0","0.00","2023","Geen oordeel","05","Ja","2024-10-09T00:00:00.000","2022-02-11T00:00:00.000","2016-06-17T00:00:00.000","2020-10-02T00:00:00.000",,,,,,,,,,,"154",,,,,,,,,,"E",,,,,,,"https://opendata.rdw.nl/resource/3huj-srit.json","https://opendata.rdw.nl/resource/8ys7-d773.json","https://opendata.rdw.nl/resource/vezc-m2t6.json","https://opendata.rdw.nl/resource/jhie-znh9.json","https://opendata.rdw.nl/resource/kmfi-hrps.json"
"JG107Z","Personenauto","MERCEDES-BENZ","GLA 180 D","20250429","20170713","5416","stationwagen","5","ZWART","Niet geregistreerd","4","1461","1370","1960","1470","735","1200","20160317","20160317","Geen verstrekking in Open Data","42512","Ja",,,,,,,"5","4","0","0",,"447","180","M1",,,"onder r. voorzitting","1960","245 G",,"e1*2001/116*0470*15","2712P2","MZAAA501","0","0.05","270","Nee","Nee",,"Nee","3205","0","0.00","2024","Logisch","00","Ja","2025-04-29T00:00:00.000","2017-07-13T00:00:00.000","2016-03-17T00:00:00.000","2016-03-17T00:00:00.000",,,,,,,,,,,"154",,,,,,,,,,"D",,,,,,,"https://opendata.rdw.nl/resource/3huj-srit.json","https://opendata.rdw.nl/resource/8ys7-d773.json","https://opendata.rdw.nl/resource/vezc-m2t6.json","https://opendata.rdw.nl/resource/jhie-znh9.json","https://opendata.rdw.nl/resource/kmfi-hrps.json"
"JG905D","Personenauto","MERCEDES-BENZ","GLA 180 D","20250614","20240218","5416","stationwagen","5","GRIJS","Niet geregistreerd","4","1461","1370","1960","1470","735","1200","20160307","20160307","Geen verstrekking in Open Data","42512","Ja",,,,,,,"5","4","0","0",,"447","180","M1",,,"onder r. voorzitting","1960","245 G",,"e1*2001/116*0470*15","2712P2","MZAAA501","0","0.05","270","Nee","Nee",,"Ja","3205","0","0.00","2024","Logisch","00","Ja","2025-06-14T00:00:00.000","2024-02-18T00:00:00.000","2016-03-07T00:00:00.000","2016-03-07T00:00:00.000",,,,,,,,,,,"154",,,,,,,,,,"D","20231025","2023-10-25T00:00:00.000",,,,,"https://opendata.rdw.nl/resource/3huj-srit.json","https://opendata.rdw.nl/resource/8ys7-d773.json","https://opendata.rdw.nl/resource/vezc-m2t6.json","https://opendata.rdw.nl/resource/jhie-znh9.json","https://opendata.rdw.nl/resource/kmfi-hrps.json"
"JH366F","Personenauto","MERCEDES-BENZ","GLA 180 D","20241129","20221129","5727","stationwagen","5","ZWART","Niet geregistreerd","4","1461","1340","1960","1440","720","1200","20160324","20160324","Geen verstrekking in Open Data","40172","Ja",,,,,,,"5","4","0","0",,"447","180","M1",,,"onder r. voorzitting","1960","245 G",,"e1*2001/116*0470*15","2712P2","AZAAA501","0","0.06","270","Nee","Ja",,"Nee","3205","0","0.00","2023","Logisch","00","Ja","2024-11-29T00:00:00.000","2022-11-29T00:00:00.000","2016-03-24T00:00:00.000","2016-03-24T00:00:00.000",,,,,,,,,,,"154",,,,,,,,,,"D",,,,,,,"https://opendata.rdw.nl/resource/3huj-srit.json","https://opendata.rdw.nl/resource/8ys7-d773.json","https://opendata.rdw.nl/resource/vezc-m2t6.json","https://opendata.rdw.nl/resource/jhie-znh9.json","https://opendata.rdw.nl/resource/kmfi-hrps.json"
"JH368V","Personenauto","MERCEDES-BENZ","GLA 180 D","20250331","20200313","5416","stationwagen","5","PAARS","Niet geregistreerd","4","1461","1370","1960","1470","735","1200","20160331","20160331","Geen verstrekking in Open Data","46184","Ja",,,,,,,"5","4","0","0",,"447","180","M1",,,"onder r. voorzitting","1960","245 G",,"e1*2001/116*0470*15","2712P2","MZAAA501","0","0.05","270","Nee","Nee",,"Nee","3205","0","0.00","2024","Logisch","00","Ja","2025-03-31T00:00:00.000","2020-03-13T00:00:00.000","2016-03-31T00:00:00.000","2016-03-31T00:00:00.000",,,,,,,,,,,"154",,,,,,,,,,"D",,,,,,,"https://opendata.rdw.nl/resource/3huj-srit.json","https://opendata.rdw.nl/resource/8ys7-d773.json","https://opendata.rdw.nl/resource/vezc-m2t6.json","https://opendata.rdw.nl/resource/jhie-znh9.json","https://opendata.rdw.nl/resource/kmfi-hrps.json"
"JH944Z","Personenauto","MERCEDES-BENZ","GLA 180 D","20241016","20191016","5727","stationwagen","5","ZWART","Niet geregistreerd","4","1461","1340","1960","1440","720","1200","20160331","20160331","Geen verstrekking in Open Data","39458","Ja",,,,,,,"5","4","0","0",,"447","180","M1",,,"onder r. voorzitting","1960","245 G",,"e1*2001/116*0470*15","2712P2","AZAAA501","0","0.06","270","Nee","Nee",,"Nee","3205","0","0.00","2023","Logisch","00","Ja","2024-10-16T00:00:00.000","2019-10-16T00:00:00.000","2016-03-31T00:00:00.000","2016-03-31T00:00:00.000",,,,,,,,,,,"154",,,,,,,,,,"D",,,,,,,"https://opendata.rdw.nl/resource/3huj-srit.json","https://opendata.rdw.nl/resource/8ys7-d773.json","https://opendata.rdw.nl/resource/vezc-m2t6.json","https://opendata.rdw.nl/resource/jhie-znh9.json","https://opendata.rdw.nl/resource/kmfi-hrps.json"
"JJ464P","Personenauto","MERCEDES-BENZ","GLA 180 D","20250331","20220110","5416","stationwagen","5","BLAUW","Niet geregistreerd","4","1461","1370","1960","1470","735","1200","20160331","20160331","Geen verstrekking in Open Data","42512","Ja",,,,,,,"5","4","0","0",,"447","180","M1",,,"onder r. voorzitting","1960","245 G",,"e1*2001/116*0470*15","2712P2","MZAAA501","0","0.05","270","Nee","Nee",,"Nee","3205","0","0.00","2024","Logisch","00","Ja","2025-03-31T00:00:00.000","2022-01-10T00:00:00.000","2016-03-31T00:00:00.000","2016-03-31T00:00:00.000",,,,,,,,,,,"154",,,,,,,,,,"D",,,,,,,"https://opendata.rdw.nl/resource/3huj-srit.json","https://opendata.rdw.nl/resource/8ys7-d773.json","https://opendata.rdw.nl/resource/vezc-m2t6.json","https://opendata.rdw.nl/resource/jhie-znh9.json","https://opendata.rdw.nl/resource/kmfi-hrps.json"