"kenteken","voertuigsoort","merk","handelsbenaming","vervaldatum_apk","datum_tenaamstelling","bruto_bpm","inrichting","aantal_zitplaatsen","eerste_kleur","tweede_kleur","aantal_cilinders","cilinderinhoud","massa_ledig_voertuig","toegestane_maximum_massa_voertuig","massa_rijklaar","maximum_massa_trekken_ongeremd","maximum_trekken_massa_geremd","datum_eerste_toelating","datum_eerste_tenaamstelling_in_nederland","wacht_op_keuren","catalogusprijs","wam_verzekerd","maximale_constructiesnelheid","laadvermogen","oplegger_geremd","aanhangwagen_autonoom_geremd","aanhangwagen_middenas_geremd","aantal_staanplaatsen","aantal_deuren","aantal_wielen","afstand_hart_koppeling_tot_achterzijde_voertuig","afstand_voorzijde_voertuig_tot_hart_koppeling","afwijkende_maximum_snelheid","lengte","breedte","europese_voertuigcategorie","europese_voertuigcategorie_toevoeging","europese_uitvoeringcategorie_toevoeging","plaats_chassisnummer","technische_max_massa_voertuig","type","type_gasinstallatie","typegoedkeuringsnummer","variant","uitvoering","volgnummer_wijziging_eu_typegoedkeuring","vermogen_massarijklaar","wielbasis","export_indicator","openstaande_terugroepactie_indicator","vervaldatum_tachograaf","taxi_indicator","maximum_massa_samenstelling","aantal_rolstoelplaatsen","maximum_ondersteunende_snelheid","jaar_laatste_registratie_tellerstand","tellerstandoordeel","code_toelichting_tellerstandoordeel","tenaamstellen_mogelijk","vervaldatum_apk_dt","datum_tenaamstelling_dt","datum_eerste_toelating_dt","datum_eerste_tenaamstelling_in_nederland_dt","vervaldatum_tachograaf_dt","maximum_last_onder_de_vooras_sen_tezamen_koppeling","type_remsysteem_voertuig_code","rupsonderstelconfiguratiecode","wielbasis_voertuig_minimum","wielbasis_voertuig_maximum","lengte_voertuig_minimum","lengte_voertuig_maximum","breedte_voertuig_minimum","breedte_voertuig_maximum","hoogte_voertuig","hoogte_voertuig_minimum","hoogte_voertuig_maximum","massa_bedrijfsklaar_minimaal","massa_bedrijfsklaar_maximaal","technisch_toelaatbaar_massa_koppelpunt","maximum_massa_technisch_maximaal","maximum_massa_technisch_minimaal","subcategorie_nederland","verticale_belasting_koppelpunt_getrokken_voertuig","zuinigheidsclassificatie","registratie_datum_goedkeuring_afschrijvingsmoment_bpm","registratie_datum_goedkeuring_afschrijvingsmoment_bpm_dt","gem_lading_wrde","aerodyn_voorz","massa_alt_aandr","verl_cab_ind","api_gekentekende_voertuigen_assen","api_gekentekende_voertuigen_brandstof","api_gekentekende_voertuigen_carrosserie","api_gekentekende_voertuigen_carrosserie_specifiek","api_gekentekende_voertuigen_voertuigklasse"
"1ZSN31","Personenauto","MERCEDES-AMG","AMG GT S","20250327","20230712","29465","coupe","2","GRIJS","Niet geregistreerd","8","3982","1545","1890","1645",,,"20150313","20150313","Geen verstrekking in Open Data","194506","Ja",,,,,,,"3","4","0","0",,"0","0","M1",,,"r. dwarsbalk by voorzitting","1890","197",,"e1*2007/46*0233*08","Z38SP0","1ZAAB201","0","0.23","263","Nee","Nee",,"Nee","0","0",,"2024","Logisch","00","Ja","2025-03-27T00:00:00.000","2023-07-12T00:00:00.000","2015-03-13T00:00:00.000","2015-03-13T00:00:00.000",,,,,,,,,,,,,,,,,,,,,"F",,,,,,,"https://opendata.rdw.nl/resource/3huj-srit.json","https://opendata.rdw.nl/resource/8ys7-d773.json","https://opendata.rdw.nl/resource/vezc-m2t6.json","https://opendata.rdw.nl/resource/jhie-znh9.json","https://opendata.rdw.nl/resource/kmfi-hrps.json"
"1ZVB09","Personenauto","MERCEDES-AMG","AMG GT S","20250409","20160704","29465","coupe","2","GRIJS","Niet geregistreerd","8","3982","1545","1890","1645",,,"20150403","20150403","Geen verstrekking in Open Data","195383","Ja",,,,,,,"3","4","0","0",,"0","0","M1",,,"r. dwarsbalk by voorzitting","1890","197",,"e1*2007/46*0233*08","Z38SP0","1ZAAB201","0","0.23","263","Nee","Nee",,"Nee","0","0",,"2024","Logisch","00","Ja","2025-04-09T00:00:00.000","2016-07-04T00:00:00.000","2015-04-03T00:00:00.000","2015-04-03T00:00:00.000",,,,,,,,,,,,,,,,,,,,,"F",,,,,,,"https://opendata.rdw.nl/resource/3huj-srit.json","https://opendata.rdw.nl/resource/8ys7-d773.json","https://opendata.rdw.nl/resource/vezc-m2t6.json","https://opendata.rdw.nl/resource/jhie-znh9.json","https://opendata.rdw.nl/resource/kmfi-hrps.json"
"2ZPT72","Personenauto","MERCEDES-AMG","AMG GT S","20250306","20180406","29465","coupe","2","GEEL","Niet geregistreerd","8","3982","1545","1890","1645",,,"20150226","20150226","Geen verstrekking in Open Data","223498","Ja",,,,,,,"3","4","0","0",,"0","0","M1",,,"r. dwarsbalk by voorzitting","1890","197",,"e1*2007/46*0233*07","Z38DP0","1ZAAB201","0","0.23","263","Nee","Nee",,"Nee","0","0",,"2024","Logisch","00","Ja","2025-03-06T00:00:00.000","2018-04-06T00:00:00.000","2015-02-26T00:00:00.000","2015-02-26T00:00:00.000",,,,,,,,,,,,,,,,,,,,,"F",,,,,,,"https://opendata.rdw.nl/resource/3huj-srit.json","https://opendata.rdw.nl/resource/8ys7-d773.json","https://opendata.rdw.nl/resource/vezc-m2t6.json","https://opendata.rdw.nl/resource/jhie-znh9.json","https://opendata.rdw.nl/resource/kmfi-hrps.json"
"G182DH","Personenauto","MERCEDES-AMG","AMG GT S","20260109","20240416","6885","coupe","2","ZWART","Niet geregistreerd","8","3982","1545","1890","1645",,,"20170705","20190828","Geen verstrekking in Open Data","202528","Ja","310",,,,,,"3","4",,,,,,"M1",,,,"1890","197",,"e1*2007/46*0233*11","Z38SP0","1ZAA0204","1","0.23","263","Nee","Nee",,"Nee",,,,"2024","Geen oordeel","05","Ja","2026-01-09T00:00:00.000","2024-04-16T00:00:00.000","2017-07-05T00:00:00.000","2019-08-28T00:00:00.000",,,,,,,,,,,,,,,,,,,,,"G",,,,,,,"https://opendata.rdw.nl/resource/3huj-srit.json","https://opendata.rdw.nl/resource/8ys7-d773.json","https://opendata.rdw.nl/resource/vezc-m2t6.json","https://opendata.rdw.nl/resource/jhie-znh9.json","https://opendata.rdw.nl/resource/kmfi-hrps.json"
"G330TD","Personenauto","MERCEDES-AMG","AMG GT S","20240716","20191129","26187","coupe","2","GRIJS","Niet geregistreerd","8","3982","1545","1890","1645",,,"20150813","20191129","Geen verstrekking in Open Data","189583","Ja","310",,,,,,"3","4","0","0",,"0","194","M1",,,"r. dwarsbalk by voorzitting","1890","197",,"e1*2007/46*0233*08","Z38SP0","1ZAAB201","0","0.23","263","Nee","Nee",,"Nee","0","0",,"2024","Geen oordeel","05","Ja","2024-07-16T00:00:00.000","2019-11-29T00:00:00.000","2015-08-13T00:00:00.000","2019-11-29T00:00:00.000",,,,,,,,,,,,,,,,,,,,,"F",,,,,,,"https://opendata.rdw.nl/resource/3huj-srit.json","https://opendata.rdw.nl/resource/8ys7-d773.json","https://opendata.rdw.nl/resource/vezc-m2t6.json","https://opendata.rdw.nl/resource/jhie-znh9.json","https://opendata.rdw.nl/resource/kmfi-hrps.json"
"G341BH","Personenauto","MERCEDES-AMG","AMG GT S","20240731","20190823","29463","coupe","2","GRIJS","Niet geregistreerd","8","3982","1545","1890","1645",,,"20150615","20190823","Geen verstrekking in Open Data","189679","Ja","310",,,,,,"3","4","0","0",,"0","194","M1",,,,"1890","197",,"e1*2007/46*0233*08","Z38DP0","1ZAAB201","0","0.23","263","Nee","Nee",,"Nee","0","0",,"2023","Geen oordeel","05","Ja","2024-07-31T00:00:00.000","2019-08-23T00:00:00.000","2015-06-15T00:00:00.000","2019-08-23T00:00:00.000",,,,,,,,,,,,,,,,,,,,,"F",,,,,,,"https://opendata.rdw.nl/resource/3huj-srit.json","https://opendata.rdw.nl/resource/8ys7-d773.json","https://opendata.rdw.nl/resource/vezc-m2t6.json","https://opendata.rdw.nl/resource/jhie-znh9.json","https://opendata.rdw.nl/resource/kmfi-hrps.json"
"G378LK","Personenauto","MERCEDES-AMG","AMG GT S","20250512","20230516","29465","coupe","2","WIT","Niet geregistreerd","8","3982","1545","1890","1645",,,"20151102","20191021","Geen verstrekking in Open Data","177215","Ja","310",,,,,,"3","4","0","0",,"0","194","M1",,,"r. dwarsbalk by voorzitting","1890","197",,"e1*2007/46*0233*08","Z38SP0","1ZAAB201","0","0.23","263","Nee","Nee",,"Nee","0","0",,"2024","Geen oordeel","05","Ja","2025-05-12T00:00:00.000","2023-05-16T00:00:00.000","2015-11-02T00:00:00.000","2019-10-21T00:00:00.000",,,,,,,,,,,,,,,,,,,,,"F",,,,,,,"https://opendata.rdw.nl/resource/3huj-srit.json","https://opendata.rdw.nl/resource/8ys7-d773.json","https://opendata.rdw.nl/resource/vezc-m2t6.json","https://opendata.rdw.nl/resource/jhie-znh9.json","https://opendata.rdw.nl/resource/kmfi-hrps.json"
"GB915L","Personenauto","MERCEDES-AMG","AMG GT S","20250517","20230520","29465","coupe","2","GRIJS","Niet geregistreerd","8","3982","1545","1890","1645",,,"20150414","20150414","Geen verstrekking in Open Data","202843","Ja",,,,,,,"3","4","0","0",,"0","0","M1",,,"r. dwarsbalk by voorzitting","1890","197",,"e1*2007/46*0233*08","Z38DP0","1ZAAB201","0","0.23","263","Nee","Nee",,"Nee","0","0",,"2024","Logisch","00","Ja","2025-05-17T00:00:00.000","2023-05-20T00:00:00.000","2015-04-14T00:00:00.000","2015-04-14T00:00:00.000",,,,,,,,,,,,,,,,,,,,,"F",,,,,,,"https://opendata.rdw.nl/resource/3huj-srit.json","https://opendata.rdw.nl/resource/8ys7-d773.json","https://opendata.rdw.nl/resource/vezc-m2t6.json","https://opendata.rdw.nl/resource/jhie-znh9.json","https://opendata.rdw.nl/resource/kmfi-hrps.json"
"GB973S","Personenauto","MERCEDES-AMG","AMG GT S","20240616","20230916","29465","coupe","2","GRIJS","Niet geregistreerd","8","3982","1545","1890","1645",,,"20150410","20150410","Geen verstrekking in Open Data","197192","Ja",,,,,,,"3","4","0","0",,"0","0","M1",,,"r. dwarsbalk by voorzitting","1890","197",,"e1*2007/46*0233*08","Z38DP0","1ZAAB201","0","0.23","263","Nee","Nee",,"Nee","0","0",,"2023","Logisch","00","Ja","2024-06-16T00:00:00.000","2023-09-16T00:00:00.000","2015-04-10T00:00:00.000","2015-04-10T00:00:00.000",,,,,,,,,,,,,,,,,,,,,"F",,,,,,,"https://opendata.rdw.nl/resource/3huj-srit.json","https://opendata.rdw.nl/resource/8ys7-d773.json","https://opendata.rdw.nl/resource/vezc-m2t6.json","https://opendata.rdw.nl/resource/jhie-znh9.json","https://opendata.rdw.nl/resource/kmfi-hrps.json"
"GD201P","Personenauto","MERCEDES-AMG","AMG GT S","20250426","20180601","29465","coupe","2","WIT","Niet geregistreerd","8","3982","1545","1890","1645",,,"20150424","20150424","Geen verstrekking in Open Data","195777","Ja",,,,,,,"3","4","0","0",,"0","0","M1",,,"r. dwarsbalk by voorzitting","1890","197",,"e1*2007/46*0233*08","Z38DP0","1ZAAB201","0","0.23","263","Nee","Nee",,"Nee","0","0",,"2024","Logisch","00","Ja","2025-04-26T00:00:00.000","2018-06-01T00:00:00.000","2015-04-24T00:00:00.000","2015-04-24T00:00:00.000",,,,,,,,,,,,,,,,,,,,,"F",,,,,,,"https://opendata.rdw.nl/resource/3huj-srit.json","https://opendata.rdw.nl/resource/8ys7-d773.json","https://opendata.rdw.nl/resource/vezc-m2t6.json","https://opendata.rdw.nl/resource/jhie-znh9.json","https://opendata.rdw.nl/resource/kmfi-hrps.json"
"GF090D","Personenauto","MERCEDES-AMG","AMG GT S","20250422","20200508","29465","coupe","2","GRIJS","Niet geregistreerd","8","3982","1545","1890","1645",,,"20150507","20150507","Geen verstrekking in Open Data","200060","Ja",,,,,,,"3","4","0","0",,"0","0","M1",,,"r. dwarsbalk by voorzitting","1890","197",,"e1*2007/46*0233*08","Z38DP0","1ZAAB201","0","0.23","263","Nee","Nee",,"Nee","0","0",,"2024","Logisch","00","Ja","2025-04-22T00:00:00.000","2020-05-08T00:00:00.000","2015-05-07T00:00:00.000","2015-05-07T00:00:00.000",,,,,,,,,,,,,,,,,,,,,"F",,,,,,,"https://opendata.rdw.nl/resource/3huj-srit.json","https://opendata.rdw.nl/resource/8ys7-d773.json","https://opendata.rdw.nl/resource/vezc-m2t6.json","https://opendata.rdw.nl/resource/jhie-znh9.json","https://opendata.rdw.nl/resource/kmfi-hrps.json"
"GG177G","Personenauto","MERCEDES-AMG","AMG GT S","20240609","20200916","29465","coupe","2","ZWART","Niet geregistreerd","8","3982","1545","1890","1645",,,"20150515","20150515","Geen verstrekking in Open Data","206170","Ja",,,,,,,"3","4","0","0",,"0","0","M1",,,"r. dwarsbalk by voorzitting","1890","197",,"e1*2007/46*0233*08","Z38DP0","1ZAAB201","0","0.23","263","Nee","Nee",,"Nee","0","0",,"2023","Logisch","00","Ja","2024-06-09T00:00:00.000","2020-09-16T00:00:00.000","2015-05-15T00:00:00.000","2015-05-15T00:00:00.000",,,,,,,,,,,,,,,,,,,,,"F",,,,,,,"https://opendata.rdw.nl/resource/3huj-srit.json","https://opendata.rdw.nl/resource/8ys7-d773.json","https://opendata.rdw.nl/resource/vezc-m2t6.json","https://opendata.rdw.nl/resource/jhie-znh9.json","https://opendata.rdw.nl/resource/kmfi-hrps.json"
"GG872F","Personenauto","MERCEDES-AMG","AMG GT S","20250517","20231018","29465","coupe","2","GRIJS","Niet geregistreerd","8","3982","1545","1890","1645",,,"20150512","20150512","Geen verstrekking in Open Data","192213","Ja",,,,,,,"3","4","0","0",,"0","0","M1",,,"r. dwarsbalk by voorzitting","1890","197",,"e1*2007/46*0233*08","Z38DP0","1ZAAB201","0","0.23","263","Nee","Nee",,"Nee","0","0",,"2024","Logisch","00","Ja","2025-05-17T00:00:00.000","2023-10-18T00:00:00.000","2015-05-12T00:00:00.000","2015-05-12T00:00:00.000",,,,,,,,,,,,,,,,,,,,,"F",,,,,,,"https://opendata.rdw.nl/resource/3huj-srit.json","https://opendata.rdw.nl/resource/8ys7-d773.json","https://opendata.rdw.nl/resource/vezc-m2t6.json","https://opendata.rdw.nl/resource/jhie-znh9.json","https://opendata.rdw.nl/resource/kmfi-hrps.json"
"GH252V","Personenauto","MERCEDES-AMG","AMG GT S","20240711","20230713","29465","coupe","2","GRIJS","Niet geregistreerd","8","3982","1545","1890","1645",,,"20150528","20150528","Geen verstrekking in Open Data","183701","Ja",,,,,,,"3","4","0","0",,"0","0","M1",,,"r. dwarsbalk by voorzitting","1890","197",,"e1*2007/46*0233*08","Z38SP0","1ZAAB201","0","0.23","263","Nee","Nee",,"Nee","0","0",,"2023","Logisch","00","Ja","2024-07-11T00:00:00.000","2023-07-13T00:00:00.000","2015-05-28T00:00:00.000","2015-05-28T00:00:00.000",,,,,,,,,,,,,,,,,,,,,"F",,,,,,,"https://opendata.rdw.nl/resource/3huj-srit.json","https://opendata.rdw.nl/resource/8ys7-d773.json","https://opendata.rdw.nl/resource/vezc-m2t6.json","https://opendata.rdw.nl/resource/jhie-znh9.json","https://opendata.rdw.nl/resource/kmfi-hrps.json"
"GH255V","Personenauto","MERCEDES-AMG","AMG GT S","20250529","20210607","31635","coupe","2","GRIJS","Niet geregistreerd","8","3982","1545","1890","1645",,,"20150529","20150529","Geen verstrekking in Open Data","224083","Ja",,,,,,,"3","4","0","0",,"0","0","M1",,,"r. dwarsbalk by voorzitting","1890","197",,"e1*2007/46*0233*08","Z38DP0","1ZAAB202","0","0.23","263","Nee","Nee",,"Nee","0","0",,"2024","Logisch","00","Ja","2025-05-29T00:00:00.000","2021-06-07T00:00:00.000","2015-05-29T00:00:00.000","2015-05-29T00:00:00.000",,,,,,,,,,,,,,,,,,,,,"G",,,,,,,"https://opendata.rdw.nl/resource/3huj-srit.json","https://opendata.rdw.nl/resource/8ys7-d773.json","https://opendata.rdw.nl/resource/vezc-m2t6.json","https://opendata.rdw.nl/resource/jhie-znh9.json","https://opendata.rdw.nl/resource/kmfi-hrps.json"
"GH297G","Personenauto","MERCEDES-AMG","AMG GT S","20250314","20220225","29465","coupe","2","ROOD","Niet geregistreerd","8","3982","1545","1890","1645",,,"20150528","20150528","Geen verstrekking in Open Data","196575","Ja",,,,,,,"3","4","0","0",,"0","0","M1",,,"r. dwarsbalk by voorzitting","1890","197",,"e1*2007/46*0233*08","Z38DP0","1ZAAB201","0","0.23","263","Nee","Nee",,"Nee","0","0",,"2024","Logisch","00","Ja","2025-03-14T00:00:00.000","2022-02-25T00:00:00.000","2015-05-28T00:00:00.000","2015-05-28T00:00:00.000",,,,,,,,,,,,,,,,,,,,,"F",,,,,,,"https://opendata.rdw.nl/resource/3huj-srit.json","https://opendata.rdw.nl/resource/8ys7-d773.json","https://opendata.rdw.nl/resource/vezc-m2t6.json","https://opendata.rdw.nl/resource/jhie-znh9.json","https://opendata.rdw.nl/resource/kmfi-hrps.json"
"GJ739Z","Personenauto","MERCEDES-AMG","AMG GT S","20250222","20210224","29465","coupe","2","GRIJS","Niet geregistreerd","8","3982","1545","1890","1645",,,"20150611","20150611","Geen verstrekking in Open Data","202486","Ja",,,,,,,"3","4","0","0",,"0","0","M1",,,"r. dwarsbalk by voorzitting","1890","197",,"e1*2007/46*0233*08","Z38SP0","1ZAAB201","0","0.23","263","Nee","Nee",,"Nee","0","0",,"2024","Logisch","00","Ja","2025-02-22T00:00:00.000","2021-02-24T00:00:00.000","2015-06-11T00:00:00.000","2015-06-11T00:00:00.000",,,,,,,,,,,,,,,,,,,,,"F",,,,,,,"https://opendata.rdw.nl/resource/3huj-srit.json","https://opendata.rdw.nl/resource/8ys7-d773.json","https://opendata.rdw.nl/resource/vezc-m2t6.json","https://opendata.rdw.nl/resource/jhie-znh9.json","https://opendata.rdw.nl/resource/kmfi-hrps.json"
"GN801S","Personenauto","MERCEDES-AMG","AMG GT S","20250222","20210106","29465","coupe","2","GRIJS","Niet geregistreerd","8","3982","1545","1890","1645",,,"20150708","20150708","Geen verstrekking in Open Data","203938","Ja",,,,,,,"3","4","0","0",,"0","0","M1",,,"r. dwarsbalk by voorzitting","1890","197",,"e1*2007/46*0233*08","Z38DP0","1ZAAB201","0","0.23","263","Nee","Nee",,"Nee","0","0",,"2024","Logisch","00","Ja","2025-02-22T00:00:00.000","2021-01-06T00:00:00.000","2015-07-08T00:00:00.000","2015-07-08T00:00:00.000",,,,,,,,,,,,,,,,,,,,,"F",,,,,,,"https://opendata.rdw.nl/resource/3huj-srit.json","https://opendata.rdw.nl/resource/8ys7-d773.json","https://opendata.rdw.nl/resource/vezc-m2t6.json","https://opendata.rdw.nl/resource/jhie-znh9.json","https://opendata.rdw.nl/resource/kmfi-hrps.json"
"GP346S","Personenauto","MERCEDES-AMG","AMG GT S","20250318","20211018","29465","coupe","2","WIT","Niet geregistreerd","8","3982","1545","1890","1645",,,"20150721","20150721","Geen verstrekking in Open Data","186224","Ja",,,,,,,"3","4","0","0",,"0","0","M1",,,"r. dwarsbalk by voorzitting","1890","197",,"e1*2007/46*0233*08","Z38SP0","1ZAAB201","0","0.23","263","Nee","Nee",,"Nee","0","0",,"2024","Logisch","00","Ja","2025-03-18T00:00:00.000","2021-10-18T00:00:00.000","2015-07-21T00:00:00.000","2015-07-21T00:00:00.000",,,,,,,,,,,,,,,,,,,,,"F",,,,,,,"https://opendata.rdw.nl/resource/3huj-srit.json","https://opendata.rdw.nl/resource/8ys7-d773.json","https://opendata.rdw.nl/resource/vezc-m2t6.json","https://opendata.rdw.nl/resource/jhie-znh9.json","https://opendata.rdw.nl/resource/kmfi-hrps.json"
"GP352S","Personenauto","MERCEDES-AMG","AMG GT S","20240811","20150716","29465","coupe","2","GRIJS","Niet geregistreerd","8","3982","1545","1890","1645",,,"20150716","20150716","Geen verstrekking in Open Data","199292","Ja",,,,,,,"3","4","0","0",,"0","0","M1",,,"r. dwarsbalk by voorzitting","1890","197",,"e1*2007/46*0233*08","Z38DP0","1ZAAB201","0","0.23","263","Nee","Nee",,"Nee","0","0",,"2023","Logisch","00","Ja","2024-08-11T00:00:00.000","2015-07-16T00:00:00.000","2015-07-16T00:00:00.000","2015-07-16T00:00:00.000",,,,,,,,,,,,,,,,,,,,,"F",,,,,,,"https://opendata.rdw.nl/resource/3huj-srit.json","https://opendata.rdw.nl/resource/8ys7-d773.json","https://opendata.rdw.nl/resource/vezc-m2t6.json","https://opendata.rdw.nl/resource/jhie-znh9.json","https://opendata.rdw.nl/resource/kmfi-hrps.json"
"GP946H","Personenauto","MERCEDES-AMG","AMG GT S","20240818","20180926","22905","coupe","2","GRIJS","Niet geregistreerd","8","3982","1545","1890","1645",,,"20150112","20150817","Geen verstrekking in Open Data","190769","Ja",,,,,,,"3","4","0","0",,"0","0","M1",,,"r. dwarsbalk by voorzitting","1890","197",,"e1*2007/46*0233*07","Z38SP0","1ZAAB201","0","0.23","263","Nee","Nee",,"Nee","0","0",,"2023","Geen oordeel","05","Ja","2024-08-18T00:00:00.000","2018-09-26T00:00:00.000","2015-01-12T00:00:00.000","2015-08-17T00:00:00.000",,,,,,,,,,,,,,,,,,,,,"F",,,,,,,"https://opendata.rdw.nl/resource/3huj-srit.json","https://opendata.rdw.nl/resource/8ys7-d773.json","https://opendata.rdw.nl/resource/vezc-m2t6.json","https://opendata.rdw.nl/resource/jhie-znh9.json","https://opendata.rdw.nl/resource/kmfi-hrps.json"
"GR403D","Personenauto","MERCEDES-AMG","AMG GT S","20240724","20150724","29465","coupe","2","GEEL","Niet geregistreerd","8","3982","1545","1890","1645",,,"20150724","20150724","Geen verstrekking in Open Data","218313","Ja",,,,,,,"3","4","0","0",,"0","0","M1",,,"r. dwarsbalk by voorzitting","1890","197",,"e1*2007/46*0233*08","Z38DP0","1ZAAB201","0","0.23","263","Nee","Nee",,"Nee","0","0",,"2023","Logisch","00","Ja","2024-07-24T00:00:00.000","2015-07-24T00:00:00.000","2015-07-24T00:00:00.000","2015-07-24T00:00:00.000",,,,,,,,,,,,,,,,,,,,,"F",,,,,,,"https://opendata.rdw.nl/resource/3huj-srit.json","https://opendata.rdw.nl/resource/8ys7-d773.json","https://opendata.rdw.nl/resource/vezc-m2t6.json","https://opendata.rdw.nl/resource/jhie-znh9.json","https://opendata.rdw.nl/resource/kmfi-hrps.json"
"GR495T","Personenauto","MERCEDES-AMG","AMG GT S","20241106","20240430","29465","coupe","2","GRIJS","Niet geregistreerd","8","3982","1545","1890","1645",,,"20150731","20150731","Geen verstrekking in Open Data","198469","Ja",,,,,,,"3","4","0","0",,"0","0","M1",,,"r. dwarsbalk by voorzitting","1890","197",,"e1*2007/46*0233*08","Z38DP0","1ZAAB201","0","0.23","263","Nee","Nee",,"Nee","0","0",,"2024","Logisch","00","Ja","2024-11-06T00:00:00.000","2024-04-30T00:00:00.000","2015-07-31T00:00:00.000","2015-07-31T00:00:00.000",,,,,,,,,,,,,,,,,,,,,"F",,,,,,,"https://opendata.rdw.nl/resource/3huj-srit.json","https://opendata.rdw.nl/resource/8ys7-d773.json","https://opendata.rdw.nl/resource/vezc-m2t6.json","https://opendata.rdw.nl/resource/jhie-znh9.json","https://opendata.rdw.nl/resource/kmfi-hrps.json"
"GS303F","Personenauto","MERCEDES-AMG","AMG GT S","20241020","20231026","29465","coupe","2","GRIJS","Niet geregistreerd","8","3982","1545","1890","1645",,,"20150806","20150806","Geen verstrekking in Open Data","187161","Ja",,,,,,,"3","4","0","0",,"0","0","M1",,,"r. dwarsbalk by voorzitting","1890","197",,"e1*2007/46*0233*08","Z38DP0","1ZAAB201","0","0.23","263","Nee","Nee",,"Nee","0","0",,"2024","Logisch","00","Ja","2024-10-20T00:00:00.000","2023-10-26T00:00:00.000","2015-08-06T00:00:00.000","2015-08-06T00:00:00.000",,,,,,,,,,,,,,,,,,,,,"F",,,,,,,"https://opendata.rdw.nl/resource/3huj-srit.json","https://opendata.rdw.nl/resource/8ys7-d773.json","https://opendata.rdw.nl/resource/vezc-m2t6.json","https://opendata.rdw.nl/resource/jhie-znh9.json","https://opendata.rdw.nl/resource/kmfi-hrps.json"
"GS432V","Personenauto","MERCEDES-AMG","AMG GT S","20250327","20181210","22104","coupe","2","GRIJS","Niet geregistreerd","8","3982","1545","1890","1645",,,"20150327","20150808","Geen verstrekking in Open Data","199978","Ja",,,,,,,"3","4","0","0",,"0","0","M1",,,"r. dwarsbalk by voorzitting","1890","197",,"e1*2007/46*0233*07","Z38DP0","1ZAAB201","0","0.23","263","Nee","Nee",,"Nee","0","0",,"2024","Geen oordeel","05","Ja","2025-03-27T00:00:00.000","2018-12-10T00:00:00.000","2015-03-27T00:00:00.000","2015-08-08T00:00:00.000",,,,,,,,,,,,,,,,,,,,,"F",,,,,,,"https://opendata.rdw.nl/resource/3huj-srit.json","https://opendata.rdw.nl/resource/8ys7-d773.json","https://opendata.rdw.nl/resource/vezc-m2t6.json","https://opendata.rdw.nl/resource/jhie-znh9.json","https://opendata.rdw.nl/resource/kmfi-hrps.json"
"GS434R","Personenauto","MERCEDES-AMG","AMG GT S","20240918","20240105","19816","coupe","2","WIT","Niet geregistreerd","8","3982","1545","1890","1645",,,"20150416","20150811","Geen verstrekking in Open Data","214420","Ja",,,,,,,"3","4","0","0",,"0","0","M1",,,"r. dwarsbalk by voorzitting","1890","197",,"e1*2007/46*0233*08","Z38DP0","1ZAAB201","0","0.23","263","Nee","Nee",,"Nee","0","0",,"2024","Geen oordeel","05","Ja","2024-09-18T00:00:00.000","2024-01-05T00:00:00.000","2015-04-16T00:00:00.000","2015-08-11T00:00:00.000",,,,,,,,,,,,,,,,,,,,,"F",,,,,,,"https://opendata.rdw.nl/resource/3huj-srit.json","https://opendata.rdw.nl/resource/8ys7-d773.json","https://opendata.rdw.nl/resource/vezc-m2t6.json","https://opendata.rdw.nl/resource/jhie-znh9.json","https://opendata.rdw.nl/resource/kmfi-hrps.json"