"kenteken","voertuigsoort","merk","handelsbenaming","vervaldatum_apk","datum_tenaamstelling","bruto_bpm","inrichting","aantal_zitplaatsen","eerste_kleur","tweede_kleur","aantal_cilinders","cilinderinhoud","massa_ledig_voertuig","toegestane_maximum_massa_voertuig","massa_rijklaar","maximum_massa_trekken_ongeremd","maximum_trekken_massa_geremd","datum_eerste_toelating","datum_eerste_tenaamstelling_in_nederland","wacht_op_keuren","catalogusprijs","wam_verzekerd","maximale_constructiesnelheid","laadvermogen","oplegger_geremd","aanhangwagen_autonoom_geremd","aanhangwagen_middenas_geremd","aantal_staanplaatsen","aantal_deuren","aantal_wielen","afstand_hart_koppeling_tot_achterzijde_voertuig","afstand_voorzijde_voertuig_tot_hart_koppeling","afwijkende_maximum_snelheid","lengte","breedte","europese_voertuigcategorie","europese_voertuigcategorie_toevoeging","europese_uitvoeringcategorie_toevoeging","plaats_chassisnummer","technische_max_massa_voertuig","type","type_gasinstallatie","typegoedkeuringsnummer","variant","uitvoering","volgnummer_wijziging_eu_typegoedkeuring","vermogen_massarijklaar","wielbasis","export_indicator","openstaande_terugroepactie_indicator","vervaldatum_tachograaf","taxi_indicator","maximum_massa_samenstelling","aantal_rolstoelplaatsen","maximum_ondersteunende_snelheid","jaar_laatste_registratie_tellerstand","tellerstandoordeel","code_toelichting_tellerstandoordeel","tenaamstellen_mogelijk","vervaldatum_apk_dt","datum_tenaamstelling_dt","datum_eerste_toelating_dt","datum_eerste_tenaamstelling_in_nederland_dt","vervaldatum_tachograaf_dt","maximum_last_onder_de_vooras_sen_tezamen_koppeling","type_remsysteem_voertuig_code","rupsonderstelconfiguratiecode","wielbasis_voertuig_minimum","wielbasis_voertuig_maximum","lengte_voertuig_minimum","lengte_voertuig_maximum","breedte_voertuig_minimum","breedte_voertuig_maximum","hoogte_voertuig","hoogte_voertuig_minimum","hoogte_voertuig_maximum","massa_bedrijfsklaar_minimaal","massa_bedrijfsklaar_maximaal","technisch_toelaatbaar_massa_koppelpunt","maximum_massa_technisch_maximaal","maximum_massa_technisch_minimaal","subcategorie_nederland","verticale_belasting_koppelpunt_getrokken_voertuig","zuinigheidsclassificatie","registratie_datum_goedkeuring_afschrijvingsmoment_bpm","registratie_datum_goedkeuring_afschrijvingsmoment_bpm_dt","gem_lading_wrde","aerodyn_voorz","massa_alt_aandr","verl_cab_ind","api_gekentekende_voertuigen_assen","api_gekentekende_voertuigen_brandstof","api_gekentekende_voertuigen_carrosserie","api_gekentekende_voertuigen_carrosserie_specifiek","api_gekentekende_voertuigen_voertuigklasse"
"2TLR45","Personenauto","HYUNDAI","IX20","20240914","20220118","3153","hatchback","5","WIT","Niet geregistreerd","4","1396","1153","1710","1253","550","1300","20110914","20140516","Geen verstrekking in Open Data","16604","Ja",,,,,,,"4","4",,,,,,"M1",,,"r. dwarsbalk by voorzitting","1710",,,,,,,"0.05","262","Nee","Nee",,"Nee","3010",,,"2023","Geen oordeel","05","Ja","2024-09-14T00:00:00.000","2022-01-18T00:00:00.000","2011-09-14T00:00:00.000","2014-05-16T00:00:00.000",,"0",,,,,,,,,,,,,,,,,,,,,,,,,,"https://opendata.rdw.nl/resource/3huj-srit.json","https://opendata.rdw.nl/resource/8ys7-d773.json","https://opendata.rdw.nl/resource/vezc-m2t6.json","https://opendata.rdw.nl/resource/jhie-znh9.json","https://opendata.rdw.nl/resource/kmfi-hrps.json"
"3TJG93","Personenauto","HYUNDAI","IX20","20241210","20191210","3225","hatchback","5","GRIJS","Niet geregistreerd","4","1396","1153","1710","1253","550","1300","20110518","20150108","Geen verstrekking in Open Data","17124","Ja",,,,,,,"4","4",,,,,,"M1",,,"r. dwarsbalk by voorzitting","1710",,,,,,,"0.05","262","Nee","Nee",,"Nee",,,,"2023","Geen oordeel","05","Ja","2024-12-10T00:00:00.000","2019-12-10T00:00:00.000","2011-05-18T00:00:00.000","2015-01-08T00:00:00.000",,"0",,,,,,,,,,,,,,,,,,,,,,,,,,"https://opendata.rdw.nl/resource/3huj-srit.json","https://opendata.rdw.nl/resource/8ys7-d773.json","https://opendata.rdw.nl/resource/vezc-m2t6.json","https://opendata.rdw.nl/resource/jhie-znh9.json","https://opendata.rdw.nl/resource/kmfi-hrps.json"
"3ZVD44","Personenauto","HYUNDAI","IX20","20250421","20150511","4807","hatchback","5","BRUIN","Niet geregistreerd","4","1396","1153","1710","1253","550","1300","20120903","20150511","Geen verstrekking in Open Data","20025","Ja",,,,,,,"4","4",,,,,,"M1",,,"r. dwarsbalk v. voorzitting","1710",,,,,,,"0.05","263","Nee","Nee",,"Nee","3010",,,"2024","Geen oordeel","05","Ja","2025-04-21T00:00:00.000","2015-05-11T00:00:00.000","2012-09-03T00:00:00.000","2015-05-11T00:00:00.000",,,,,,,,,,,,,,,,,,,,,,,,,,,,"https://opendata.rdw.nl/resource/3huj-srit.json","https://opendata.rdw.nl/resource/8ys7-d773.json","https://opendata.rdw.nl/resource/vezc-m2t6.json","https://opendata.rdw.nl/resource/jhie-znh9.json","https://opendata.rdw.nl/resource/kmfi-hrps.json"
"6XKL84","Personenauto","HYUNDAI","IX20","20241228","20141219","3431","hatchback","5","BRUIN","Niet geregistreerd","4","1396","1223","1710","1323","550","1300","20111228","20141219","Geen verstrekking in Open Data","18625","Ja",,,,,,,"4","4",,,,,,"M1",,,"r. dwarsbalk v. voorzitting","1710",,,,,,,"0.05","262","Nee","Nee",,"Nee","3010",,,"2023","Geen oordeel","05","Ja","2024-12-28T00:00:00.000","2014-12-19T00:00:00.000","2011-12-28T00:00:00.000","2014-12-19T00:00:00.000",,,,,,,,,,,,,,,,,,,,,,"20221221","2022-12-21T00:00:00.000",,,,,"https://opendata.rdw.nl/resource/3huj-srit.json","https://opendata.rdw.nl/resource/8ys7-d773.json","https://opendata.rdw.nl/resource/vezc-m2t6.json","https://opendata.rdw.nl/resource/jhie-znh9.json","https://opendata.rdw.nl/resource/kmfi-hrps.json"
"7TJD98","Personenauto","HYUNDAI","IX20","20250226","20140228","2936","hatchback","5","GRIJS","Niet geregistreerd","4","1396","1153","1710","1253","550","1300","20101209","20140228","Geen verstrekking in Open Data","16854","Ja",,,,,,,"4","4",,,,,,"M1",,,"r. dwarsbalk by voorzitting","1710",,,,,,,"0.05","262","Nee","Nee",,"Nee",,,,"2024","Geen oordeel","05","Ja","2025-02-26T00:00:00.000","2014-02-28T00:00:00.000","2010-12-09T00:00:00.000","2014-02-28T00:00:00.000",,"0",,,,,,,,,,,,,,,,,,,,,,,,,,"https://opendata.rdw.nl/resource/3huj-srit.json","https://opendata.rdw.nl/resource/8ys7-d773.json","https://opendata.rdw.nl/resource/vezc-m2t6.json","https://opendata.rdw.nl/resource/jhie-znh9.json","https://opendata.rdw.nl/resource/kmfi-hrps.json"
"GJ699V","Personenauto","HYUNDAI","IX20","20250209","20230209","4509","hatchback","5","BLAUW","Niet geregistreerd","4","1591","1169","1730","1269","550","1100","20110107","20150616","Geen verstrekking in Open Data","21105","Ja",,,,,,,"4","4",,,,,,"M1",,,"r. bodemplaat by voorzitting","1730",,,,,,,"0.07","262","Nee","Nee",,"Nee",,,,"2024","Geen oordeel","05","Ja","2025-02-09T00:00:00.000","2023-02-09T00:00:00.000","2011-01-07T00:00:00.000","2015-06-16T00:00:00.000",,,,,,,,,,,,,,,,,,,,,,,,,,,,"https://opendata.rdw.nl/resource/3huj-srit.json","https://opendata.rdw.nl/resource/8ys7-d773.json","https://opendata.rdw.nl/resource/vezc-m2t6.json","https://opendata.rdw.nl/resource/jhie-znh9.json","https://opendata.rdw.nl/resource/kmfi-hrps.json"
"GN359P","Personenauto","HYUNDAI","IX20","20250512","20210715","3431","hatchback","5","GRIJS","Niet geregistreerd","4","1396","1153","1710","1253","550","1300","20110919","20160310","Geen verstrekking in Open Data","18625","Ja",,,,,,,"4","4",,,,,,"M1",,,"onder voorzitting r. bodemplaat","1710",,,,,,,"0.05","262","Nee","Nee",,"Nee",,,,"2024","Geen oordeel","05","Ja","2025-05-12T00:00:00.000","2021-07-15T00:00:00.000","2011-09-19T00:00:00.000","2016-03-10T00:00:00.000",,,,,,,,,,,,,,,,,,,,,,,,,,,,"https://opendata.rdw.nl/resource/3huj-srit.json","https://opendata.rdw.nl/resource/8ys7-d773.json","https://opendata.rdw.nl/resource/vezc-m2t6.json","https://opendata.rdw.nl/resource/jhie-znh9.json","https://opendata.rdw.nl/resource/kmfi-hrps.json"
"HK586X","Personenauto","HYUNDAI","IX20","20241219","20221223","6804","hatchback","5","GRIJS","Niet geregistreerd","4","1591","1118","1710","1218","550","1300","20130313","20161216","Geen verstrekking in Open Data","24571","Ja",,,,,,,"4","4",,,,,,"M1",,,"r. voorzitting","1710","JC",,,,,,"0.08","262","Nee","Nee",,"Nee","3010",,,"2024","Geen oordeel","02","Ja","2024-12-19T00:00:00.000","2022-12-23T00:00:00.000","2013-03-13T00:00:00.000","2016-12-16T00:00:00.000",,,,,,,,,,,,,,,,,,,,,,,,,,,,"https://opendata.rdw.nl/resource/3huj-srit.json","https://opendata.rdw.nl/resource/8ys7-d773.json","https://opendata.rdw.nl/resource/vezc-m2t6.json","https://opendata.rdw.nl/resource/jhie-znh9.json","https://opendata.rdw.nl/resource/kmfi-hrps.json"
"HZ433B","Personenauto","HYUNDAI","IX20","20250401","20160401","3431","hatchback","5","BRUIN","Niet geregistreerd","4","1396","1196","1710","1296","550",,"20111109","20160401","Geen verstrekking in Open Data","18625","Ja",,,,,,,"4","4",,,,,,"M1",,,"r. dwarsbalk v. voorzitting","1710","JC",,,,,,"0.05","263","Nee","Nee",,"Nee","3010",,,"2024","Geen oordeel","05","Ja","2025-04-01T00:00:00.000","2016-04-01T00:00:00.000","2011-11-09T00:00:00.000","2016-04-01T00:00:00.000",,,,,,,,,,,,,,,,,,,,,,,,,,,,"https://opendata.rdw.nl/resource/3huj-srit.json","https://opendata.rdw.nl/resource/8ys7-d773.json","https://opendata.rdw.nl/resource/vezc-m2t6.json","https://opendata.rdw.nl/resource/jhie-znh9.json","https://opendata.rdw.nl/resource/kmfi-hrps.json"
"K409BB","Personenauto","HYUNDAI","IX20","20240713","20201111","11560","hatchback","5","GRIJS","Niet geregistreerd","4","1396","1189","1710","1289","550","1300","20150312","20201111","Geen verstrekking in Open Data","25312","Ja",,,,,,,"4","4",,,,,,"M1",,,,"1710","JC",,,,,,"0.05","262","Nee","Nee",,"Nee","2010",,,"2024","Geen oordeel","05","Ja","2024-07-13T00:00:00.000","2020-11-11T00:00:00.000","2015-03-12T00:00:00.000","2020-11-11T00:00:00.000",,,,,,,,,,,,,,,,,,,,,,,,,,,,"https://opendata.rdw.nl/resource/3huj-srit.json","https://opendata.rdw.nl/resource/8ys7-d773.json","https://opendata.rdw.nl/resource/vezc-m2t6.json","https://opendata.rdw.nl/resource/jhie-znh9.json","https://opendata.rdw.nl/resource/kmfi-hrps.json"
"KD374V","Personenauto","HYUNDAI","IX20","20250131","20200201","3153","hatchback","5","ZWART","Niet geregistreerd","4","1396","1153","1710","1253","550","1300","20110919","20160810","Geen verstrekking in Open Data","16604","Ja",,,,,,,"4","4",,,,,,"M1",,,"r. dwarsbalk by voorzitting","1710","JC",,,,,,"0.05","262","Nee","Nee",,"Nee","3010",,,"2024","Geen oordeel","05","Ja","2025-01-31T00:00:00.000","2020-02-01T00:00:00.000","2011-09-19T00:00:00.000","2016-08-10T00:00:00.000",,,,,,,,,,,,,,,,,,,,,,,,,,,,"https://opendata.rdw.nl/resource/3huj-srit.json","https://opendata.rdw.nl/resource/8ys7-d773.json","https://opendata.rdw.nl/resource/vezc-m2t6.json","https://opendata.rdw.nl/resource/jhie-znh9.json","https://opendata.rdw.nl/resource/kmfi-hrps.json"
"KV883X","Personenauto","HYUNDAI","IX20","20250506","20180614","5959","hatchback","5","WIT","Niet geregistreerd","4","1396","1189","1710","1289","550","1300","20150506","20180614","Geen verstrekking in Open Data","19995","Ja",,,,,,,"4","4",,,,,,"M1",,,"r. by voorzitting","1710",,,,,,,"0.05","262","Nee","Nee",,"Nee","3010",,,"2024","Geen oordeel","05","Ja","2025-05-06T00:00:00.000","2018-06-14T00:00:00.000","2015-05-06T00:00:00.000","2018-06-14T00:00:00.000",,,,,,,,,,,,,,,,,,,,,,,,,,,,"https://opendata.rdw.nl/resource/3huj-srit.json","https://opendata.rdw.nl/resource/8ys7-d773.json","https://opendata.rdw.nl/resource/vezc-m2t6.json","https://opendata.rdw.nl/resource/jhie-znh9.json","https://opendata.rdw.nl/resource/kmfi-hrps.json"
"NJ240K","Personenauto","HYUNDAI","IX20","20250122","20180124","977","hatchback","5","BRUIN","Niet geregistreerd","4","1591","1270","1730","1370","550","1100","20130121","20180124","Geen verstrekking in Open Data","24505","Ja",,,,,,,"4","4",,,,,,"M1",,,"r. dwarsbalk v. voorzitting","1730","JC",,,,,,"0.07","262","Nee","Nee",,"Nee","2830",,,"2023","Geen oordeel","05","Ja","2025-01-22T00:00:00.000","2018-01-24T00:00:00.000","2013-01-21T00:00:00.000","2018-01-24T00:00:00.000",,,,,,,,,,,,,,,,,,,,,,,,,,,,"https://opendata.rdw.nl/resource/3huj-srit.json","https://opendata.rdw.nl/resource/8ys7-d773.json","https://opendata.rdw.nl/resource/vezc-m2t6.json","https://opendata.rdw.nl/resource/jhie-znh9.json","https://opendata.rdw.nl/resource/kmfi-hrps.json"
"PK461N","Personenauto","HYUNDAI","IX20","20240801","20180802","3660","hatchback","5","WIT","Niet geregistreerd","4","1396","1153","1710","1253","550","1300","20120411","20170824","Geen verstrekking in Open Data","17495","Ja",,,,,,,"4","4",,,,,,"M1",,,"r. voorzitting","1710","JC",,,,,,"0.05","262","Nee","Nee",,"Nee","3010",,,"2023","Geen oordeel","05","Ja","2024-08-01T00:00:00.000","2018-08-02T00:00:00.000","2012-04-11T00:00:00.000","2017-08-24T00:00:00.000",,,,,,,,,,,,,,,,,,,,,,,,,,,,"https://opendata.rdw.nl/resource/3huj-srit.json","https://opendata.rdw.nl/resource/8ys7-d773.json","https://opendata.rdw.nl/resource/vezc-m2t6.json","https://opendata.rdw.nl/resource/jhie-znh9.json","https://opendata.rdw.nl/resource/kmfi-hrps.json"
"RF867P","Personenauto","HYUNDAI","IX20","20250515","20180518","3431","hatchback","5","GRIJS","Niet geregistreerd","4","1396","1153","1710","1253","550","1300","20110907","20180518","Geen verstrekking in Open Data","18625","Ja",,,,,,,"4","4",,,,,,"M1",,,"r. balk onder voorzitting","1710","JC",,,,,,"0.05","261","Nee","Nee",,"Nee","3010",,,"2024","Geen oordeel","05","Ja","2025-05-15T00:00:00.000","2018-05-18T00:00:00.000","2011-09-07T00:00:00.000","2018-05-18T00:00:00.000",,,,,,,,,,,,,,,,,,,,,,,,,,,,"https://opendata.rdw.nl/resource/3huj-srit.json","https://opendata.rdw.nl/resource/8ys7-d773.json","https://opendata.rdw.nl/resource/vezc-m2t6.json","https://opendata.rdw.nl/resource/jhie-znh9.json","https://opendata.rdw.nl/resource/kmfi-hrps.json"
"RJ761P","Personenauto","HYUNDAI","IX20","20241230","20211231","4052","hatchback","5","GRIJS","Niet geregistreerd","4","1591","1155","1710","1255","550","1300","20110511","20171205","Geen verstrekking in Open Data","20079","Ja",,,,,,,"4","4",,,,,,"M1",,,,"1710","JC",,,,,,"0.07","262","Nee","Nee",,"Nee","3010",,,"2023","Geen oordeel","05","Ja","2024-12-30T00:00:00.000","2021-12-31T00:00:00.000","2011-05-11T00:00:00.000","2017-12-05T00:00:00.000",,,,,,,,,,,,,,,,,,,,,,,,,,,,"https://opendata.rdw.nl/resource/3huj-srit.json","https://opendata.rdw.nl/resource/8ys7-d773.json","https://opendata.rdw.nl/resource/vezc-m2t6.json","https://opendata.rdw.nl/resource/jhie-znh9.json","https://opendata.rdw.nl/resource/kmfi-hrps.json"
"TD042N","Personenauto","HYUNDAI","IX20","20250425","20180716","3682","hatchback","5","WIT","Niet geregistreerd","4","1591","1180","1730","1280","550","1100","20120910","20180716","Geen verstrekking in Open Data","20090","Ja",,,,,,,"4","4",,,,,,"M1",,,,"1730","JC",,,,,,"0.07","262","Nee","Nee",,"Nee","2830",,,"2024","Geen oordeel","05","Ja","2025-04-25T00:00:00.000","2018-07-16T00:00:00.000","2012-09-10T00:00:00.000","2018-07-16T00:00:00.000",,,,,,,,,,,,,,,,,,,,,,,,,,,,"https://opendata.rdw.nl/resource/3huj-srit.json","https://opendata.rdw.nl/resource/8ys7-d773.json","https://opendata.rdw.nl/resource/vezc-m2t6.json","https://opendata.rdw.nl/resource/jhie-znh9.json","https://opendata.rdw.nl/resource/kmfi-hrps.json"
"TD507G","Personenauto","HYUNDAI","IX20","20260214","20180709","4507","hatchback","5","BLAUW","Niet geregistreerd","4","1396","1197","1710","1297","550","1300","20180213","20180709","Geen verstrekking in Open Data","23372","Ja",,,,,,,"4","4",,,,,,"M1",,,,"1710","JC",,,,,,"0.05","261","Nee","Nee",,"Nee","3010",,,"2024","Geen oordeel","05","Ja","2026-02-14T00:00:00.000","2018-07-09T00:00:00.000","2018-02-13T00:00:00.000","2018-07-09T00:00:00.000",,,,,,,,,,,,,,,,,,,,,,,,,,,,"https://opendata.rdw.nl/resource/3huj-srit.json","https://opendata.rdw.nl/resource/8ys7-d773.json","https://opendata.rdw.nl/resource/vezc-m2t6.json","https://opendata.rdw.nl/resource/jhie-znh9.json","https://opendata.rdw.nl/resource/kmfi-hrps.json"
"TG987T","Personenauto","HYUNDAI","IX20","20241026","20181102","2228","hatchback","5","ZWART","Niet geregistreerd","4","1591","1194","1730","1294","550","1100","20130910","20180727","Geen verstrekking in Open Data","25755","Ja",,,,,,,"4","4",,,,,,"M1",,,,"1730","JC",,,,,,"0.07","262","Nee","Nee",,"Nee","2830",,,"2023","Geen oordeel","05","Ja","2024-10-26T00:00:00.000","2018-11-02T00:00:00.000","2013-09-10T00:00:00.000","2018-07-27T00:00:00.000",,,,,,,,,,,,,,,,,,,,,,,,,,,,"https://opendata.rdw.nl/resource/3huj-srit.json","https://opendata.rdw.nl/resource/8ys7-d773.json","https://opendata.rdw.nl/resource/vezc-m2t6.json","https://opendata.rdw.nl/resource/jhie-znh9.json","https://opendata.rdw.nl/resource/kmfi-hrps.json"
"TZ495L","Personenauto","HYUNDAI","IX20","20251020","20190916","4161","hatchback","5","GRIJS","Niet geregistreerd","4","1396","1192","1710","1292","550","1300","20171222","20190107","Geen verstrekking in Open Data","23170","Ja",,,,,,,"4","4",,,,,,"M1",,,"r. balk by voorzitting","1710","JC",,,,,,"0.05","262","Nee","Nee",,"Nee","3010",,,"2023","Geen oordeel","05","Ja","2025-10-20T00:00:00.000","2019-09-16T00:00:00.000","2017-12-22T00:00:00.000","2019-01-07T00:00:00.000",,,,,,,,,,,,,,,,,,,,,,,,,,,,"https://opendata.rdw.nl/resource/3huj-srit.json","https://opendata.rdw.nl/resource/8ys7-d773.json","https://opendata.rdw.nl/resource/vezc-m2t6.json","https://opendata.rdw.nl/resource/jhie-znh9.json","https://opendata.rdw.nl/resource/kmfi-hrps.json"
"XD235J","Personenauto","HYUNDAI","IX20","20260206","20190725","4081","hatchback","5","WIT","Niet geregistreerd","4","1591","1235","1780","1335","550","1100","20180206","20190716","Geen verstrekking in Open Data","28371","Ja",,,,,,,"4","4",,,,,,"M1",,,"r. bodemplaat by voorzitting","1780",,,,,,,"0.07","262","Nee","Nee",,"Nee","2880",,,"2024","Geen oordeel","05","Ja","2026-02-06T00:00:00.000","2019-07-25T00:00:00.000","2018-02-06T00:00:00.000","2019-07-16T00:00:00.000",,,,,,,,,,,,,,,,,,,,,,,,,,,,"https://opendata.rdw.nl/resource/3huj-srit.json","https://opendata.rdw.nl/resource/8ys7-d773.json","https://opendata.rdw.nl/resource/vezc-m2t6.json","https://opendata.rdw.nl/resource/jhie-znh9.json","https://opendata.rdw.nl/resource/kmfi-hrps.json"
"XD828S","Personenauto","HYUNDAI","IX20","20251222","20181214","5276","hatchback","5","BLAUW","Niet geregistreerd","4","1396","1192","1710","1292","550","1300","20171214","20181214","Geen verstrekking in Open Data","23170","Ja",,,,,,,"4","4",,,,,,"M1",,,"r. by voorzitting","1710",,,,,,,"0.05","261","Nee","Nee",,"Nee",,,,"2023","Geen oordeel","05","Ja","2025-12-22T00:00:00.000","2018-12-14T00:00:00.000","2017-12-14T00:00:00.000","2018-12-14T00:00:00.000",,,,,,,,,,,,,,,,,,,,,,,,,,,,"https://opendata.rdw.nl/resource/3huj-srit.json","https://opendata.rdw.nl/resource/8ys7-d773.json","https://opendata.rdw.nl/resource/vezc-m2t6.json","https://opendata.rdw.nl/resource/jhie-znh9.json","https://opendata.rdw.nl/resource/kmfi-hrps.json"
"XP424V","Personenauto","HYUNDAI","IX20","20240523","20190227","4456","hatchback","5","GRIJS","Niet geregistreerd","4","1396","1197","1710","1297","550","1300","20180523","20190227","Geen verstrekking in Open Data","23371","Ja",,,,,,,"4","4",,,,,,"M1",,,"r. balk by bodemplaat","1710",,,,,,,"0.05","262","Nee","Nee",,"Nee","3010",,,"2023","Geen oordeel","05","Ja","2024-05-23T00:00:00.000","2019-02-27T00:00:00.000","2018-05-23T00:00:00.000","2019-02-27T00:00:00.000",,,,,,,,,,,,,,,,,,,,,,,,,,,,"https://opendata.rdw.nl/resource/3huj-srit.json","https://opendata.rdw.nl/resource/8ys7-d773.json","https://opendata.rdw.nl/resource/vezc-m2t6.json","https://opendata.rdw.nl/resource/jhie-znh9.json","https://opendata.rdw.nl/resource/kmfi-hrps.json"
"XP671Z","Personenauto","HYUNDAI","IX20","20260213","20200309","2089","hatchback","5","GRIJS","Niet geregistreerd","4","1591","1197","1780","1297","550","1100","20180213","20190726","Geen verstrekking in Open Data","28371","Ja",,,,,,,"5","4","0","0",,"412","0","M1",,,"r. dwarsbalk by voorzitting","1780","JC",,"e4*2007/46*0207*10","F5P81","A61AZ1","0","0.07","262","Nee","Nee",,"Nee","2880","0","0.00","2024","Geen oordeel","05","Ja","2026-02-13T00:00:00.000","2020-03-09T00:00:00.000","2018-02-13T00:00:00.000","2019-07-26T00:00:00.000",,,,,,,,,,,,,,,,,,,,,"F",,,,,,,"https://opendata.rdw.nl/resource/3huj-srit.json","https://opendata.rdw.nl/resource/8ys7-d773.json","https://opendata.rdw.nl/resource/vezc-m2t6.json","https://opendata.rdw.nl/resource/jhie-znh9.json","https://opendata.rdw.nl/resource/kmfi-hrps.json"
"ZG914J","Personenauto","HYUNDAI","IX20","20240619","20190619","2680","hatchback","5","ZWART","Niet geregistreerd","4","1396","1198","1710","1298","550","1300","20130319","20190523","Geen verstrekking in Open Data","21524","Ja",,,,,,,"4","4",,,,,,"M1",,,,"1710","JC",,,,,,"0.05","262","Nee","Nee",,"Nee","3010",,,"2023","Geen oordeel","05","Ja","2024-06-19T00:00:00.000","2019-06-19T00:00:00.000","2013-03-19T00:00:00.000","2019-05-23T00:00:00.000",,,,,,,,,,,,,,,,,,,,,,,,,,,,"https://opendata.rdw.nl/resource/3huj-srit.json","https://opendata.rdw.nl/resource/8ys7-d773.json","https://opendata.rdw.nl/resource/vezc-m2t6.json","https://opendata.rdw.nl/resource/jhie-znh9.json","https://opendata.rdw.nl/resource/kmfi-hrps.json"
