"kenteken","voertuigsoort","merk","handelsbenaming","vervaldatum_apk","datum_tenaamstelling","bruto_bpm","inrichting","aantal_zitplaatsen","eerste_kleur","tweede_kleur","aantal_cilinders","cilinderinhoud","massa_ledig_voertuig","toegestane_maximum_massa_voertuig","massa_rijklaar","maximum_massa_trekken_ongeremd","maximum_trekken_massa_geremd","datum_eerste_toelating","datum_eerste_tenaamstelling_in_nederland","wacht_op_keuren","catalogusprijs","wam_verzekerd","maximale_constructiesnelheid","laadvermogen","oplegger_geremd","aanhangwagen_autonoom_geremd","aanhangwagen_middenas_geremd","aantal_staanplaatsen","aantal_deuren","aantal_wielen","afstand_hart_koppeling_tot_achterzijde_voertuig","afstand_voorzijde_voertuig_tot_hart_koppeling","afwijkende_maximum_snelheid","lengte","breedte","europese_voertuigcategorie","europese_voertuigcategorie_toevoeging","europese_uitvoeringcategorie_toevoeging","plaats_chassisnummer","technische_max_massa_voertuig","type","type_gasinstallatie","typegoedkeuringsnummer","variant","uitvoering","volgnummer_wijziging_eu_typegoedkeuring","vermogen_massarijklaar","wielbasis","export_indicator","openstaande_terugroepactie_indicator","vervaldatum_tachograaf","taxi_indicator","maximum_massa_samenstelling","aantal_rolstoelplaatsen","maximum_ondersteunende_snelheid","jaar_laatste_registratie_tellerstand","tellerstandoordeel","code_toelichting_tellerstandoordeel","tenaamstellen_mogelijk","vervaldatum_apk_dt","datum_tenaamstelling_dt","datum_eerste_toelating_dt","datum_eerste_tenaamstelling_in_nederland_dt","vervaldatum_tachograaf_dt","maximum_last_onder_de_vooras_sen_tezamen_koppeling","type_remsysteem_voertuig_code","rupsonderstelconfiguratiecode","wielbasis_voertuig_minimum","wielbasis_voertuig_maximum","lengte_voertuig_minimum","lengte_voertuig_maximum","breedte_voertuig_minimum","breedte_voertuig_maximum","hoogte_voertuig","hoogte_voertuig_minimum","hoogte_voertuig_maximum","massa_bedrijfsklaar_minimaal","massa_bedrijfsklaar_maximaal","technisch_toelaatbaar_massa_koppelpunt","maximum_massa_technisch_maximaal","maximum_massa_technisch_minimaal","subcategorie_nederland","verticale_belasting_koppelpunt_getrokken_voertuig","zuinigheidsclassificatie","registratie_datum_goedkeuring_afschrijvingsmoment_bpm","registratie_datum_goedkeuring_afschrijvingsmoment_bpm_dt","gem_lading_wrde","aerodyn_voorz","massa_alt_aandr","verl_cab_ind","api_gekentekende_voertuigen_assen","api_gekentekende_voertuigen_brandstof","api_gekentekende_voertuigen_carrosserie","api_gekentekende_voertuigen_carrosserie_specifiek","api_gekentekende_voertuigen_voertuigklasse"
"00BR79","Personenauto","HONDA","CIVIC",,"19990428",,"Niet geregistreerd",,"ORANJE","Niet geregistreerd","4",,"680",,"780",,,"19740308","19740308","Geen verstrekking in Open Data",,"Nee",,,,,,,"2","4","0","0",,"0","0","M1",,,"tegen schutbord onder motorkap","0",,,,,,"0","0.00","220","Nee","Nee",,"Nee","0",,,,"Niet geregistreerd","NG","Ja",,"1999-04-28T00:00:00.000","1974-03-08T00:00:00.000","1974-03-08T00:00:00.000",,"0",,,,,,,,,,,,,,,,,,,,,,,,,,"https://opendata.rdw.nl/resource/3huj-srit.json","https://opendata.rdw.nl/resource/8ys7-d773.json","https://opendata.rdw.nl/resource/vezc-m2t6.json","https://opendata.rdw.nl/resource/jhie-znh9.json","https://opendata.rdw.nl/resource/kmfi-hrps.json"
"00BR86","Personenauto","HONDA","CIVIC",,"20150919",,"Niet geregistreerd",,"ROOD","Niet geregistreerd","4",,"680",,"780",,,"19740307","19740307","Geen verstrekking in Open Data",,"Ja",,,,,,,"2","4","0","0",,"0","0","M1",,,"tegen schutbord onder motorkap","0",,,,,,"0","0.00","220","Nee","Nee",,"Nee","0",,,"2023","Geen oordeel","01","Ja",,"2015-09-19T00:00:00.000","1974-03-07T00:00:00.000","1974-03-07T00:00:00.000",,,,,,,,,,,,,,,,,,,,,,,,,,,,"https://opendata.rdw.nl/resource/3huj-srit.json","https://opendata.rdw.nl/resource/8ys7-d773.json","https://opendata.rdw.nl/resource/vezc-m2t6.json","https://opendata.rdw.nl/resource/jhie-znh9.json","https://opendata.rdw.nl/resource/kmfi-hrps.json"
"00BR90","Personenauto","HONDA","CIVIC",,"20010112",,"Niet geregistreerd",,"WIT","Niet geregistreerd","4",,"680",,"780",,,"19740319","19740319","Geen verstrekking in Open Data",,"Ja",,,,,,,"2","4","0","0",,"0","0","M1",,,"tegen schutbord onder motorkap","0",,,,,,"0","0.00","220","Nee","Nee",,"Nee","0",,,"2023","Geen oordeel","01","Ja",,"2001-01-12T00:00:00.000","1974-03-19T00:00:00.000","1974-03-19T00:00:00.000",,"0",,,,,,,,,,,,,,,,,,,,,,,,,,"https://opendata.rdw.nl/resource/3huj-srit.json","https://opendata.rdw.nl/resource/8ys7-d773.json","https://opendata.rdw.nl/resource/vezc-m2t6.json","https://opendata.rdw.nl/resource/jhie-znh9.json","https://opendata.rdw.nl/resource/kmfi-hrps.json"
"00GBG3","Personenauto","HONDA","CIVIC 4DR HYBRID","20240903","20200905","639","sedan","5","ROOD","Niet geregistreerd","4","1339","1268","1720","1368",,,"20080526","20080526","Geen verstrekking in Open Data","24501","Ja",,,,,,,"4","4","0","0",,"455","0","M1",,,"r. tegen schutbord onder motorkap","1720",,,"e11*2001/116*0271*01","1","2","1","0.00","270","Nee","Nee",,"Nee","0","0",,"2023","Geen oordeel","07","Ja","2024-09-03T00:00:00.000","2020-09-05T00:00:00.000","2008-05-26T00:00:00.000","2008-05-26T00:00:00.000",,,,,,,,,,,,,,,,,,,,,"A",,,,,,,"https://opendata.rdw.nl/resource/3huj-srit.json","https://opendata.rdw.nl/resource/8ys7-d773.json","https://opendata.rdw.nl/resource/vezc-m2t6.json","https://opendata.rdw.nl/resource/jhie-znh9.json","https://opendata.rdw.nl/resource/kmfi-hrps.json"
"00GBK6","Personenauto","HONDA","HONDA CR-V","20240925","20150925","8808","MPV","5","GRIJS","Niet geregistreerd","4","1997","1469","2050","1569","600","1600","20080530","20080530","Geen verstrekking in Open Data","36520","Ja",,,,,,,"4","4","0","0",,"0","0","M1",,,"r. tegen schutbord onder motorkap","2050",,,"e11*2001/116*0301*00","1","1","0","0.07","263","Nee","Nee",,"Nee","3650","0",,"2023","Logisch","00","Ja","2024-09-25T00:00:00.000","2015-09-25T00:00:00.000","2008-05-30T00:00:00.000","2008-05-30T00:00:00.000",,,,,,,,,,,,,,,,,,,,,"D",,,,,,,"https://opendata.rdw.nl/resource/3huj-srit.json","https://opendata.rdw.nl/resource/8ys7-d773.json","https://opendata.rdw.nl/resource/vezc-m2t6.json","https://opendata.rdw.nl/resource/jhie-znh9.json","https://opendata.rdw.nl/resource/kmfi-hrps.json"
"00GDF7","Personenauto","HONDA","CIVIC 5DR","20240809","20240416","4057","hatchback","5","ROOD","Niet geregistreerd","4","1339","1140","1650","1240","500","1200","20080625","20080625","Geen verstrekking in Open Data","21500","Ja",,,,,,,"4","4","0","0",,"425","0","M1",,,"r. tegen schutbord onder motorkap","1650",,,"e11*2001/116*0255*03","1","2","0","0.05","262","Nee","Nee",,"Nee","2850","0","0.00","2023","Logisch","00","Ja","2024-08-09T00:00:00.000","2024-04-16T00:00:00.000","2008-06-25T00:00:00.000","2008-06-25T00:00:00.000",,,,,,,,,,,,,,,,,,,,,"B",,,,,,,"https://opendata.rdw.nl/resource/3huj-srit.json","https://opendata.rdw.nl/resource/8ys7-d773.json","https://opendata.rdw.nl/resource/vezc-m2t6.json","https://opendata.rdw.nl/resource/jhie-znh9.json","https://opendata.rdw.nl/resource/kmfi-hrps.json"
"00GDL4","Personenauto","HONDA","CIVIC 3DR","20250605","20080605","9222","hatchback","4","ZWART","Niet geregistreerd","4","1998","1238","1700","1338",,,"20080605","20080605","Geen verstrekking in Open Data","35851","Ja",,,,,,,"2","4","0","0",,"427","0","M1",,,"r. tegen schutbord onder motorkap","1700","FN2",,"e11*2001/116*0306*00","1","1","0","0.11","262","Nee","Nee",,"Nee","0","0",,"2024","Logisch","00","Ja","2025-06-05T00:00:00.000","2008-06-05T00:00:00.000","2008-06-05T00:00:00.000","2008-06-05T00:00:00.000",,,,,,,,,,,,,,,,,,,,,"F",,,,,,,"https://opendata.rdw.nl/resource/3huj-srit.json","https://opendata.rdw.nl/resource/8ys7-d773.json","https://opendata.rdw.nl/resource/vezc-m2t6.json","https://opendata.rdw.nl/resource/jhie-znh9.json","https://opendata.rdw.nl/resource/kmfi-hrps.json"
"00GDS3","Personenauto","HONDA","HONDA CR-V","20250603","20120911","9319","MPV","5","BLAUW","Niet geregistreerd","4","1997","1504","2080","1604","600","1500","20080603","20080603","Geen verstrekking in Open Data","38471","Ja",,,,,,,"4","4","0","0",,"0","0","M1",,,"r. tegen schutbord onder motorkap","2080",,,"e11*2001/116*0301*00","1","2","0","0.07","263","Nee","Nee",,"Nee","3580","0",,"2024","Logisch","00","Ja","2025-06-03T00:00:00.000","2012-09-11T00:00:00.000","2008-06-03T00:00:00.000","2008-06-03T00:00:00.000",,,,,,,,,,,,,,,,,,,,,"D",,,,,,,"https://opendata.rdw.nl/resource/3huj-srit.json","https://opendata.rdw.nl/resource/8ys7-d773.json","https://opendata.rdw.nl/resource/vezc-m2t6.json","https://opendata.rdw.nl/resource/jhie-znh9.json","https://opendata.rdw.nl/resource/kmfi-hrps.json"
"00GFJ1","Personenauto","HONDA","CIVIC 4DR HYBRID","20250606","20191002","639","sedan","5","BLAUW","Niet geregistreerd","4","1339","1268","1720","1368",,,"20080606","20080606","Geen verstrekking in Open Data","24501","Ja",,,,,,,"4","4","0","0",,"455","0","M1",,,"r. tegen schutbord onder motorkap","1720",,,"e11*2001/116*0271*01","1","2","1","0.00","270","Nee","Nee",,"Nee","0","0",,"2024","Logisch","00","Ja","2025-06-06T00:00:00.000","2019-10-02T00:00:00.000","2008-06-06T00:00:00.000","2008-06-06T00:00:00.000",,,,,,,,,,,,,,,,,,,,,"A",,,,,,,"https://opendata.rdw.nl/resource/3huj-srit.json","https://opendata.rdw.nl/resource/8ys7-d773.json","https://opendata.rdw.nl/resource/vezc-m2t6.json","https://opendata.rdw.nl/resource/jhie-znh9.json","https://opendata.rdw.nl/resource/kmfi-hrps.json"
"00GFV8","Personenauto","HONDA","ACCORD","20240705","20220627","7996","sedan","5","GRIJS","Niet geregistreerd","4","1997","1384","1935","1484","500","1500","20080610","20080610","Geen verstrekking in Open Data","36521","Ja",,,,,,,"4","4","0","0",,"0","0","M1",,,"r. op schutbord","1935","CU1",,"e6*2001/116*0113*00","1","1","1","0.08","271","Nee","Nee",,"Nee","3435","0","0.00","2023","Logisch","00","Ja","2024-07-05T00:00:00.000","2022-06-27T00:00:00.000","2008-06-10T00:00:00.000","2008-06-10T00:00:00.000",,,,,,,,,,,,,,,,,,,,,"B",,,,,,,"https://opendata.rdw.nl/resource/3huj-srit.json","https://opendata.rdw.nl/resource/8ys7-d773.json","https://opendata.rdw.nl/resource/vezc-m2t6.json","https://opendata.rdw.nl/resource/jhie-znh9.json","https://opendata.rdw.nl/resource/kmfi-hrps.json"
"00GGX8","Personenauto","HONDA","CIVIC 5DR","20240821","20220827","4569","hatchback","5","GRIJS","Niet geregistreerd","4","1339","1140","1650","1240","500","1200","20080630","20080630","Geen verstrekking in Open Data","23450","Ja",,,,,,,"4","4","0","0",,"425","0","M1",,,"r. tegen schutbord onder motorkap","1650",,,"e11*2001/116*0255*03","1","2","0","0.05","262","Nee","Nee",,"Nee","2850","0","0.00","2023","Logisch","00","Ja","2024-08-21T00:00:00.000","2022-08-27T00:00:00.000","2008-06-30T00:00:00.000","2008-06-30T00:00:00.000",,,,,,,,,,,,,,,,,,,,,"B",,,,,,,"https://opendata.rdw.nl/resource/3huj-srit.json","https://opendata.rdw.nl/resource/8ys7-d773.json","https://opendata.rdw.nl/resource/vezc-m2t6.json","https://opendata.rdw.nl/resource/jhie-znh9.json","https://opendata.rdw.nl/resource/kmfi-hrps.json"
"00GHF3","Personenauto","HONDA","HONDA CR-V","20241115","20221108","8808","MPV","5","ZWART","Niet geregistreerd","4","1997","1469","2050","1569","600","1600","20080623","20080623","Geen verstrekking in Open Data","36520","Ja",,,,,,,"4","4","0","0",,"0","0","M1",,,"a. r. achterzitting","2050",,,"e11*2001/116*0301*00","1","1","0","0.07","263","Nee","Nee",,"Nee","3650","0",,"2023","Logisch","00","Ja","2024-11-15T00:00:00.000","2022-11-08T00:00:00.000","2008-06-23T00:00:00.000","2008-06-23T00:00:00.000",,,,,,,,,,,,,,,,,,,,,"D",,,,,,,"https://opendata.rdw.nl/resource/3huj-srit.json","https://opendata.rdw.nl/resource/8ys7-d773.json","https://opendata.rdw.nl/resource/vezc-m2t6.json","https://opendata.rdw.nl/resource/jhie-znh9.json","https://opendata.rdw.nl/resource/kmfi-hrps.json"
"00GHT3","Personenauto","HONDA","CIVIC 5DR","20240627","20140606","5911","hatchback","5","ZWART","Niet geregistreerd","4","1799","1165","1750","1265","500","1400","20080627","20080627","Geen verstrekking in Open Data","26601","Ja",,,,,,,"4","4","0","0",,"425","0","M1",,,"r. tegen schutbord onder motorkap","1750",,,"e11*2001/116*0256*02","1","2","0","0.08","262","Nee","Nee",,"Nee","3150","0","0.00","2023","Logisch","00","Ja","2024-06-27T00:00:00.000","2014-06-06T00:00:00.000","2008-06-27T00:00:00.000","2008-06-27T00:00:00.000",,,,,,,,,,,,,,,,,,,,,"C",,,,,,,"https://opendata.rdw.nl/resource/3huj-srit.json","https://opendata.rdw.nl/resource/8ys7-d773.json","https://opendata.rdw.nl/resource/vezc-m2t6.json","https://opendata.rdw.nl/resource/jhie-znh9.json","https://opendata.rdw.nl/resource/kmfi-hrps.json"
"00GJR4","Personenauto","HONDA","JAZZ","20241002",,"2353","hatchback","5","GEEL","Niet geregistreerd","4","1246","971","1490","1071","450","1000","20080702","20080702","Geen verstrekking in Open Data","15000","Nee",,,,,,,"4","4","0","0",,"0","0","M1",,,"r. tegen schutbord onder motorkap","1490",,,"e6*98/14*0087*04","1","3","0","0.05","245","Nee","Nee",,"Nee","2490","0",,"2023","Logisch","00","Ja","2024-10-02T00:00:00.000",,"2008-07-02T00:00:00.000","2008-07-02T00:00:00.000",,,,,,,,,,,,,,,,,,,,,"B",,,,,,,"https://opendata.rdw.nl/resource/3huj-srit.json","https://opendata.rdw.nl/resource/8ys7-d773.json","https://opendata.rdw.nl/resource/vezc-m2t6.json","https://opendata.rdw.nl/resource/jhie-znh9.json","https://opendata.rdw.nl/resource/kmfi-hrps.json"
"00GKP1","Personenauto","HONDA","JAZZ","20240715","20080715","2877","hatchback","5","GRIJS","Niet geregistreerd","4","1339","971","1490","1071","450","1000","20080715","20080715","Geen verstrekking in Open Data","17000","Ja",,,,,,,"4","4","0","0",,"385","0","M1",,,"r. tegen schutbord onder motorkap","1490",,,"e6*2001/116*0102*01","1","1","1","0.06","245","Nee","Nee",,"Nee","2490","0",,"2023","Logisch","00","Ja","2024-07-15T00:00:00.000","2008-07-15T00:00:00.000","2008-07-15T00:00:00.000","2008-07-15T00:00:00.000",,,,,,,,,,,,,,,,,,,,,"B",,,,,,,"https://opendata.rdw.nl/resource/3huj-srit.json","https://opendata.rdw.nl/resource/8ys7-d773.json","https://opendata.rdw.nl/resource/vezc-m2t6.json","https://opendata.rdw.nl/resource/jhie-znh9.json","https://opendata.rdw.nl/resource/kmfi-hrps.json"
"00GLT7","Personenauto","HONDA","CIVIC 5DR","20240807","20110921","5479","hatchback","5","ORANJE","Niet geregistreerd","4","1799","1165","1750","1265","500","1400","20080722","20080722","Geen verstrekking in Open Data","24950","Ja",,,,,,,"4","4","0","0",,"425","0","M1",,,"r. tegen schutbord onder motorkap","1750",,,"e11*2001/116*0256*03","1","2","0","0.08","262","Nee","Nee",,"Nee","3150","0","0.00","2023","Onlogisch","04","Ja","2024-08-07T00:00:00.000","2011-09-21T00:00:00.000","2008-07-22T00:00:00.000","2008-07-22T00:00:00.000",,,,,,,,,,,,,,,,,,,,,"C",,,,,,,"https://opendata.rdw.nl/resource/3huj-srit.json","https://opendata.rdw.nl/resource/8ys7-d773.json","https://opendata.rdw.nl/resource/vezc-m2t6.json","https://opendata.rdw.nl/resource/jhie-znh9.json","https://opendata.rdw.nl/resource/kmfi-hrps.json"
"00GND3","Personenauto","HONDA","ACCORD TOURER","20241008","20140806","10042","MPV","5","GRIJS","Niet geregistreerd","4","1997","1402","1990","1502","500","1500","20080729","20080729","Geen verstrekking in Open Data","44320","Ja",,,,,,,"4","4","0","0",,"475","0","M1",,,"r. op schutbord","1990","CW1",,"e6*2001/116*0120*00","1","2","0","0.08","271","Nee","Nee",,"Nee","3490","0",,"2023","Logisch","00","Ja","2024-10-08T00:00:00.000","2014-08-06T00:00:00.000","2008-07-29T00:00:00.000","2008-07-29T00:00:00.000",,,,,,,,,,,,,,,,,,,,,"B",,,,,,,"https://opendata.rdw.nl/resource/3huj-srit.json","https://opendata.rdw.nl/resource/8ys7-d773.json","https://opendata.rdw.nl/resource/vezc-m2t6.json","https://opendata.rdw.nl/resource/jhie-znh9.json","https://opendata.rdw.nl/resource/kmfi-hrps.json"
"00GPP6","Personenauto","HONDA","JAZZ","20240818","20080818","2877","hatchback","5","BLAUW","Niet geregistreerd","4","1339","971","1490","1071","450","1000","20080818","20080818","Geen verstrekking in Open Data","17000","Ja",,,,,,,"4","4","0","0",,"385","0","M1",,,"r. tegen schutbord onder motorkap","1490",,,"e6*2001/116*0102*01","1","1","1","0.06","245","Nee","Nee",,"Nee","2490","0",,"2023","Logisch","00","Ja","2024-08-18T00:00:00.000","2008-08-18T00:00:00.000","2008-08-18T00:00:00.000","2008-08-18T00:00:00.000",,,,,,,,,,,,,,,,,,,,,"B",,,,,,,"https://opendata.rdw.nl/resource/3huj-srit.json","https://opendata.rdw.nl/resource/8ys7-d773.json","https://opendata.rdw.nl/resource/vezc-m2t6.json","https://opendata.rdw.nl/resource/jhie-znh9.json","https://opendata.rdw.nl/resource/kmfi-hrps.json"
"00GRB3","Personenauto","HONDA","CIVIC 4DR HYBRID","20250313","20191216","639","sedan","5","ZWART","Niet geregistreerd","4","1339","1268","1720","1368",,,"20080821","20080821","Geen verstrekking in Open Data","24501","Ja",,,,,,,"4","4","0","0",,"455","0","M1",,,"r. tegen schutbord onder motorkap","1720",,,"e11*2001/116*0271*01","1","2","1","0.00","270","Nee","Nee",,"Nee","0","0",,"2024","Logisch","00","Ja","2025-03-13T00:00:00.000","2019-12-16T00:00:00.000","2008-08-21T00:00:00.000","2008-08-21T00:00:00.000",,,,,,,,,,,,,,,,,,,,,"A",,,,,,,"https://opendata.rdw.nl/resource/3huj-srit.json","https://opendata.rdw.nl/resource/8ys7-d773.json","https://opendata.rdw.nl/resource/vezc-m2t6.json","https://opendata.rdw.nl/resource/jhie-znh9.json","https://opendata.rdw.nl/resource/kmfi-hrps.json"
"00GRF5","Personenauto","HONDA","JAZZ","20241213","20240213","2445","hatchback","5","GRIJS","Niet geregistreerd","4","1246","971","1490","1071","450","1000","20080815","20080815","Geen verstrekking in Open Data","15350","Ja",,,,,,,"4","4","0","0",,"385","0","M1",,,"r. tegen schutbord onder motorkap","1490",,,"e6*2001/116*0101*01","1","1","1","0.05","245","Nee","Ja",,"Nee","2490","0",,"2024","Logisch","00","Ja","2024-12-13T00:00:00.000","2024-02-13T00:00:00.000","2008-08-15T00:00:00.000","2008-08-15T00:00:00.000",,,,,,,,,,,,,,,,,,,,,"B",,,,,,,"https://opendata.rdw.nl/resource/3huj-srit.json","https://opendata.rdw.nl/resource/8ys7-d773.json","https://opendata.rdw.nl/resource/vezc-m2t6.json","https://opendata.rdw.nl/resource/jhie-znh9.json","https://opendata.rdw.nl/resource/kmfi-hrps.json"
"00GRT2","Personenauto","HONDA","CIVIC 4DR HYBRID","20250425","20231214","639","sedan","5","GRIJS","Niet geregistreerd","4","1339","1268","1720","1368",,,"20080828","20080828","Geen verstrekking in Open Data","24501","Ja",,,,,,,"4","4","0","0",,"455","0","M1",,,"r. tegen schutbord onder motorkap","1720",,,"e11*2001/116*0271*01","1","2","1","0.00","270","Nee","Nee",,"Nee","0","0",,"2024","Logisch","00","Ja","2025-04-25T00:00:00.000","2023-12-14T00:00:00.000","2008-08-28T00:00:00.000","2008-08-28T00:00:00.000",,,,,,,,,,,,,,,,,,,,,"A",,,,,,,"https://opendata.rdw.nl/resource/3huj-srit.json","https://opendata.rdw.nl/resource/8ys7-d773.json","https://opendata.rdw.nl/resource/vezc-m2t6.json","https://opendata.rdw.nl/resource/jhie-znh9.json","https://opendata.rdw.nl/resource/kmfi-hrps.json"
"00GVP5","Personenauto","HONDA","ACCORD","20241221","20141215","8626","sedan","5","GRIJS","Niet geregistreerd","4","1997","1413","1960","1513","500","1500","20080916","20080916","Geen verstrekking in Open Data","38920","Ja",,,,,,,"4","4","0","0",,"0","0","M1",,,"r. op schutbord","1960","CU1",,"e6*2001/116*0113*00","1","3","1","0.08","271","Nee","Nee",,"Nee","3460","0","0.00","2023","Logisch","00","Ja","2024-12-21T00:00:00.000","2014-12-15T00:00:00.000","2008-09-16T00:00:00.000","2008-09-16T00:00:00.000",,,,,,,,,,,,,,,,,,,,,"B",,,,,,,"https://opendata.rdw.nl/resource/3huj-srit.json","https://opendata.rdw.nl/resource/8ys7-d773.json","https://opendata.rdw.nl/resource/vezc-m2t6.json","https://opendata.rdw.nl/resource/jhie-znh9.json","https://opendata.rdw.nl/resource/kmfi-hrps.json"
"00GXF6","Personenauto","HONDA","CIVIC 5DR","20240917","20110310","5479","hatchback","5","GRIJS","Niet geregistreerd","4","1799","1165","1750","1265","500","1400","20080922","20080922","Geen verstrekking in Open Data","24950","Ja",,,,,,,"4","4","0","0",,"425","0","M1",,,"r. tegen schutbord onder motorkap","1750",,,"e11*2001/116*0256*03","1","2","0","0.08","262","Nee","Nee",,"Nee","3150","0","0.00","2023","Logisch","00","Ja","2024-09-17T00:00:00.000","2011-03-10T00:00:00.000","2008-09-22T00:00:00.000","2008-09-22T00:00:00.000",,,,,,,,,,,,,,,,,,,,,"C",,,,,,,"https://opendata.rdw.nl/resource/3huj-srit.json","https://opendata.rdw.nl/resource/8ys7-d773.json","https://opendata.rdw.nl/resource/vezc-m2t6.json","https://opendata.rdw.nl/resource/jhie-znh9.json","https://opendata.rdw.nl/resource/kmfi-hrps.json"
"00HFT8","Personenauto","HONDA","JAZZ","20250404","20221106","4031","hatchback","5","BLAUW","Niet geregistreerd","4","1339","1046","1555","1146","450","1000","20081103","20081103","Geen verstrekking in Open Data","21401","Ja",,,,,,,"4","4","0","0",,"390","0","M1",,,"by schutbord","1555","GE6",,"e6*2001/116*0126*01","2","2","0","0.06","250","Nee","Nee",,"Nee","2555","0","0.00","2024","Logisch","00","Ja","2025-04-04T00:00:00.000","2022-11-06T00:00:00.000","2008-11-03T00:00:00.000","2008-11-03T00:00:00.000",,,,,,,,,,,,,,,,,,,,,"B",,,,,,,"https://opendata.rdw.nl/resource/3huj-srit.json","https://opendata.rdw.nl/resource/8ys7-d773.json","https://opendata.rdw.nl/resource/vezc-m2t6.json","https://opendata.rdw.nl/resource/jhie-znh9.json","https://opendata.rdw.nl/resource/kmfi-hrps.json"
"00HHD8","Personenauto","HONDA","CIVIC 4DR HYBRID","20241120","20081120","875","sedan","5","BLAUW","Niet geregistreerd","4","1339","1268","1720","1368",,,"20081120","20081120","Geen verstrekking in Open Data","25401","Ja",,,,,,,"4","4","0","0",,"455","0","M1",,,"r. tegen schutbord onder motorkap","1720",,,"e11*2001/116*0271*01","1","2","2","0.00","270","Nee","Nee",,"Nee","0","0",,"2023","Logisch","00","Ja","2024-11-20T00:00:00.000","2008-11-20T00:00:00.000","2008-11-20T00:00:00.000","2008-11-20T00:00:00.000",,,,,,,,,,,,,,,,,,,,,"A",,,,,,,"https://opendata.rdw.nl/resource/3huj-srit.json","https://opendata.rdw.nl/resource/8ys7-d773.json","https://opendata.rdw.nl/resource/vezc-m2t6.json","https://opendata.rdw.nl/resource/jhie-znh9.json","https://opendata.rdw.nl/resource/kmfi-hrps.json"
"00HHG5","Personenauto","HONDA","JAZZ","20241129","20221001","2982","hatchback","5","GRIJS","Niet geregistreerd","4","1198","1022","1520","1122","450","1000","20081128","20081128","Geen verstrekking in Open Data","17400","Ja",,,,,,,"4","4","0","0",,"390","0","M1",,,"r. schutbord","1520","GG2",,"e6*2001/116*0127*01","2","2","0","0.06","250","Nee","Nee",,"Nee","2520","0","0.00","2023","Logisch","00","Ja","2024-11-29T00:00:00.000","2022-10-01T00:00:00.000","2008-11-28T00:00:00.000","2008-11-28T00:00:00.000",,,,,,,,,,,,,,,,,,,,,"B",,,,,,,"https://opendata.rdw.nl/resource/3huj-srit.json","https://opendata.rdw.nl/resource/8ys7-d773.json","https://opendata.rdw.nl/resource/vezc-m2t6.json","https://opendata.rdw.nl/resource/jhie-znh9.json","https://opendata.rdw.nl/resource/kmfi-hrps.json"
"00HKP1","Personenauto","HONDA","JAZZ","20250105","20100313","2982","hatchback","5","GEEL","Niet geregistreerd","4","1198","1022","1520","1122","450","1000","20090102","20090102","Geen verstrekking in Open Data","17400","Ja",,,,,,,"4","4","0","0",,"390","0","M1",,,"r. schutbord","1520","GG2",,"e6*2001/116*0127*02","2","2","0","0.06","250","Nee","Nee",,"Nee","2520","0",,"2024","Logisch","00","Ja","2025-01-05T00:00:00.000","2010-03-13T00:00:00.000","2009-01-02T00:00:00.000","2009-01-02T00:00:00.000",,,,,,,,,,,,,,,,,,,,,"B",,,,,,,"https://opendata.rdw.nl/resource/3huj-srit.json","https://opendata.rdw.nl/resource/8ys7-d773.json","https://opendata.rdw.nl/resource/vezc-m2t6.json","https://opendata.rdw.nl/resource/jhie-znh9.json","https://opendata.rdw.nl/resource/kmfi-hrps.json"