"kenteken","voertuigsoort","merk","handelsbenaming","vervaldatum_apk","datum_tenaamstelling","bruto_bpm","inrichting","aantal_zitplaatsen","eerste_kleur","tweede_kleur","aantal_cilinders","cilinderinhoud","massa_ledig_voertuig","toegestane_maximum_massa_voertuig","massa_rijklaar","maximum_massa_trekken_ongeremd","maximum_trekken_massa_geremd","datum_eerste_toelating","datum_eerste_tenaamstelling_in_nederland","wacht_op_keuren","catalogusprijs","wam_verzekerd","maximale_constructiesnelheid","laadvermogen","oplegger_geremd","aanhangwagen_autonoom_geremd","aanhangwagen_middenas_geremd","aantal_staanplaatsen","aantal_deuren","aantal_wielen","afstand_hart_koppeling_tot_achterzijde_voertuig","afstand_voorzijde_voertuig_tot_hart_koppeling","afwijkende_maximum_snelheid","lengte","breedte","europese_voertuigcategorie","europese_voertuigcategorie_toevoeging","europese_uitvoeringcategorie_toevoeging","plaats_chassisnummer","technische_max_massa_voertuig","type","type_gasinstallatie","typegoedkeuringsnummer","variant","uitvoering","volgnummer_wijziging_eu_typegoedkeuring","vermogen_massarijklaar","wielbasis","export_indicator","openstaande_terugroepactie_indicator","vervaldatum_tachograaf","taxi_indicator","maximum_massa_samenstelling","aantal_rolstoelplaatsen","maximum_ondersteunende_snelheid","jaar_laatste_registratie_tellerstand","tellerstandoordeel","code_toelichting_tellerstandoordeel","tenaamstellen_mogelijk","vervaldatum_apk_dt","datum_tenaamstelling_dt","datum_eerste_toelating_dt","datum_eerste_tenaamstelling_in_nederland_dt","vervaldatum_tachograaf_dt","maximum_last_onder_de_vooras_sen_tezamen_koppeling","type_remsysteem_voertuig_code","rupsonderstelconfiguratiecode","wielbasis_voertuig_minimum","wielbasis_voertuig_maximum","lengte_voertuig_minimum","lengte_voertuig_maximum","breedte_voertuig_minimum","breedte_voertuig_maximum","hoogte_voertuig","hoogte_voertuig_minimum","hoogte_voertuig_maximum","massa_bedrijfsklaar_minimaal","massa_bedrijfsklaar_maximaal","technisch_toelaatbaar_massa_koppelpunt","maximum_massa_technisch_maximaal","maximum_massa_technisch_minimaal","subcategorie_nederland","verticale_belasting_koppelpunt_getrokken_voertuig","zuinigheidsclassificatie","registratie_datum_goedkeuring_afschrijvingsmoment_bpm","registratie_datum_goedkeuring_afschrijvingsmoment_bpm_dt","gem_lading_wrde","aerodyn_voorz","massa_alt_aandr","verl_cab_ind","api_gekentekende_voertuigen_assen","api_gekentekende_voertuigen_brandstof","api_gekentekende_voertuigen_carrosserie","api_gekentekende_voertuigen_carrosserie_specifiek","api_gekentekende_voertuigen_voertuigklasse"
"1TRT46","Personenauto","BMW","420D","20250105","20190510","5404","coupe","4","GRIJS","Niet geregistreerd","4","1995","1440","1985","1540","745","1600","20131217","20140423","Geen verstrekking in Open Data","64433","Ja",,,,,,,"2","4","0","0",,"464","0","M1",,,"r. schroefveerkoker","1985","3C",,"e1*2007/46*0316*08","3P11","6A240000","0","0.09","281","Nee","Ja",,"Nee","3660","0",,"2024","Geen oordeel","05","Ja","2025-01-05T00:00:00.000","2019-05-10T00:00:00.000","2013-12-17T00:00:00.000","2014-04-23T00:00:00.000",,"0",,,,,,,,,,,,,,,,,,,"B",,,,,,,"https://opendata.rdw.nl/resource/3huj-srit.json","https://opendata.rdw.nl/resource/8ys7-d773.json","https://opendata.rdw.nl/resource/vezc-m2t6.json","https://opendata.rdw.nl/resource/jhie-znh9.json","https://opendata.rdw.nl/resource/kmfi-hrps.json"
"2TVN73","Personenauto","BMW","420D","20250409","20140523","8117","coupe","4","ZWART","Niet geregistreerd","4","1995","1440","1985","1540","745","1600","20140523","20140523","Geen verstrekking in Open Data","63580","Ja",,,,,,,"2","4","0","0",,"464","0","M1",,,"r. schroefveerkoker","1985","3C",,"e1*2007/46*0316*09","3P11","6A240000","0","0.09","281","Nee","Nee",,"Nee","3660","0",,"2024","Logisch","00","Ja","2025-04-09T00:00:00.000","2014-05-23T00:00:00.000","2014-05-23T00:00:00.000","2014-05-23T00:00:00.000",,,,,,,,,,,,,,,,,,,,,"D",,,,,,,"https://opendata.rdw.nl/resource/3huj-srit.json","https://opendata.rdw.nl/resource/8ys7-d773.json","https://opendata.rdw.nl/resource/vezc-m2t6.json","https://opendata.rdw.nl/resource/jhie-znh9.json","https://opendata.rdw.nl/resource/kmfi-hrps.json"
"3SPS46","Personenauto","BMW","420D","20240925","20190812","6487","coupe","4","GRIJS","Niet geregistreerd","4","1995","1440","1985","1540","745","1600","20131122","20131122","Geen verstrekking in Open Data","60002","Ja",,,,,,,"2","4","0","0",,"464","0","M1",,,"r. schroefveerkoker","1985","3C",,"e1*2007/46*0316*09","3P11","6A140000","0","0.09","281","Nee","Nee",,"Nee","3660","0",,"2023","Logisch","00","Ja","2024-09-25T00:00:00.000","2019-08-12T00:00:00.000","2013-11-22T00:00:00.000","2013-11-22T00:00:00.000",,,,,,,,,,,,,,,,,,,,,"B",,,,,,,"https://opendata.rdw.nl/resource/3huj-srit.json","https://opendata.rdw.nl/resource/8ys7-d773.json","https://opendata.rdw.nl/resource/vezc-m2t6.json","https://opendata.rdw.nl/resource/jhie-znh9.json","https://opendata.rdw.nl/resource/kmfi-hrps.json"
"3TRH48","Personenauto","BMW","420D","20250418","20140418","7520","coupe","4","GRIJS","Niet geregistreerd","4","1995","1440","1985","1540","745","1600","20140418","20140418","Geen verstrekking in Open Data","53930","Ja",,,,,,,"2","4","0","0",,"464","0","M1",,,"r. schroefveerkoker","1985","3C",,"e1*2007/46*0316*08","3P11","6A140000","0","0.09","281","Nee","Nee",,"Nee","3660","0",,"2024","Logisch","00","Ja","2025-04-18T00:00:00.000","2014-04-18T00:00:00.000","2014-04-18T00:00:00.000","2014-04-18T00:00:00.000",,,,,,,,,,,,,,,,,,,,,"C",,,,,,,"https://opendata.rdw.nl/resource/3huj-srit.json","https://opendata.rdw.nl/resource/8ys7-d773.json","https://opendata.rdw.nl/resource/vezc-m2t6.json","https://opendata.rdw.nl/resource/jhie-znh9.json","https://opendata.rdw.nl/resource/kmfi-hrps.json"
"4XGT26","Personenauto","BMW","420D","20250109","20191214","7520","coupe","4","GRIJS","Niet geregistreerd","4","1995","1440","1985","1540","745","1600","20140725","20140725","Geen verstrekking in Open Data","54517","Ja",,,,,,,"2","4","0","0",,"464","0","M1",,,"r. schroefveerkoker","1985","3C",,"e1*2007/46*0316*08","3P11","6A140000","0","0.09","281","Nee","Nee",,"Nee","3660","0",,"2023","Logisch","00","Ja","2025-01-09T00:00:00.000","2019-12-14T00:00:00.000","2014-07-25T00:00:00.000","2014-07-25T00:00:00.000",,,,,,,,,,,,,,,,,,,,,"C",,,,,,,"https://opendata.rdw.nl/resource/3huj-srit.json","https://opendata.rdw.nl/resource/8ys7-d773.json","https://opendata.rdw.nl/resource/vezc-m2t6.json","https://opendata.rdw.nl/resource/jhie-znh9.json","https://opendata.rdw.nl/resource/kmfi-hrps.json"
"5ZGF37","Personenauto","BMW","420D","20241210","20180615","8117","coupe","4","GRIJS","Niet geregistreerd","4","1995","1445","1990","1545","745","1600","20150109","20150109","Geen verstrekking in Open Data","65166","Ja",,,,,,,"2","4","0","0",,"464","0","M1",,,"r. schroefveerkoker","1990","3C",,"e1*2007/46*0316*11","3P11","6A240000","0","0.09","281","Nee","Nee",,"Nee","3665","0","0.00","2023","Logisch","00","Ja","2024-12-10T00:00:00.000","2018-06-15T00:00:00.000","2015-01-09T00:00:00.000","2015-01-09T00:00:00.000",,,,,,,,,,,,,,,,,,,,,"D",,,,,,,"https://opendata.rdw.nl/resource/3huj-srit.json","https://opendata.rdw.nl/resource/8ys7-d773.json","https://opendata.rdw.nl/resource/vezc-m2t6.json","https://opendata.rdw.nl/resource/jhie-znh9.json","https://opendata.rdw.nl/resource/kmfi-hrps.json"
"7TKN34","Personenauto","BMW","420D","20241002","20171221","7031","coupe","4","GRIJS","Niet geregistreerd","4","1995","1440","1985","1540","745","1600","20131002","20140304","Geen verstrekking in Open Data","60174","Ja",,,,,,,"2","4","0","0",,"464","0","M1",,,"r. schroefveerkoker","1985","3C",,"e1*2007/46*0316*08","3P11","6A240700","0","0.09","281","Nee","Ja",,"Nee","3660","0",,"2023","Geen oordeel","05","Ja","2024-10-02T00:00:00.000","2017-12-21T00:00:00.000","2013-10-02T00:00:00.000","2014-03-04T00:00:00.000",,"0",,,,,,,,,,,,,,,,,,,"B",,,,,,,"https://opendata.rdw.nl/resource/3huj-srit.json","https://opendata.rdw.nl/resource/8ys7-d773.json","https://opendata.rdw.nl/resource/vezc-m2t6.json","https://opendata.rdw.nl/resource/jhie-znh9.json","https://opendata.rdw.nl/resource/kmfi-hrps.json"
"8SXX32","Personenauto","BMW","420D","20240419","20220119","7574","coupe","4","ZWART","Niet geregistreerd","4","1995","1425","1970","1525","745","1600","20140110","20140110","Geen verstrekking in Open Data","60211","Ja",,,,,,,"2","4","0","0",,"464","0","M1",,,"r. schroefveerkoker","1970","3C",,"e1*2007/46*0316*09","3P11","6H240000","0","0.09","281","Nee","Ja",,"Nee","3645","0",,"2023","Logisch","00","Ja","2024-04-19T00:00:00.000","2022-01-19T00:00:00.000","2014-01-10T00:00:00.000","2014-01-10T00:00:00.000",,,,,,,,,,,,,,,,,,,,,"D",,,,,,,"https://opendata.rdw.nl/resource/3huj-srit.json","https://opendata.rdw.nl/resource/8ys7-d773.json","https://opendata.rdw.nl/resource/vezc-m2t6.json","https://opendata.rdw.nl/resource/jhie-znh9.json","https://opendata.rdw.nl/resource/kmfi-hrps.json"
"8TGZ56","Personenauto","BMW","420D","20250209","20230620","5129","coupe","4","GRIJS","Niet geregistreerd","4","1995","1440","1985","1540","745","1600","20130930","20140203","Geen verstrekking in Open Data","74167","Ja",,,,,,,"2","4","0","0",,"464","0","M1",,,"r. schroefveerkoker","1985","3C",,"e1*2007/46*0316*08","3P11","6A240000","0","0.09","281","Nee","Ja",,"Nee","3660","0",,"2024","Geen oordeel","05","Ja","2025-02-09T00:00:00.000","2023-06-20T00:00:00.000","2013-09-30T00:00:00.000","2014-02-03T00:00:00.000",,,,,,,,,,,,,,,,,,,,,"B","20240209","2024-02-09T00:00:00.000",,,,,"https://opendata.rdw.nl/resource/3huj-srit.json","https://opendata.rdw.nl/resource/8ys7-d773.json","https://opendata.rdw.nl/resource/vezc-m2t6.json","https://opendata.rdw.nl/resource/jhie-znh9.json","https://opendata.rdw.nl/resource/kmfi-hrps.json"
"GB133T","Personenauto","BMW","420D","20240724","20190924","8811","coupe","4","GRIJS","Niet geregistreerd","4","1995","1445","1990","1545","745","1600","20150417","20150417","Geen verstrekking in Open Data","62902","Ja",,,,,,,"2","4","0","0",,"464","0","M1",,,"r. schroefveerkoker","1990","3C",,"e1*2007/46*0316*11","3P11","6A240000","0","0.09","281","Nee","Nee",,"Nee","3665","0","0.00","2023","Logisch","00","Ja","2024-07-24T00:00:00.000","2019-09-24T00:00:00.000","2015-04-17T00:00:00.000","2015-04-17T00:00:00.000",,,,,,,,,,,,,,,,,,,,,"D",,,,,,,"https://opendata.rdw.nl/resource/3huj-srit.json","https://opendata.rdw.nl/resource/8ys7-d773.json","https://opendata.rdw.nl/resource/vezc-m2t6.json","https://opendata.rdw.nl/resource/jhie-znh9.json","https://opendata.rdw.nl/resource/kmfi-hrps.json"
"GF836T","Personenauto","BMW","420D","20250209","20170318","4586","coupe","4","GRIJS","Niet geregistreerd","4","1995","1440","1985","1540","745","1600","20131113","20150707","Geen verstrekking in Open Data","71189","Ja",,,,,,,"2","4","0","0",,"464","0","M1",,,"r. schroefveerkoker","1985","3C",,"e1*2007/46*0316*08","3P11","6A24R000","0","0.08","281","Nee","Nee",,"Nee","3660","0",,"2024","Geen oordeel","05","Ja","2025-02-09T00:00:00.000","2017-03-18T00:00:00.000","2013-11-13T00:00:00.000","2015-07-07T00:00:00.000",,,,,,,,,,,,,,,,,,,,,"B",,,,,,,"https://opendata.rdw.nl/resource/3huj-srit.json","https://opendata.rdw.nl/resource/8ys7-d773.json","https://opendata.rdw.nl/resource/vezc-m2t6.json","https://opendata.rdw.nl/resource/jhie-znh9.json","https://opendata.rdw.nl/resource/kmfi-hrps.json"
"GH459G","Personenauto","BMW","420D","20240729","20190906","6831","coupe","4","BLAUW","Niet geregistreerd","4","1995","1475","2020","1575","745","1600","20150529","20150529","Geen verstrekking in Open Data","62491","Ja",,,,,,,"2","4","0","0",,"464","0","M1",,,"r. schroefveerkoker","2020","3C",,"e1*2007/46*0316*12","4P71","6A240000","0","0.09","281","Nee","Nee",,"Nee","3695","0",,"2023","Logisch","00","Ja","2024-07-29T00:00:00.000","2019-09-06T00:00:00.000","2015-05-29T00:00:00.000","2015-05-29T00:00:00.000",,,,,,,,,,,,,,,,,,,,,"C",,,,,,,"https://opendata.rdw.nl/resource/3huj-srit.json","https://opendata.rdw.nl/resource/8ys7-d773.json","https://opendata.rdw.nl/resource/vezc-m2t6.json","https://opendata.rdw.nl/resource/jhie-znh9.json","https://opendata.rdw.nl/resource/kmfi-hrps.json"
"GJ043T","Personenauto","BMW","420D","20240821","20190517","5419","coupe","4","GRIJS","Niet geregistreerd","4","1995","1475","2020","1575","745","1600","20150608","20150608","Geen verstrekking in Open Data","56309","Ja",,,,,,,"2","4","0","0",,"464","0","M1",,,"r. schroefveerkoker","2020","3C",,"e1*2007/46*0316*12","4P71","6A140000","0","0.09","281","Nee","Ja",,"Nee","3695","0",,"2024","Logisch","00","Ja","2024-08-21T00:00:00.000","2019-05-17T00:00:00.000","2015-06-08T00:00:00.000","2015-06-08T00:00:00.000",,,,,,,,,,,,,,,,,,,,,"B",,,,,,,"https://opendata.rdw.nl/resource/3huj-srit.json","https://opendata.rdw.nl/resource/8ys7-d773.json","https://opendata.rdw.nl/resource/vezc-m2t6.json","https://opendata.rdw.nl/resource/jhie-znh9.json","https://opendata.rdw.nl/resource/kmfi-hrps.json"
"GK944B","Personenauto","BMW","420D","20250226","20150608","6765","coupe","4","GRIJS","Niet geregistreerd","4","1995","1440","1985","1540","745","1600","20140226","20150608","Geen verstrekking in Open Data","75544","Ja",,,,,,,"2","4","0","0",,"464","0","M1",,,"r. schroefveerkoker","1985","3C",,"e1*2007/46*0316*09","3P11","6A240000","0","0.09","281","Nee","Nee",,"Nee","3660","0",,"2024","Geen oordeel","05","Ja","2025-02-26T00:00:00.000","2015-06-08T00:00:00.000","2014-02-26T00:00:00.000","2015-06-08T00:00:00.000",,,,,,,,,,,,,,,,,,,,,"D",,,,,,,"https://opendata.rdw.nl/resource/3huj-srit.json","https://opendata.rdw.nl/resource/8ys7-d773.json","https://opendata.rdw.nl/resource/vezc-m2t6.json","https://opendata.rdw.nl/resource/jhie-znh9.json","https://opendata.rdw.nl/resource/kmfi-hrps.json"
"GN757D","Personenauto","BMW","420D","20241207","20150730","5419","coupe","4","ZWART","Niet geregistreerd","4","1995","1475","2020","1575","745","1600","20150730","20150730","Geen verstrekking in Open Data","53040","Ja",,,,,,,"2","4","0","0",,"464","0","M1",,,"r. schroefveerkoker","2020","3C",,"e1*2007/46*0316*12","4P71","6A140000","0","0.09","281","Nee","Nee",,"Nee","3695","0",,"2023","Logisch","00","Ja","2024-12-07T00:00:00.000","2015-07-30T00:00:00.000","2015-07-30T00:00:00.000","2015-07-30T00:00:00.000",,,,,,,,,,,,,,,,,,,,,"B",,,,,,,"https://opendata.rdw.nl/resource/3huj-srit.json","https://opendata.rdw.nl/resource/8ys7-d773.json","https://opendata.rdw.nl/resource/vezc-m2t6.json","https://opendata.rdw.nl/resource/jhie-znh9.json","https://opendata.rdw.nl/resource/kmfi-hrps.json"
"GP022G","Personenauto","BMW","420D","20240503","20160513","7071","coupe","4","GRIJS","Niet geregistreerd","4","1995","1440","1985","1540","745","1600","20140429","20150717","Geen verstrekking in Open Data","66187","Ja",,,,,,,"2","4","0","0",,"464","0","M1",,,"r. motorruimte","1985","3C",,"e1*2007/46*0316*10","3P11","6A240700","0","0.09","281","Nee","Ja",,"Nee","3660","0",,"2023","Geen oordeel","05","Ja","2024-05-03T00:00:00.000","2016-05-13T00:00:00.000","2014-04-29T00:00:00.000","2015-07-17T00:00:00.000",,,,,,,,,,,,,,,,,,,,,"D",,,,,,,"https://opendata.rdw.nl/resource/3huj-srit.json","https://opendata.rdw.nl/resource/8ys7-d773.json","https://opendata.rdw.nl/resource/vezc-m2t6.json","https://opendata.rdw.nl/resource/jhie-znh9.json","https://opendata.rdw.nl/resource/kmfi-hrps.json"
"GR316G","Personenauto","BMW","420D","20250507","20230202","5419","coupe","4","ZWART","Niet geregistreerd","4","1995","1475","2020","1575","745","1600","20150725","20150725","Geen verstrekking in Open Data","55935","Ja",,,,,,,"2","4","0","0",,"464","0","M1",,,"r. schroefveerkoker","2020","3C",,"e1*2007/46*0316*14","4P71","6A140000","0","0.09","281","Nee","Nee",,"Nee","3695","0",,"2024","Logisch","00","Ja","2025-05-07T00:00:00.000","2023-02-02T00:00:00.000","2015-07-25T00:00:00.000","2015-07-25T00:00:00.000",,,,,,,,,,,,,,,,,,,,,"B",,,,,,,"https://opendata.rdw.nl/resource/3huj-srit.json","https://opendata.rdw.nl/resource/8ys7-d773.json","https://opendata.rdw.nl/resource/vezc-m2t6.json","https://opendata.rdw.nl/resource/jhie-znh9.json","https://opendata.rdw.nl/resource/kmfi-hrps.json"
"GV686D","Personenauto","BMW","420D","20240828","20210624","5419","coupe","4","WIT","Niet geregistreerd","4","1995","1475","2020","1575","745","1600","20150828","20150828","Geen verstrekking in Open Data","52087","Ja",,,,,,,"2","4","0","0",,"464","0","M1",,,"r. schroefveerkoker","2020","3C",,"e1*2007/46*0316*14","4P71","6A140000","0","0.09","281","Nee","Ja",,"Nee","3695","0",,"2023","Logisch","00","Ja","2024-08-28T00:00:00.000","2021-06-24T00:00:00.000","2015-08-28T00:00:00.000","2015-08-28T00:00:00.000",,,,,,,,,,,,,,,,,,,,,"B",,,,,,,"https://opendata.rdw.nl/resource/3huj-srit.json","https://opendata.rdw.nl/resource/8ys7-d773.json","https://opendata.rdw.nl/resource/vezc-m2t6.json","https://opendata.rdw.nl/resource/jhie-znh9.json","https://opendata.rdw.nl/resource/kmfi-hrps.json"
"GX913X","Personenauto","BMW","420D","20241207","20191205","6831","coupe","4","BLAUW","Niet geregistreerd","4","1995","1475","2020","1575","745","1600","20150919","20150919","Geen verstrekking in Open Data","62597","Ja",,,,,,,"2","4","0","0",,"464","183","M1",,,"in motorruimte r.","2020","3C",,"e1*2007/46*0316*14","4P71","6A240700","0","0.09","281","Nee","Nee",,"Nee","3695","0","0.00","2023","Logisch","00","Ja","2024-12-07T00:00:00.000","2019-12-05T00:00:00.000","2015-09-19T00:00:00.000","2015-09-19T00:00:00.000",,,,,,,,,,,"138",,,,,,,,,,"C",,,,,,,"https://opendata.rdw.nl/resource/3huj-srit.json","https://opendata.rdw.nl/resource/8ys7-d773.json","https://opendata.rdw.nl/resource/vezc-m2t6.json","https://opendata.rdw.nl/resource/jhie-znh9.json","https://opendata.rdw.nl/resource/kmfi-hrps.json"
"GZ654D","Personenauto","BMW","420D","20241118","20200617","7031","coupe","4","BLAUW","Niet geregistreerd","4","1995","1440","1985","1540","745","1600","20131118","20150924","Geen verstrekking in Open Data","63478","Ja",,,,,,,"2","4","0","0",,"464","0","M1",,,"r. motorruimte","1985","3C",,"e1*2007/46*0316*09","3P11","6A240000","0","0.09","281","Nee","Ja",,"Nee","3660","0",,"2023","Geen oordeel","05","Ja","2024-11-18T00:00:00.000","2020-06-17T00:00:00.000","2013-11-18T00:00:00.000","2015-09-24T00:00:00.000",,,,,,,,,,,,,,,,,,,,,"B",,,,,,,"https://opendata.rdw.nl/resource/3huj-srit.json","https://opendata.rdw.nl/resource/8ys7-d773.json","https://opendata.rdw.nl/resource/vezc-m2t6.json","https://opendata.rdw.nl/resource/jhie-znh9.json","https://opendata.rdw.nl/resource/kmfi-hrps.json"
"H961KR","Personenauto","BMW","420D","20241013","20231223","1051","coupe","4","GRIJS","Niet geregistreerd","4","1995","1445","1990","1545","745","1600","20141117","20211013","Geen verstrekking in Open Data","62629","Ja","232",,,,,,"2","4","0","0",,"464","183","M1",,,"r. schroefveerkoker","1990","3C",,"e1*2007/46*0316*11","3P11","6A240000","0","0.09","281","Nee","Ja",,"Nee","3665","0","0.00","2023","Geen oordeel","05","Ja","2024-10-13T00:00:00.000","2023-12-23T00:00:00.000","2014-11-17T00:00:00.000","2021-10-13T00:00:00.000",,,,,,,,,,,"138",,,,,,,,,,"D",,,,,,,"https://opendata.rdw.nl/resource/3huj-srit.json","https://opendata.rdw.nl/resource/8ys7-d773.json","https://opendata.rdw.nl/resource/vezc-m2t6.json","https://opendata.rdw.nl/resource/jhie-znh9.json","https://opendata.rdw.nl/resource/kmfi-hrps.json"
"HH599N","Personenauto","BMW","420D","20241009","20200612","5311","coupe","4","GRIJS","Niet geregistreerd","4","1995","1440","1985","1540","745","1600","20130920","20151029","Geen verstrekking in Open Data","71710","Ja",,,,,,,"2","4","0","0",,"464","0","M1",,,"r. schroefveerkoker","1985","3C",,"e1*2007/46*0316*08","3P11","6A240000","0","0.09","281","Nee","Ja",,"Nee","3660","0",,"2023","Geen oordeel","05","Ja","2024-10-09T00:00:00.000","2020-06-12T00:00:00.000","2013-09-20T00:00:00.000","2015-10-29T00:00:00.000",,,,,,,,,,,,,,,,,,,,,"B",,,,,,,"https://opendata.rdw.nl/resource/3huj-srit.json","https://opendata.rdw.nl/resource/8ys7-d773.json","https://opendata.rdw.nl/resource/vezc-m2t6.json","https://opendata.rdw.nl/resource/jhie-znh9.json","https://opendata.rdw.nl/resource/kmfi-hrps.json"
"HK073K","Personenauto","BMW","420D","20250413","20220402","5419","coupe","4","GRIJS","Niet geregistreerd","4","1995","1475","2020","1575","745","1600","20151119","20151119","Geen verstrekking in Open Data","54352","Ja",,,,,,,"2","4","0","0",,"464","183","M1",,,"in motorruimte r.","2020","3C",,"e1*2007/46*0316*14","4P71","6A140000","0","0.09","281","Nee","Ja",,"Nee","3695","0",,"2024","Logisch","00","Ja","2025-04-13T00:00:00.000","2022-04-02T00:00:00.000","2015-11-19T00:00:00.000","2015-11-19T00:00:00.000",,,,,,,,,,,"138",,,,,,,,,,"B",,,,,,,"https://opendata.rdw.nl/resource/3huj-srit.json","https://opendata.rdw.nl/resource/8ys7-d773.json","https://opendata.rdw.nl/resource/vezc-m2t6.json","https://opendata.rdw.nl/resource/jhie-znh9.json","https://opendata.rdw.nl/resource/kmfi-hrps.json"
"HL879F","Personenauto","BMW","420D","20241214","20151127","5419","coupe","4","WIT","Niet geregistreerd","4","1995","1475","2020","1575","745","1600","20151127","20151127","Geen verstrekking in Open Data","57363","Ja",,,,,,,"2","4","0","0",,"464","183","M1",,,"in motorruimte r.","2020","3C",,"e1*2007/46*0316*14","4P71","6A140000","0","0.09","281","Nee","Ja",,"Nee","3695","0",,"2024","Logisch","00","Ja","2024-12-14T00:00:00.000","2015-11-27T00:00:00.000","2015-11-27T00:00:00.000","2015-11-27T00:00:00.000",,,,,,,,,,,"138",,,,,,,,,,"B",,,,,,,"https://opendata.rdw.nl/resource/3huj-srit.json","https://opendata.rdw.nl/resource/8ys7-d773.json","https://opendata.rdw.nl/resource/vezc-m2t6.json","https://opendata.rdw.nl/resource/jhie-znh9.json","https://opendata.rdw.nl/resource/kmfi-hrps.json"
"J199SG","Personenauto","BMW","420D","20241016","20201006","2395","coupe","4","WIT","Niet geregistreerd","4","1995","1440","1985","1540","745","1600","20140813","20201006","Geen verstrekking in Open Data","54111","Ja","232",,,,,,"2","4","0","0",,"464","183","M1",,,,"1985","3C",,"e1*2007/46*0316*08","3P11","6A240000","0","0.09","281","Nee","Ja",,"Nee","3660","0",,"2023","Geen oordeel","05","Ja","2024-10-16T00:00:00.000","2020-10-06T00:00:00.000","2014-08-13T00:00:00.000","2020-10-06T00:00:00.000",,,,,,,,,,,"138",,,,,,,,,,"D",,,,,,,"https://opendata.rdw.nl/resource/3huj-srit.json","https://opendata.rdw.nl/resource/8ys7-d773.json","https://opendata.rdw.nl/resource/vezc-m2t6.json","https://opendata.rdw.nl/resource/jhie-znh9.json","https://opendata.rdw.nl/resource/kmfi-hrps.json"
"JB498G","Personenauto","BMW","420D","20240912","20200903","5882","coupe","4","GRIJS","Niet geregistreerd","4","1995","1475","2020","1575","745","1600","20160202","20160202","Geen verstrekking in Open Data","58921","Ja",,,,,,,"2","4","0","0",,"464","183","M1",,,"in motorruimte r.","2020","3C",,"e1*2007/46*0316*14","4P71","6A140000","0","0.09","281","Nee","Nee",,"Nee","3695","0",,"2023","Logisch","00","Ja","2024-09-12T00:00:00.000","2020-09-03T00:00:00.000","2016-02-02T00:00:00.000","2016-02-02T00:00:00.000",,,,,,,,,,,"138",,,,,,,,,,"C",,,,,,,"https://opendata.rdw.nl/resource/3huj-srit.json","https://opendata.rdw.nl/resource/8ys7-d773.json","https://opendata.rdw.nl/resource/vezc-m2t6.json","https://opendata.rdw.nl/resource/jhie-znh9.json","https://opendata.rdw.nl/resource/kmfi-hrps.json"