"kenteken","voertuigsoort","merk","handelsbenaming","vervaldatum_apk","datum_tenaamstelling","bruto_bpm","inrichting","aantal_zitplaatsen","eerste_kleur","tweede_kleur","aantal_cilinders","cilinderinhoud","massa_ledig_voertuig","toegestane_maximum_massa_voertuig","massa_rijklaar","maximum_massa_trekken_ongeremd","maximum_trekken_massa_geremd","datum_eerste_toelating","datum_eerste_tenaamstelling_in_nederland","wacht_op_keuren","catalogusprijs","wam_verzekerd","maximale_constructiesnelheid","laadvermogen","oplegger_geremd","aanhangwagen_autonoom_geremd","aanhangwagen_middenas_geremd","aantal_staanplaatsen","aantal_deuren","aantal_wielen","afstand_hart_koppeling_tot_achterzijde_voertuig","afstand_voorzijde_voertuig_tot_hart_koppeling","afwijkende_maximum_snelheid","lengte","breedte","europese_voertuigcategorie","europese_voertuigcategorie_toevoeging","europese_uitvoeringcategorie_toevoeging","plaats_chassisnummer","technische_max_massa_voertuig","type","type_gasinstallatie","typegoedkeuringsnummer","variant","uitvoering","volgnummer_wijziging_eu_typegoedkeuring","vermogen_massarijklaar","wielbasis","export_indicator","openstaande_terugroepactie_indicator","vervaldatum_tachograaf","taxi_indicator","maximum_massa_samenstelling","aantal_rolstoelplaatsen","maximum_ondersteunende_snelheid","jaar_laatste_registratie_tellerstand","tellerstandoordeel","code_toelichting_tellerstandoordeel","tenaamstellen_mogelijk","vervaldatum_apk_dt","datum_tenaamstelling_dt","datum_eerste_toelating_dt","datum_eerste_tenaamstelling_in_nederland_dt","vervaldatum_tachograaf_dt","maximum_last_onder_de_vooras_sen_tezamen_koppeling","type_remsysteem_voertuig_code","rupsonderstelconfiguratiecode","wielbasis_voertuig_minimum","wielbasis_voertuig_maximum","lengte_voertuig_minimum","lengte_voertuig_maximum","breedte_voertuig_minimum","breedte_voertuig_maximum","hoogte_voertuig","hoogte_voertuig_minimum","hoogte_voertuig_maximum","massa_bedrijfsklaar_minimaal","massa_bedrijfsklaar_maximaal","technisch_toelaatbaar_massa_koppelpunt","maximum_massa_technisch_maximaal","maximum_massa_technisch_minimaal","subcategorie_nederland","verticale_belasting_koppelpunt_getrokken_voertuig","zuinigheidsclassificatie","registratie_datum_goedkeuring_afschrijvingsmoment_bpm","registratie_datum_goedkeuring_afschrijvingsmoment_bpm_dt","gem_lading_wrde","aerodyn_voorz","massa_alt_aandr","verl_cab_ind","api_gekentekende_voertuigen_assen","api_gekentekende_voertuigen_brandstof","api_gekentekende_voertuigen_carrosserie","api_gekentekende_voertuigen_carrosserie_specifiek","api_gekentekende_voertuigen_voertuigklasse"
"1ZPN02","Personenauto","BMW","750LI XDRIVE","20250418","20230523","11541","sedan","5","ZWART","Niet geregistreerd","8","4395","2010","2695","2110","750","2300","20130703","20150223","Geen verstrekking in Open Data","156546","Ja",,,,,,,"4","4","0","0",,"522","0","M1",,,"r. motorruimte","2695","7L",,"e1*2007/46*0276*07","YF81","5A000","0","0.16","321","Nee","Nee",,"Nee","5095","0","0.00","2024","Geen oordeel","05","Ja","2025-04-18T00:00:00.000","2023-05-23T00:00:00.000","2013-07-03T00:00:00.000","2015-02-23T00:00:00.000",,,,,,,,,,,,,,,,,,,,,"D",,,,,,,"https://opendata.rdw.nl/resource/3huj-srit.json","https://opendata.rdw.nl/resource/8ys7-d773.json","https://opendata.rdw.nl/resource/vezc-m2t6.json","https://opendata.rdw.nl/resource/jhie-znh9.json","https://opendata.rdw.nl/resource/kmfi-hrps.json"
"32PGH2","Personenauto","BMW","750LI XDRIVE","20250213","20170616","49822","sedan","5","ZWART","Niet geregistreerd","8","4395","2035","2690","2135","750","2100","20110114","20110114","Geen verstrekking in Open Data","202821","Ja",,,,,,,"4","4","0","0",,"521","0","M1",,,"r. motorruimte","2690","7L",,"e1*2007/46*0276*03","KC81","5B","0","0.14","321","Nee","Nee",,"Nee","4890","0","0.00","2024","Logisch","00","Ja","2025-02-13T00:00:00.000","2017-06-16T00:00:00.000","2011-01-14T00:00:00.000","2011-01-14T00:00:00.000",,,,,,,,,,,,,,,,,,,,,"F",,,,,,,"https://opendata.rdw.nl/resource/3huj-srit.json","https://opendata.rdw.nl/resource/8ys7-d773.json","https://opendata.rdw.nl/resource/vezc-m2t6.json","https://opendata.rdw.nl/resource/jhie-znh9.json","https://opendata.rdw.nl/resource/kmfi-hrps.json"
"53KRK4","Personenauto","BMW","750LI XDRIVE","20241004","20221210","42451","sedan","4","BLAUW","Niet geregistreerd","8","4395","2035","2690","2135","750","2100","20100122","20100122","Geen verstrekking in Open Data","162819","Ja",,,,,,,"4","4","0","0",,"521","0","M1",,,"r. motorruimte","2690","7L",,"e1*2007/46*0276*01","KC81","5K","0","0.14","321","Nee","Nee",,"Nee","4890","0","0.00","2023","Logisch","00","Ja","2024-10-04T00:00:00.000","2022-12-10T00:00:00.000","2010-01-22T00:00:00.000","2010-01-22T00:00:00.000",,,,,,,,,,,,,,,,,,,,,"F",,,,,,,"https://opendata.rdw.nl/resource/3huj-srit.json","https://opendata.rdw.nl/resource/8ys7-d773.json","https://opendata.rdw.nl/resource/vezc-m2t6.json","https://opendata.rdw.nl/resource/jhie-znh9.json","https://opendata.rdw.nl/resource/kmfi-hrps.json"
"5SJB44","Personenauto","BMW","750LI XDRIVE","20250329","20210825","18725","sedan","5","WIT","Niet geregistreerd","8","4395","2010","2695","2110","750","2300","20131008","20131008","Geen verstrekking in Open Data","161459","Ja",,,,,,,"4","4","0","0",,"522","0","M1",,,"r. motorruimte","2695","7L",,"e1*2007/46*0276*08","YF81","6A050000","0","0.16","321","Nee","Nee",,"Nee","5095","0","0.00","2024","Logisch","00","Ja","2025-03-29T00:00:00.000","2021-08-25T00:00:00.000","2013-10-08T00:00:00.000","2013-10-08T00:00:00.000",,,,,,,,,,,,,,,,,,,,,"D",,,,,,,"https://opendata.rdw.nl/resource/3huj-srit.json","https://opendata.rdw.nl/resource/8ys7-d773.json","https://opendata.rdw.nl/resource/vezc-m2t6.json","https://opendata.rdw.nl/resource/jhie-znh9.json","https://opendata.rdw.nl/resource/kmfi-hrps.json"
"G459ZN","Personenauto","BMW","750LI XDRIVE","20251026","20200109","37959","sedan","5","BLAUW","Niet geregistreerd","8","4395","1975","2675","2075","750","2300","20200109","20200109","Geen verstrekking in Open Data","205830","Ja","250",,,,,,"4","4","0","0",,"526","190","M1",,,,"2675","7L",,"e1*2007/46*0276*22","7U21","DAW50000","0","0.19","321","Nee","Nee",,"Nee","4975","0","0.00","2023","Logisch","00","Ja","2025-10-26T00:00:00.000","2020-01-09T00:00:00.000","2020-01-09T00:00:00.000","2020-01-09T00:00:00.000",,,,,,,,,,,"148",,,,,,,,,,"F",,,,,,,"https://opendata.rdw.nl/resource/3huj-srit.json","https://opendata.rdw.nl/resource/8ys7-d773.json","https://opendata.rdw.nl/resource/vezc-m2t6.json","https://opendata.rdw.nl/resource/jhie-znh9.json","https://opendata.rdw.nl/resource/kmfi-hrps.json"
"G753XB","Personenauto","BMW","750LI XDRIVE","20260307","20230706","16051","sedan","5","GRIJS","Niet geregistreerd","8","4395","1890","2615","1990","750","2300","20180307","20191214","Geen verstrekking in Open Data","213838","Ja","250",,,,,,"4","4","0","0",,"524","190","M1",,,,"2615","7L",,"e1*2007/46*0276*18","7F21","CA350000","0","0.17","321","Nee","Nee",,"Nee","4915","0","0.00","2024","Geen oordeel","05","Ja","2026-03-07T00:00:00.000","2023-07-06T00:00:00.000","2018-03-07T00:00:00.000","2019-12-14T00:00:00.000",,,,,,,,,,,"148",,,,,,,,,,"E",,,,,,,"https://opendata.rdw.nl/resource/3huj-srit.json","https://opendata.rdw.nl/resource/8ys7-d773.json","https://opendata.rdw.nl/resource/vezc-m2t6.json","https://opendata.rdw.nl/resource/jhie-znh9.json","https://opendata.rdw.nl/resource/kmfi-hrps.json"
"G788SN","Personenauto","BMW","750LI XDRIVE","20251125","20191125","37959","sedan","5","BRUIN","Niet geregistreerd","8","4395","1975","2675","2075","750","2300","20191125","20191125","Geen verstrekking in Open Data","216293","Ja","250",,,,,,"4","4","0","0",,"526","190","M1",,,,"2675","7L",,"e1*2007/46*0276*21","7U21","DAW50000","0","0.19","321","Nee","Nee",,"Nee","4975","0","0.00","2024","Logisch","00","Ja","2025-11-25T00:00:00.000","2019-11-25T00:00:00.000","2019-11-25T00:00:00.000","2019-11-25T00:00:00.000",,,,,,,,,,,"148",,,,,,,,,,,,,,,,,"https://opendata.rdw.nl/resource/3huj-srit.json","https://opendata.rdw.nl/resource/8ys7-d773.json","https://opendata.rdw.nl/resource/vezc-m2t6.json","https://opendata.rdw.nl/resource/jhie-znh9.json","https://opendata.rdw.nl/resource/kmfi-hrps.json"
"GP075R","Personenauto","BMW","750LI XDRIVE","20250326","20190614","12941","sedan","5","GRIJS","Niet geregistreerd","8","4395","2010","2695","2110","750","2300","20130812","20150715","Geen verstrekking in Open Data","181229","Ja",,,,,,,"4","4","0","0",,"522","0","M1",,,"r. motorruimte","2695","7L",,"e1*2007/46*0276*08","YF81","6A050000","0","0.16","321","Nee","Nee",,"Nee","5095","0","0.00","2024","Geen oordeel","05","Ja","2025-03-26T00:00:00.000","2019-06-14T00:00:00.000","2013-08-12T00:00:00.000","2015-07-15T00:00:00.000",,,,,,,,,,,,,,,,,,,,,"D",,,,,,,"https://opendata.rdw.nl/resource/3huj-srit.json","https://opendata.rdw.nl/resource/8ys7-d773.json","https://opendata.rdw.nl/resource/vezc-m2t6.json","https://opendata.rdw.nl/resource/jhie-znh9.json","https://opendata.rdw.nl/resource/kmfi-hrps.json"
"H201TD","Personenauto","BMW","750LI XDRIVE","20250228","20220226","22114","sedan","5","GRIJS","Niet geregistreerd","8","4395","1975","2675","2075","750","2300","20190228","20200803","Geen verstrekking in Open Data","201321","Ja","250",,,,,,"4","4","0","0",,"526","190","M1",,,,"2675","7L",,"e1*2007/46*0276*21","7U21","DAW50000","0","0.19","321","Nee","Nee",,"Nee","4975","0","0.00","2024","Geen oordeel","05","Ja","2025-02-28T00:00:00.000","2022-02-26T00:00:00.000","2019-02-28T00:00:00.000","2020-08-03T00:00:00.000",,,,,,,,,,,"148",,,,,,,,,,,,,,,,,"https://opendata.rdw.nl/resource/3huj-srit.json","https://opendata.rdw.nl/resource/8ys7-d773.json","https://opendata.rdw.nl/resource/vezc-m2t6.json","https://opendata.rdw.nl/resource/jhie-znh9.json","https://opendata.rdw.nl/resource/kmfi-hrps.json"
"H285GD","Personenauto","BMW","750LI XDRIVE","20250218","20210222","16027","sedan","4","ZWART","Niet geregistreerd","8","4395","1890","2615","1990","750","2300","20160620","20200122","Geen verstrekking in Open Data","200617","Ja","250",,,,,,"4","4","0","0",,"524","190","M1",,,,"2615","7L",,"e1*2007/46*0276*12","7F21","6A340000","0","0.17","321","Nee","Nee",,"Nee","5015","0","0.00","2024","Geen oordeel","05","Ja","2025-02-18T00:00:00.000","2021-02-22T00:00:00.000","2016-06-20T00:00:00.000","2020-01-22T00:00:00.000",,,,,,,,,,,"148",,,,,,,,,,"D",,,,,,,"https://opendata.rdw.nl/resource/3huj-srit.json","https://opendata.rdw.nl/resource/8ys7-d773.json","https://opendata.rdw.nl/resource/vezc-m2t6.json","https://opendata.rdw.nl/resource/jhie-znh9.json","https://opendata.rdw.nl/resource/kmfi-hrps.json"
"H325GR","Personenauto","BMW","750LI XDRIVE","20250103","20210527","23381","sedan","4","GRIJS","Niet geregistreerd","8","4395","1975","2675","2075","750","2300","20190304","20200306","Geen verstrekking in Open Data","221690","Ja","250",,,,,,"4","4","0","0",,"526","190","M1",,,"r. motorruimte","2675","7L",,"e1*2007/46*0276*21","7U21","DAW40000","0","0.19","321","Nee","Nee",,"Nee","4975","0","0.00","2023","Geen oordeel","05","Ja","2025-01-03T00:00:00.000","2021-05-27T00:00:00.000","2019-03-04T00:00:00.000","2020-03-06T00:00:00.000",,,,,,,,,,,"148",,,,,,,,,,,,,,,,,"https://opendata.rdw.nl/resource/3huj-srit.json","https://opendata.rdw.nl/resource/8ys7-d773.json","https://opendata.rdw.nl/resource/vezc-m2t6.json","https://opendata.rdw.nl/resource/jhie-znh9.json","https://opendata.rdw.nl/resource/kmfi-hrps.json"
"H409DR","Personenauto","BMW","750LI XDRIVE","20250606","20200110","16159","sedan","5","BRUIN","Niet geregistreerd","8","4395","1890","2615","1990","750","2300","20160707","20200110","Geen verstrekking in Open Data","171947","Ja","250",,,,,,"4","4","0","0",,"524","190","M1",,,,"2615","7L",,"e1*2007/46*0276*12","7F21","6A350000","0","0.17","321","Nee","Nee",,"Nee","5015","0","0.00","2024","Geen oordeel","05","Ja","2025-06-06T00:00:00.000","2020-01-10T00:00:00.000","2016-07-07T00:00:00.000","2020-01-10T00:00:00.000",,,,,,,,,,,"148",,,,,,,,,,"D",,,,,,,"https://opendata.rdw.nl/resource/3huj-srit.json","https://opendata.rdw.nl/resource/8ys7-d773.json","https://opendata.rdw.nl/resource/vezc-m2t6.json","https://opendata.rdw.nl/resource/jhie-znh9.json","https://opendata.rdw.nl/resource/kmfi-hrps.json"
"H503RN","Personenauto","BMW","750LI XDRIVE","20250411","20231115","23616","sedan","4","GRIJS","Niet geregistreerd","8","4395","1975","2675","2075","750","2300","20190411","20200414","Geen verstrekking in Open Data","179423","Ja","250",,,,,,"4","4","0","0",,"526","190","M1",,,"r. motorruimte","2675","7L",,"e1*2007/46*0276*21","7U21","DAW4000P","0","0.19","321","Nee","Nee",,"Nee","4975","0","0.00","2023","Geen oordeel","05","Ja","2025-04-11T00:00:00.000","2023-11-15T00:00:00.000","2019-04-11T00:00:00.000","2020-04-14T00:00:00.000",,,,,,,,,,,"148",,,,,,,,,,,,,,,,,"https://opendata.rdw.nl/resource/3huj-srit.json","https://opendata.rdw.nl/resource/8ys7-d773.json","https://opendata.rdw.nl/resource/vezc-m2t6.json","https://opendata.rdw.nl/resource/jhie-znh9.json","https://opendata.rdw.nl/resource/kmfi-hrps.json"
"H565LS","Personenauto","BMW","750LI XDRIVE","20250228","20210519","12638","sedan","4","ZWART","Niet geregistreerd","8","4395","1890","2615","1990","750","2300","20160629","20200305","Geen verstrekking in Open Data","192221","Ja","250",,,,,,"4","4","0","0",,"524","190","M1",,,,"2615","7L",,"e1*2007/46*0276*12","7F21","6A340000","0","0.17","321","Nee","Nee",,"Nee","5015","0","0.00","2024","Geen oordeel","05","Ja","2025-02-28T00:00:00.000","2021-05-19T00:00:00.000","2016-06-29T00:00:00.000","2020-03-05T00:00:00.000",,,,,,,,,,,"148",,,,,,,,,,"D",,,,,,,"https://opendata.rdw.nl/resource/3huj-srit.json","https://opendata.rdw.nl/resource/8ys7-d773.json","https://opendata.rdw.nl/resource/vezc-m2t6.json","https://opendata.rdw.nl/resource/jhie-znh9.json","https://opendata.rdw.nl/resource/kmfi-hrps.json"
"H731JG","Personenauto","BMW","750LI XDRIVE","20250131","20200212","15169","sedan","5","ZWART","Niet geregistreerd","8","4395","1890","2615","1990","750","2300","20150902","20200212","Geen verstrekking in Open Data","176771","Ja","250",,,,,,"4","4","0","0",,"524","190","M1",,,,"2615","7L",,"e1*2007/46*0276*10","7F21","6A350000","0","0.17","321","Nee","Nee",,"Nee","5015","0","0.00","2024","Geen oordeel","05","Ja","2025-01-31T00:00:00.000","2020-02-12T00:00:00.000","2015-09-02T00:00:00.000","2020-02-12T00:00:00.000",,,,,,,,,,,"148",,,,,,,,,,"D",,,,,,,"https://opendata.rdw.nl/resource/3huj-srit.json","https://opendata.rdw.nl/resource/8ys7-d773.json","https://opendata.rdw.nl/resource/vezc-m2t6.json","https://opendata.rdw.nl/resource/jhie-znh9.json","https://opendata.rdw.nl/resource/kmfi-hrps.json"
"H962NR","Personenauto","BMW","750LI XDRIVE","20250722","20220706","20782","sedan","4","GRIJS","Niet geregistreerd","8","4395","1975","2675","2075","750","2300","20190722","20200317","Geen verstrekking in Open Data","240901","Ja","250",,,,,,"4","4","0","0",,"526","190","M1",,,,"2675","7L",,"e1*2007/46*0276*21","7U21","DAW40000","0","0.19","321","Nee","Nee",,"Nee","4975","0","0.00","2023","Geen oordeel","05","Ja","2025-07-22T00:00:00.000","2022-07-06T00:00:00.000","2019-07-22T00:00:00.000","2020-03-17T00:00:00.000",,,,,,,,,,,"148",,,,,,,,,,,,,,,,,"https://opendata.rdw.nl/resource/3huj-srit.json","https://opendata.rdw.nl/resource/8ys7-d773.json","https://opendata.rdw.nl/resource/vezc-m2t6.json","https://opendata.rdw.nl/resource/jhie-znh9.json","https://opendata.rdw.nl/resource/kmfi-hrps.json"
"HB001P","Personenauto","BMW","750LI XDRIVE","20241005","20170609","19917","sedan","4","GRIJS","Niet geregistreerd","8","4395","1890","2615","1990","750","2300","20151002","20151002","Geen verstrekking in Open Data","193712","Ja",,,,,,,"4","4","0","0",,"524","190","M1",,,"in motorruimte r.","2615","7L",,"e1*2007/46*0276*10","7F21","6A340000","0","0.17","321","Nee","Nee",,"Nee","5015","0",,"2023","Logisch","00","Ja","2024-10-05T00:00:00.000","2017-06-09T00:00:00.000","2015-10-02T00:00:00.000","2015-10-02T00:00:00.000",,,,,,,,,,,"148",,,,,,,,,,"D",,,,,,,"https://opendata.rdw.nl/resource/3huj-srit.json","https://opendata.rdw.nl/resource/8ys7-d773.json","https://opendata.rdw.nl/resource/vezc-m2t6.json","https://opendata.rdw.nl/resource/jhie-znh9.json","https://opendata.rdw.nl/resource/kmfi-hrps.json"
"HF206D","Personenauto","BMW","750LI XDRIVE","20241013","20240425","19917","sedan","4","GRIJS","Niet geregistreerd","8","4395","1890","2615","1990","750","2300","20151013","20151013","Geen verstrekking in Open Data","192750","Ja",,,,,,,"4","4","0","0",,"524","190","M1",,,"in motorruimte r.","2615","7L",,"e1*2007/46*0276*10","7F21","6A340000","0","0.17","321","Nee","Nee",,"Nee","5015","0",,"2024","Logisch","00","Ja","2024-10-13T00:00:00.000","2024-04-25T00:00:00.000","2015-10-13T00:00:00.000","2015-10-13T00:00:00.000",,,,,,,,,,,"148",,,,,,,,,,"D",,,,,,,"https://opendata.rdw.nl/resource/3huj-srit.json","https://opendata.rdw.nl/resource/8ys7-d773.json","https://opendata.rdw.nl/resource/vezc-m2t6.json","https://opendata.rdw.nl/resource/jhie-znh9.json","https://opendata.rdw.nl/resource/kmfi-hrps.json"
"HH314S","Personenauto","BMW","750LI XDRIVE","20240922","20240403","19917","sedan","5","ZWART","Niet geregistreerd","8","4395","1890","2615","1990","750","2300","20151105","20151105","Geen verstrekking in Open Data","172395","Ja",,,,,,,"4","4","0","0",,"524","190","M1",,,"in motorruimte r.","2615","7L",,"e1*2007/46*0276*10","7F21","6A350000","0","0.17","321","Nee","Nee",,"Nee","5015","0","0.00","2024","Logisch","00","Ja","2024-09-22T00:00:00.000","2024-04-03T00:00:00.000","2015-11-05T00:00:00.000","2015-11-05T00:00:00.000",,,,,,,,,,,"148",,,,,,,,,,"D",,,,,,,"https://opendata.rdw.nl/resource/3huj-srit.json","https://opendata.rdw.nl/resource/8ys7-d773.json","https://opendata.rdw.nl/resource/vezc-m2t6.json","https://opendata.rdw.nl/resource/jhie-znh9.json","https://opendata.rdw.nl/resource/kmfi-hrps.json"
"HH421X","Personenauto","BMW","750LI XDRIVE","20250405","20210203","19917","sedan","5","BLAUW","Niet geregistreerd","8","4395","1890","2615","1990","750","2300","20151106","20151106","Geen verstrekking in Open Data","183547","Ja",,,,,,,"4","4","0","0",,"524","190","M1",,,"in motorruimte r.","2615","7L",,"e1*2007/46*0276*10","7F21","6A350000","0","0.17","321","Nee","Nee",,"Nee","5015","0","0.00","2024","Logisch","00","Ja","2025-04-05T00:00:00.000","2021-02-03T00:00:00.000","2015-11-06T00:00:00.000","2015-11-06T00:00:00.000",,,,,,,,,,,"148",,,,,,,,,,"D",,,,,,,"https://opendata.rdw.nl/resource/3huj-srit.json","https://opendata.rdw.nl/resource/8ys7-d773.json","https://opendata.rdw.nl/resource/vezc-m2t6.json","https://opendata.rdw.nl/resource/jhie-znh9.json","https://opendata.rdw.nl/resource/kmfi-hrps.json"
"HJ261B","Personenauto","BMW","750LI XDRIVE","20241115","20201224","19917","sedan","5","ZWART","Niet geregistreerd","8","4395","1890","2615","1990","750","2300","20151105","20151105","Geen verstrekking in Open Data","186275","Ja",,,,,,,"4","4","0","0",,"524","190","M1",,,"in motorruimte r.","2615","7L",,"e1*2007/46*0276*10","7F21","6A350000","0","0.17","321","Nee","Nee",,"Nee","5015","0","0.00","2023","Logisch","00","Ja","2024-11-15T00:00:00.000","2020-12-24T00:00:00.000","2015-11-05T00:00:00.000","2015-11-05T00:00:00.000",,,,,,,,,,,"148",,,,,,,,,,"D",,,,,,,"https://opendata.rdw.nl/resource/3huj-srit.json","https://opendata.rdw.nl/resource/8ys7-d773.json","https://opendata.rdw.nl/resource/vezc-m2t6.json","https://opendata.rdw.nl/resource/jhie-znh9.json","https://opendata.rdw.nl/resource/kmfi-hrps.json"
"HJ739H","Personenauto","BMW","750LI XDRIVE","20241110","20200615","19917","sedan","5","GRIJS","Niet geregistreerd","8","4395","1890","2615","1990","750","2300","20151110","20151110","Geen verstrekking in Open Data","182367","Ja",,,,,,,"4","4","0","0",,"524","190","M1",,,"in motorruimte r.","2615","7L",,"e1*2007/46*0276*10","7F21","6A350000","0","0.17","321","Nee","Nee",,"Nee","5015","0","0.00","2023","Logisch","00","Ja","2024-11-10T00:00:00.000","2020-06-15T00:00:00.000","2015-11-10T00:00:00.000","2015-11-10T00:00:00.000",,,,,,,,,,,"148",,,,,,,,,,"D",,,,,,,"https://opendata.rdw.nl/resource/3huj-srit.json","https://opendata.rdw.nl/resource/8ys7-d773.json","https://opendata.rdw.nl/resource/vezc-m2t6.json","https://opendata.rdw.nl/resource/jhie-znh9.json","https://opendata.rdw.nl/resource/kmfi-hrps.json"
"HK358G","Personenauto","BMW","750LI XDRIVE","20241121","20221104","19917","sedan","5","BLAUW","Niet geregistreerd","8","4395","1890","2615","1990","750","2300","20151121","20151121","Geen verstrekking in Open Data","173155","Ja",,,,,,,"4","4","0","0",,"524","190","M1",,,"in motorruimte r.","2615","7L",,"e1*2007/46*0276*11","7F21","6A350000","0","0.17","321","Nee","Nee",,"Nee","5015","0","0.00","2024","Logisch","00","Ja","2024-11-21T00:00:00.000","2022-11-04T00:00:00.000","2015-11-21T00:00:00.000","2015-11-21T00:00:00.000",,,,,,,,,,,"148",,,,,,,,,,"D",,,,,,,"https://opendata.rdw.nl/resource/3huj-srit.json","https://opendata.rdw.nl/resource/8ys7-d773.json","https://opendata.rdw.nl/resource/vezc-m2t6.json","https://opendata.rdw.nl/resource/jhie-znh9.json","https://opendata.rdw.nl/resource/kmfi-hrps.json"
"HK529J","Personenauto","BMW","750LI XDRIVE","20240828","20161216","13956","sedan","4","BLAUW","Niet geregistreerd","8","4395","1890","2615","1990","750","2300","20150828","20151120","Geen verstrekking in Open Data","196484","Ja",,,,,,,"4","4","0","0",,"524","0","M1",,,"r. motorruimte","2615","7L",,"e1*2007/46*0276*10","7F21","6A340000","0","0.17","321","Nee","Nee",,"Nee","5015","0",,"2023","Geen oordeel","05","Ja","2024-08-28T00:00:00.000","2016-12-16T00:00:00.000","2015-08-28T00:00:00.000","2015-11-20T00:00:00.000",,,,,,,,,,,,,,,,,,,,,"D",,,,,,,"https://opendata.rdw.nl/resource/3huj-srit.json","https://opendata.rdw.nl/resource/8ys7-d773.json","https://opendata.rdw.nl/resource/vezc-m2t6.json","https://opendata.rdw.nl/resource/jhie-znh9.json","https://opendata.rdw.nl/resource/kmfi-hrps.json"
"HL251L","Personenauto","BMW","750LI XDRIVE","20241127","20201016","19917","sedan","4","WIT","Niet geregistreerd","8","4395","1890","2615","1990","750","2300","20151127","20151127","Geen verstrekking in Open Data","197853","Ja",,,,,,,"4","4","0","0",,"524","190","M1",,,"in motorruimte r.","2615","7L",,"e1*2007/46*0276*11","7F21","6A340000","0","0.17","321","Nee","Nee",,"Nee","5015","0","0.00","2024","Logisch","00","Ja","2024-11-27T00:00:00.000","2020-10-16T00:00:00.000","2015-11-27T00:00:00.000","2015-11-27T00:00:00.000",,,,,,,,,,,"148",,,,,,,,,,"D",,,,,,,"https://opendata.rdw.nl/resource/3huj-srit.json","https://opendata.rdw.nl/resource/8ys7-d773.json","https://opendata.rdw.nl/resource/vezc-m2t6.json","https://opendata.rdw.nl/resource/jhie-znh9.json","https://opendata.rdw.nl/resource/kmfi-hrps.json"
"HN147N","Personenauto","BMW","750LI XDRIVE","20240828","20230918","14167","sedan","4","BLAUW","Niet geregistreerd","8","4395","1890","2615","1990","750","2300","20150825","20151221","Geen verstrekking in Open Data","198653","Ja",,,,,,,"4","4","0","0",,"524","0","M1",,,"r. motorruimte","2615","7L",,"e1*2007/46*0276*10","7F21","6A340000","0","0.17","321","Nee","Nee",,"Nee","5015","0",,"2024","Geen oordeel","05","Ja","2024-08-28T00:00:00.000","2023-09-18T00:00:00.000","2015-08-25T00:00:00.000","2015-12-21T00:00:00.000",,,,,,,,,,,,,,,,,,,,,"D",,,,,,,"https://opendata.rdw.nl/resource/3huj-srit.json","https://opendata.rdw.nl/resource/8ys7-d773.json","https://opendata.rdw.nl/resource/vezc-m2t6.json","https://opendata.rdw.nl/resource/jhie-znh9.json","https://opendata.rdw.nl/resource/kmfi-hrps.json"