"kenteken","voertuigsoort","merk","handelsbenaming","vervaldatum_apk","datum_tenaamstelling","bruto_bpm","inrichting","aantal_zitplaatsen","eerste_kleur","tweede_kleur","aantal_cilinders","cilinderinhoud","massa_ledig_voertuig","toegestane_maximum_massa_voertuig","massa_rijklaar","maximum_massa_trekken_ongeremd","maximum_trekken_massa_geremd","datum_eerste_toelating","datum_eerste_tenaamstelling_in_nederland","wacht_op_keuren","catalogusprijs","wam_verzekerd","maximale_constructiesnelheid","laadvermogen","oplegger_geremd","aanhangwagen_autonoom_geremd","aanhangwagen_middenas_geremd","aantal_staanplaatsen","aantal_deuren","aantal_wielen","afstand_hart_koppeling_tot_achterzijde_voertuig","afstand_voorzijde_voertuig_tot_hart_koppeling","afwijkende_maximum_snelheid","lengte","breedte","europese_voertuigcategorie","europese_voertuigcategorie_toevoeging","europese_uitvoeringcategorie_toevoeging","plaats_chassisnummer","technische_max_massa_voertuig","type","type_gasinstallatie","typegoedkeuringsnummer","variant","uitvoering","volgnummer_wijziging_eu_typegoedkeuring","vermogen_massarijklaar","wielbasis","export_indicator","openstaande_terugroepactie_indicator","vervaldatum_tachograaf","taxi_indicator","maximum_massa_samenstelling","aantal_rolstoelplaatsen","maximum_ondersteunende_snelheid","jaar_laatste_registratie_tellerstand","tellerstandoordeel","code_toelichting_tellerstandoordeel","tenaamstellen_mogelijk","vervaldatum_apk_dt","datum_tenaamstelling_dt","datum_eerste_toelating_dt","datum_eerste_tenaamstelling_in_nederland_dt","vervaldatum_tachograaf_dt","maximum_last_onder_de_vooras_sen_tezamen_koppeling","type_remsysteem_voertuig_code","rupsonderstelconfiguratiecode","wielbasis_voertuig_minimum","wielbasis_voertuig_maximum","lengte_voertuig_minimum","lengte_voertuig_maximum","breedte_voertuig_minimum","breedte_voertuig_maximum","hoogte_voertuig","hoogte_voertuig_minimum","hoogte_voertuig_maximum","massa_bedrijfsklaar_minimaal","massa_bedrijfsklaar_maximaal","technisch_toelaatbaar_massa_koppelpunt","maximum_massa_technisch_maximaal","maximum_massa_technisch_minimaal","subcategorie_nederland","verticale_belasting_koppelpunt_getrokken_voertuig","zuinigheidsclassificatie","registratie_datum_goedkeuring_afschrijvingsmoment_bpm","registratie_datum_goedkeuring_afschrijvingsmoment_bpm_dt","gem_lading_wrde","aerodyn_voorz","massa_alt_aandr","verl_cab_ind","api_gekentekende_voertuigen_assen","api_gekentekende_voertuigen_brandstof","api_gekentekende_voertuigen_carrosserie","api_gekentekende_voertuigen_carrosserie_specifiek","api_gekentekende_voertuigen_voertuigklasse"
"AL8537","Personenauto","AUSTIN","HEALEY 3000 MK3",,"20230324",,"cabriolet",,"GROEN","Niet geregistreerd","6","2912","1170",,"1270",,,"19640630","20050201","Geen verstrekking in Open Data",,"Ja",,,,,,,"2","4",,,,,,"M1",,,"tegen r. balk 055 cm a. vooras",,,,,,,,"0.09","234","Nee","Nee",,"Nee",,,,"2023","Onlogisch","04","Ja",,"2023-03-24T00:00:00.000","1964-06-30T00:00:00.000","2005-02-01T00:00:00.000",,"0",,,,,,,,,,,,,,,,,,,,,,,,,,"https://opendata.rdw.nl/resource/3huj-srit.json","https://opendata.rdw.nl/resource/8ys7-d773.json","https://opendata.rdw.nl/resource/vezc-m2t6.json","https://opendata.rdw.nl/resource/jhie-znh9.json","https://opendata.rdw.nl/resource/kmfi-hrps.json"
"AM1652","Personenauto","AUSTIN","HEALEY 3000 MK3",,"20060809",,"cabriolet",,"BLAUW","Niet geregistreerd","6","2912","1180",,"1280",,,"19660630","20060706","Geen verstrekking in Open Data",,"Ja",,,,,,,"2","4",,,,,,"M1",,,"boven r. schroefveerkoker t.p.v. vooras",,,,,,,,"0.10","234","Nee","Nee",,"Nee",,,,"2006","Geen oordeel","05","Ja",,"2006-08-09T00:00:00.000","1966-06-30T00:00:00.000","2006-07-06T00:00:00.000",,"0",,,,,,,,,,,,,,,,,,,,,,,,,,"https://opendata.rdw.nl/resource/3huj-srit.json","https://opendata.rdw.nl/resource/8ys7-d773.json","https://opendata.rdw.nl/resource/vezc-m2t6.json","https://opendata.rdw.nl/resource/jhie-znh9.json","https://opendata.rdw.nl/resource/kmfi-hrps.json"
"DE0863","Personenauto","AUSTIN","HEALEY 3000 MK3",,"19871009",,"Niet geregistreerd",,"BLAUW","Niet geregistreerd","6",,"1161",,"1261",,,"19660630","19871009","Geen verstrekking in Open Data",,"Ja",,,,,,,"2","4",,,,,,"M1",,,"op l. voorwielscherm onder motorkap",,,,,,,,"0.00","223","Nee","Nee",,"Nee",,,,"2024","Geen oordeel","07","Ja",,"1987-10-09T00:00:00.000","1966-06-30T00:00:00.000","1987-10-09T00:00:00.000",,"0",,,,,,,,,,,,,,,,,,,,,,,,,,"https://opendata.rdw.nl/resource/3huj-srit.json","https://opendata.rdw.nl/resource/8ys7-d773.json","https://opendata.rdw.nl/resource/vezc-m2t6.json","https://opendata.rdw.nl/resource/jhie-znh9.json","https://opendata.rdw.nl/resource/kmfi-hrps.json"
"DE1723","Personenauto","AUSTIN","HEALEY 3000 MK3",,"20221110",,"Niet geregistreerd",,"ZWART","Niet geregistreerd","6",,"1180",,"1280",,,"19650630","19880620","Geen verstrekking in Open Data",,"Ja",,,,,,,"2","4",,,,,,"M1",,,"r. in watergoot onder motorkap",,,,,,,,"0.00","234","Nee","Nee",,"Nee",,,,"2020","Geen oordeel","05","Ja",,"2022-11-10T00:00:00.000","1965-06-30T00:00:00.000","1988-06-20T00:00:00.000",,"0",,,,,,,,,,,,,,,,,,,,,,,,,,"https://opendata.rdw.nl/resource/3huj-srit.json","https://opendata.rdw.nl/resource/8ys7-d773.json","https://opendata.rdw.nl/resource/vezc-m2t6.json","https://opendata.rdw.nl/resource/jhie-znh9.json","https://opendata.rdw.nl/resource/kmfi-hrps.json"
"DE8582","Personenauto","AUSTIN","HEALEY 3000 MK3",,"20061123",,"Niet geregistreerd",,"BLAUW","Niet geregistreerd","6",,"1160",,"1260",,,"19660630","19910612","Geen verstrekking in Open Data",,"Ja",,,,,,,"2","4",,,,,,"M1",,,"tegen r. balk 050 cm a. vooras",,,,,,,,"0.00","233","Nee","Nee",,"Nee",,,,"2020","Geen oordeel","07","Ja",,"2006-11-23T00:00:00.000","1966-06-30T00:00:00.000","1991-06-12T00:00:00.000",,"0",,,,,,,,,,,,,,,,,,,,,,,,,,"https://opendata.rdw.nl/resource/3huj-srit.json","https://opendata.rdw.nl/resource/8ys7-d773.json","https://opendata.rdw.nl/resource/vezc-m2t6.json","https://opendata.rdw.nl/resource/jhie-znh9.json","https://opendata.rdw.nl/resource/kmfi-hrps.json"
"DH2403","Personenauto","AUSTIN","HEALEY 3000 MK3",,"19990331",,"Niet geregistreerd",,"ROOD","Niet geregistreerd","6",,"1140",,"1240",,,"19670630","19920826","Geen verstrekking in Open Data",,"Ja",,,,,,,"2","4",,,,,,"M1",,,"r. in voorwielscherm onder motorkap",,,,,,,,"0.00","233","Nee","Nee",,"Nee",,,,"2019","Geen oordeel","07","Ja",,"1999-03-31T00:00:00.000","1967-06-30T00:00:00.000","1992-08-26T00:00:00.000",,"0",,,,,,,,,,,,,,,,,,,,,,,,,,"https://opendata.rdw.nl/resource/3huj-srit.json","https://opendata.rdw.nl/resource/8ys7-d773.json","https://opendata.rdw.nl/resource/vezc-m2t6.json","https://opendata.rdw.nl/resource/jhie-znh9.json","https://opendata.rdw.nl/resource/kmfi-hrps.json"
"DH6372","Personenauto","AUSTIN","HEALEY 3000 MK3",,"19931007",,"Niet geregistreerd",,"WIT","Niet geregistreerd","6",,"1195",,"1295",,,"19660630","19931007","Geen verstrekking in Open Data",,"Ja",,,,,,,"2","4",,,,,,"M1",,,"r. in watergoot onder motorkap",,,,,,,,"0.00","233","Nee","Nee",,"Nee",,,,"2020","Geen oordeel","05","Ja",,"1993-10-07T00:00:00.000","1966-06-30T00:00:00.000","1993-10-07T00:00:00.000",,"0",,,,,,,,,,,,,,,,,,,,,,,,,,"https://opendata.rdw.nl/resource/3huj-srit.json","https://opendata.rdw.nl/resource/8ys7-d773.json","https://opendata.rdw.nl/resource/vezc-m2t6.json","https://opendata.rdw.nl/resource/jhie-znh9.json","https://opendata.rdw.nl/resource/kmfi-hrps.json"
"DH7477","Personenauto","AUSTIN","HEALEY 3000 MK3",,"19960126",,"Niet geregistreerd",,"BLAUW","Niet geregistreerd","6",,"1180",,"1280",,,"19650228","19960126","Geen verstrekking in Open Data",,"Ja",,,,,,,"2","4",,,,,,"M1",,,"tegen r. balk a. vooras",,,,,,,,"0.00","234","Nee","Nee",,"Nee",,,,"2019","Geen oordeel","07","Ja",,"1996-01-26T00:00:00.000","1965-02-28T00:00:00.000","1996-01-26T00:00:00.000",,"0",,,,,,,,,,,,,,,,,,,,,,,,,,"https://opendata.rdw.nl/resource/3huj-srit.json","https://opendata.rdw.nl/resource/8ys7-d773.json","https://opendata.rdw.nl/resource/vezc-m2t6.json","https://opendata.rdw.nl/resource/jhie-znh9.json","https://opendata.rdw.nl/resource/kmfi-hrps.json"
"DL0194","Personenauto","AUSTIN","HEALEY 3000 MK3",,"20230913",,"Niet geregistreerd",,"GROEN","Niet geregistreerd","6",,"1200",,"1300",,,"19670228","19940823","Geen verstrekking in Open Data",,"Ja",,,,,,,"2","4",,,,,,"M1",,,"r. in watergoot onder motorkap",,,,,,,,"0.00","234","Nee","Nee",,"Nee",,,,"2023","Geen oordeel","07","Ja",,"2023-09-13T00:00:00.000","1967-02-28T00:00:00.000","1994-08-23T00:00:00.000",,"0",,,,,,,,,,,,,,,,,,,,,,,,,,"https://opendata.rdw.nl/resource/3huj-srit.json","https://opendata.rdw.nl/resource/8ys7-d773.json","https://opendata.rdw.nl/resource/vezc-m2t6.json","https://opendata.rdw.nl/resource/jhie-znh9.json","https://opendata.rdw.nl/resource/kmfi-hrps.json"
"DM1418","Personenauto","AUSTIN","HEALEY 3000 MK3",,"20170330",,"Niet geregistreerd",,"WIT","Niet geregistreerd","6",,"1180",,"1280",,,"19650630","19960514","Geen verstrekking in Open Data",,"Ja",,,,,,,"2","4",,,,,,"M1",,,"tegen r. balk 040 cm a. vooras",,,,,,,,"0.00","231","Nee","Nee",,"Nee",,,,"2017","Geen oordeel","05","Ja",,"2017-03-30T00:00:00.000","1965-06-30T00:00:00.000","1996-05-14T00:00:00.000",,"0",,,,,,,,,,,,,,,,,,,,,,,,,,"https://opendata.rdw.nl/resource/3huj-srit.json","https://opendata.rdw.nl/resource/8ys7-d773.json","https://opendata.rdw.nl/resource/vezc-m2t6.json","https://opendata.rdw.nl/resource/jhie-znh9.json","https://opendata.rdw.nl/resource/kmfi-hrps.json"
"LG13JB","Personenauto","AUSTIN","HEALEY 3000 MK3",,"19900507",,"Niet geregistreerd",,"BLAUW","Niet geregistreerd","6",,"1140",,"1240",,,"19780728","19780728","Geen verstrekking in Open Data",,"Nee",,,,,,,"2","4",,,,,,"M1",,,"r. in watergoot onder motorkap",,,,,,,,"0.00","234","Nee","Nee",,"Nee",,,,,"Niet geregistreerd","NG","Ja",,"1990-05-07T00:00:00.000","1978-07-28T00:00:00.000","1978-07-28T00:00:00.000",,"0",,,,,,,,,,,,,,,,,,,,,,,,,,"https://opendata.rdw.nl/resource/3huj-srit.json","https://opendata.rdw.nl/resource/8ys7-d773.json","https://opendata.rdw.nl/resource/vezc-m2t6.json","https://opendata.rdw.nl/resource/jhie-znh9.json","https://opendata.rdw.nl/resource/kmfi-hrps.json"
