"kenteken","voertuigsoort","merk","handelsbenaming","vervaldatum_apk","datum_tenaamstelling","bruto_bpm","inrichting","aantal_zitplaatsen","eerste_kleur","tweede_kleur","aantal_cilinders","cilinderinhoud","massa_ledig_voertuig","toegestane_maximum_massa_voertuig","massa_rijklaar","maximum_massa_trekken_ongeremd","maximum_trekken_massa_geremd","datum_eerste_toelating","datum_eerste_tenaamstelling_in_nederland","wacht_op_keuren","catalogusprijs","wam_verzekerd","maximale_constructiesnelheid","laadvermogen","oplegger_geremd","aanhangwagen_autonoom_geremd","aanhangwagen_middenas_geremd","aantal_staanplaatsen","aantal_deuren","aantal_wielen","afstand_hart_koppeling_tot_achterzijde_voertuig","afstand_voorzijde_voertuig_tot_hart_koppeling","afwijkende_maximum_snelheid","lengte","breedte","europese_voertuigcategorie","europese_voertuigcategorie_toevoeging","europese_uitvoeringcategorie_toevoeging","plaats_chassisnummer","technische_max_massa_voertuig","type","type_gasinstallatie","typegoedkeuringsnummer","variant","uitvoering","volgnummer_wijziging_eu_typegoedkeuring","vermogen_massarijklaar","wielbasis","export_indicator","openstaande_terugroepactie_indicator","vervaldatum_tachograaf","taxi_indicator","maximum_massa_samenstelling","aantal_rolstoelplaatsen","maximum_ondersteunende_snelheid","jaar_laatste_registratie_tellerstand","tellerstandoordeel","code_toelichting_tellerstandoordeel","tenaamstellen_mogelijk","vervaldatum_apk_dt","datum_tenaamstelling_dt","datum_eerste_toelating_dt","datum_eerste_tenaamstelling_in_nederland_dt","vervaldatum_tachograaf_dt","maximum_last_onder_de_vooras_sen_tezamen_koppeling","type_remsysteem_voertuig_code","rupsonderstelconfiguratiecode","wielbasis_voertuig_minimum","wielbasis_voertuig_maximum","lengte_voertuig_minimum","lengte_voertuig_maximum","breedte_voertuig_minimum","breedte_voertuig_maximum","hoogte_voertuig","hoogte_voertuig_minimum","hoogte_voertuig_maximum","massa_bedrijfsklaar_minimaal","massa_bedrijfsklaar_maximaal","technisch_toelaatbaar_massa_koppelpunt","maximum_massa_technisch_maximaal","maximum_massa_technisch_minimaal","subcategorie_nederland","verticale_belasting_koppelpunt_getrokken_voertuig","zuinigheidsclassificatie","registratie_datum_goedkeuring_afschrijvingsmoment_bpm","registratie_datum_goedkeuring_afschrijvingsmoment_bpm_dt","gem_lading_wrde","aerodyn_voorz","massa_alt_aandr","verl_cab_ind","api_gekentekende_voertuigen_assen","api_gekentekende_voertuigen_brandstof","api_gekentekende_voertuigen_carrosserie","api_gekentekende_voertuigen_carrosserie_specifiek","api_gekentekende_voertuigen_voertuigklasse"
"1TXZ03","Personenauto","ADRIA","TWIN 640 SLX","20240604","20140604","10883","kampeerwagen","4","GRIJS","Niet geregistreerd","4","2287","2887","3500","2987","750","3000","20140604","20140604","Geen verstrekking in Open Data",,"Ja",,,,,,,"3","4","0","0",,"0","0","M1",,,"r.","3500","C",,"e1*2007/46*0767*06","7CM","K34","0","0.03","404","Nee","Nee",,"Nee","6500","0","0.00","2023","Logisch","00","Ja","2024-06-04T00:00:00.000","2014-06-04T00:00:00.000","2014-06-04T00:00:00.000","2014-06-04T00:00:00.000",,"0",,,,,,,,,,,,,,,,,,,,,,,,,,"https://opendata.rdw.nl/resource/3huj-srit.json","https://opendata.rdw.nl/resource/8ys7-d773.json","https://opendata.rdw.nl/resource/vezc-m2t6.json","https://opendata.rdw.nl/resource/jhie-znh9.json","https://opendata.rdw.nl/resource/kmfi-hrps.json"
"2TZR16","Personenauto","ADRIA","TWIN 640 SLX","20240712","20240409","11109","kampeerwagen","4","GRIJS","Niet geregistreerd","4","2287","2847","3500","2947","750","2500","20140630","20140630","Geen verstrekking in Open Data","57904","Ja",,,,,,,"3","4","0","0",,"0","0","M1",,,"r.","3500","C",,"e1*2007/46*0767*05","7CR","K34","0","0.03","404","Nee","Nee",,"Nee","6000","0","0.00","2024","Logisch","00","Ja","2024-07-12T00:00:00.000","2024-04-09T00:00:00.000","2014-06-30T00:00:00.000","2014-06-30T00:00:00.000",,,,,,,,,,,,,,,,,,,,,,,,,,,,"https://opendata.rdw.nl/resource/3huj-srit.json","https://opendata.rdw.nl/resource/8ys7-d773.json","https://opendata.rdw.nl/resource/vezc-m2t6.json","https://opendata.rdw.nl/resource/jhie-znh9.json","https://opendata.rdw.nl/resource/kmfi-hrps.json"
"5TLV76","Personenauto","ADRIA","TWIN 640 SLX","20240614","20180615","13161","kampeerwagen","4","GRIJS","Niet geregistreerd","4","2999","2947","4250","3047","750","3000","20140322","20140322","Geen verstrekking in Open Data","68684","Ja",,,,,,,"3","4",,,,,,"M1",,,"r.","4250","C",,,,,,"0.04","404","Nee","Nee",,"Nee","6500",,,"2023","Logisch","00","Ja","2024-06-14T00:00:00.000","2018-06-15T00:00:00.000","2014-03-22T00:00:00.000","2014-03-22T00:00:00.000",,,,,,,,,,,,,,,,,,,,,,,,,,,,"https://opendata.rdw.nl/resource/3huj-srit.json","https://opendata.rdw.nl/resource/8ys7-d773.json","https://opendata.rdw.nl/resource/vezc-m2t6.json","https://opendata.rdw.nl/resource/jhie-znh9.json","https://opendata.rdw.nl/resource/kmfi-hrps.json"
"6TGX14","Personenauto","ADRIA","TWIN 640 SLX","20250313","20230414","11919","kampeerwagen","4","ZWART","Niet geregistreerd","4","2287","2897","3500","2997","750","3000","20140213","20140213","Geen verstrekking in Open Data","62384","Ja",,,,,,,"3","4","0","0",,"0","0","M1",,,"r.","3500","C",,"e1*2007/46*0767*06","7DM","K34","0","0.03","404","Nee","Nee",,"Nee","6500","0","0.00","2024","Logisch","00","Ja","2025-03-13T00:00:00.000","2023-04-14T00:00:00.000","2014-02-13T00:00:00.000","2014-02-13T00:00:00.000",,,,,,,,,,,,,,,,,,,,,,,,,,,,"https://opendata.rdw.nl/resource/3huj-srit.json","https://opendata.rdw.nl/resource/8ys7-d773.json","https://opendata.rdw.nl/resource/vezc-m2t6.json","https://opendata.rdw.nl/resource/jhie-znh9.json","https://opendata.rdw.nl/resource/kmfi-hrps.json"
"7XSG73","Personenauto","ADRIA","TWIN 640 SLX","20250501","20240424","9127","kampeerwagen","4","GRIJS","Niet geregistreerd","4","2287","2847","3500","2947","750","2500","20140423","20141020","Geen verstrekking in Open Data",,"Ja",,,,,,,"4","4",,,,,,"M1",,,"r. voorwielscherm","3500",,,,,,,"0.03","404","Nee","Nee",,"Nee",,,,"2024","Geen oordeel","05","Ja","2025-05-01T00:00:00.000","2024-04-24T00:00:00.000","2014-04-23T00:00:00.000","2014-10-20T00:00:00.000",,"0",,,,,,,,,,,,,,,,,,,,,,,,,,"https://opendata.rdw.nl/resource/3huj-srit.json","https://opendata.rdw.nl/resource/8ys7-d773.json","https://opendata.rdw.nl/resource/vezc-m2t6.json","https://opendata.rdw.nl/resource/jhie-znh9.json","https://opendata.rdw.nl/resource/kmfi-hrps.json"
"7ZLG37","Personenauto","ADRIA","TWIN 640 SLX","20240528","20161229","12388","kampeerwagen","4","GRIJS","Niet geregistreerd","4","2287","2847","3500","2947","750","2500","20150205","20150205","Geen verstrekking in Open Data","64517","Ja",,,,,,,"3","4","0","0",,"0","0","M1",,,"r.","3500","C",,"e1*2007/46*0767*08","7CR","K34","0","0.03","404","Nee","Nee",,"Nee","6000","0","0.00","2023","Logisch","00","Ja","2024-05-28T00:00:00.000","2016-12-29T00:00:00.000","2015-02-05T00:00:00.000","2015-02-05T00:00:00.000",,,,,,,,,,,,,,,,,,,,,"A",,,,,,,"https://opendata.rdw.nl/resource/3huj-srit.json","https://opendata.rdw.nl/resource/8ys7-d773.json","https://opendata.rdw.nl/resource/vezc-m2t6.json","https://opendata.rdw.nl/resource/jhie-znh9.json","https://opendata.rdw.nl/resource/kmfi-hrps.json"
"8TRK66","Personenauto","ADRIA","TWIN 640 SLX","20241121","20181127","11373","kampeerwagen","4","BEIGE","Niet geregistreerd","4","2287","2897","3500","2997","750","3000","20140417","20140417","Geen verstrekking in Open Data",,"Ja",,,,,,,"3","4","0","0",,"0","0","M1",,,"r.","3500","C",,"e1*2007/46*0767*06","7FM","K34","0","0.04","404","Nee","Nee",,"Nee","6500","0","0.00","2023","Logisch","00","Ja","2024-11-21T00:00:00.000","2018-11-27T00:00:00.000","2014-04-17T00:00:00.000","2014-04-17T00:00:00.000",,"0",,,,,,,,,,,,,,,,,,,,,,,,,,"https://opendata.rdw.nl/resource/3huj-srit.json","https://opendata.rdw.nl/resource/8ys7-d773.json","https://opendata.rdw.nl/resource/vezc-m2t6.json","https://opendata.rdw.nl/resource/jhie-znh9.json","https://opendata.rdw.nl/resource/kmfi-hrps.json"
"8XSG83","Personenauto","ADRIA","TWIN 640 SLX","20250520","20200103","9280","kampeerwagen","4","GRIJS","Niet geregistreerd","4","2287","2887","3500","2987","750","3000","20140508","20141017","Geen verstrekking in Open Data",,"Ja",,,,,,,"3","4","0","0",,"0","0","M1",,,"r.","3500","C",,"e1*2007/46*0767*06","7CM","K34","0","0.03","404","Nee","Nee",,"Nee","6500","0","0.00","2024","Geen oordeel","05","Ja","2025-05-20T00:00:00.000","2020-01-03T00:00:00.000","2014-05-08T00:00:00.000","2014-10-17T00:00:00.000",,"0",,,,,,,,,,,,,,,,,,,,,,,,,,"https://opendata.rdw.nl/resource/3huj-srit.json","https://opendata.rdw.nl/resource/8ys7-d773.json","https://opendata.rdw.nl/resource/vezc-m2t6.json","https://opendata.rdw.nl/resource/jhie-znh9.json","https://opendata.rdw.nl/resource/kmfi-hrps.json"
"8ZTL50","Personenauto","ADRIA","TWIN 640 SLX","20250616","20220511","11988","kampeerwagen","4","GRIJS","Niet geregistreerd","4","2287","2847","3500","2947","750","2500","20150326","20150326","Geen verstrekking in Open Data","63417","Ja",,,,,,,"3","4","0","0",,"0","0","M1",,,"r.","3500","C",,"e1*2007/46*0767*08","7CR","K34","0","0.03","404","Nee","Nee",,"Nee","6000","0","0.00","2024","Logisch","00","Ja","2025-06-16T00:00:00.000","2022-05-11T00:00:00.000","2015-03-26T00:00:00.000","2015-03-26T00:00:00.000",,,,,,,,,,,,,,,,,,,,,"A",,,,,,,"https://opendata.rdw.nl/resource/3huj-srit.json","https://opendata.rdw.nl/resource/8ys7-d773.json","https://opendata.rdw.nl/resource/vezc-m2t6.json","https://opendata.rdw.nl/resource/jhie-znh9.json","https://opendata.rdw.nl/resource/kmfi-hrps.json"
"G120BK","Personenauto","ADRIA","TWIN 640 SLX","20250202","20190904","12657","kampeerwagen","4","GRIJS","Niet geregistreerd","4","1997","2872","3500","2972","750","3000","20180202","20190904","Geen verstrekking in Open Data","52405","Ja","155",,,,,,"3","4","0","0",,"0","205","M1",,,"r.","3500","P",,"e1*2007/46*1610*01","73DB","K34","0","0.04","404","Nee","Nee",,"Nee","6500","0","0.00","2024","Geen oordeel","05","Ja","2025-02-02T00:00:00.000","2019-09-04T00:00:00.000","2018-02-02T00:00:00.000","2019-09-04T00:00:00.000",,,,,,,,,,,"260",,,,,,,,,,,,,,,,,"https://opendata.rdw.nl/resource/3huj-srit.json","https://opendata.rdw.nl/resource/8ys7-d773.json","https://opendata.rdw.nl/resource/vezc-m2t6.json","https://opendata.rdw.nl/resource/jhie-znh9.json","https://opendata.rdw.nl/resource/kmfi-hrps.json"
"G522RD","Personenauto","ADRIA","TWIN 640 SLX","20250516","20191115","12957","kampeerwagen","4","GRIJS","Niet geregistreerd","4","2287","2887","3500","2987","750","3000","20170516","20191115","Geen verstrekking in Open Data","53667","Ja","152",,,,,,"4","4",,,,,"205","M1",,,"r.","3500","C",,,,,,"0.04","404","Nee","Nee",,"Nee","6500",,,"2024","Geen oordeel","05","Ja","2025-05-16T00:00:00.000","2019-11-15T00:00:00.000","2017-05-16T00:00:00.000","2019-11-15T00:00:00.000",,,,,,,,,,,"260",,,,,,,,,,,,,,,,,"https://opendata.rdw.nl/resource/3huj-srit.json","https://opendata.rdw.nl/resource/8ys7-d773.json","https://opendata.rdw.nl/resource/vezc-m2t6.json","https://opendata.rdw.nl/resource/jhie-znh9.json","https://opendata.rdw.nl/resource/kmfi-hrps.json"
"G527KJ","Personenauto","ADRIA","TWIN 640 SLX","20250331","20191016","8437","kampeerwagen","4","WIT","Niet geregistreerd","4","2287","3000","3500","3100","750","3000","20150522","20191016","Geen verstrekking in Open Data","34654","Ja","150",,,,,,"3","4","0","0",,"0","205","M1",,,"r.","3500","C",,"e1*2007/46*0767*08","7CM","K34","0","0.03","404","Nee","Nee",,"Nee","6500","0","0.00","2024","Geen oordeel","05","Ja","2025-03-31T00:00:00.000","2019-10-16T00:00:00.000","2015-05-22T00:00:00.000","2019-10-16T00:00:00.000",,,,,,,,,,,"260",,,,,,,,,,,,,,,,,"https://opendata.rdw.nl/resource/3huj-srit.json","https://opendata.rdw.nl/resource/8ys7-d773.json","https://opendata.rdw.nl/resource/vezc-m2t6.json","https://opendata.rdw.nl/resource/jhie-znh9.json","https://opendata.rdw.nl/resource/kmfi-hrps.json"
"G560BG","Personenauto","ADRIA","TWIN 640 SLX","20250531","20190826","12638","kampeerwagen","4","GRIJS","Niet geregistreerd","4","2287","2873","3500","2973","750","2500","20190531","20190826","Geen verstrekking in Open Data","52326","Ja","152",,,,,,"4","4","0","0",,"0","205","M1",,,"r.","3500","C",,"e1*2007/46*0767*13","7FRA","K34","0","0.04","404","Nee","Nee",,"Nee","6000","0","0.00","2024","Geen oordeel","05","Ja","2025-05-31T00:00:00.000","2019-08-26T00:00:00.000","2019-05-31T00:00:00.000","2019-08-26T00:00:00.000",,,,,,,,,,,"260",,,,,,,,,,,,,,,,,"https://opendata.rdw.nl/resource/3huj-srit.json","https://opendata.rdw.nl/resource/8ys7-d773.json","https://opendata.rdw.nl/resource/vezc-m2t6.json","https://opendata.rdw.nl/resource/jhie-znh9.json","https://opendata.rdw.nl/resource/kmfi-hrps.json"
"G681KJ","Personenauto","ADRIA","TWIN 640 SLX","20250316","20240229","11425","kampeerwagen","4","BLAUW","Niet geregistreerd","4","2287","2887","3500","2987","750","3000","20150225","20191010","Geen verstrekking in Open Data","47953","Ja","155",,,,,,"3","4",,,,,"205","M1",,,"r.","3500","C",,,,,,"0.04","404","Nee","Nee",,"Nee","6500",,,"2024","Geen oordeel","05","Ja","2025-03-16T00:00:00.000","2024-02-29T00:00:00.000","2015-02-25T00:00:00.000","2019-10-10T00:00:00.000",,,,,,,,,,,"260",,,,,,,,,,,,,,,,,"https://opendata.rdw.nl/resource/3huj-srit.json","https://opendata.rdw.nl/resource/8ys7-d773.json","https://opendata.rdw.nl/resource/vezc-m2t6.json","https://opendata.rdw.nl/resource/jhie-znh9.json","https://opendata.rdw.nl/resource/kmfi-hrps.json"
"G832VL","Personenauto","ADRIA","TWIN 640 SLX","20240913","20191212","12657","kampeerwagen","4","ORANJE","Niet geregistreerd","4","2287","2887","3500","2987","750","3000","20190913","20191212","Geen verstrekking in Open Data","52405","Ja","152",,,,,,"4","4","0","0",,"0","205","M1",,,"r.","3500","C",,"e1*2007/46*0767*12","7EDA","K34","0","0.04","404","Nee","Nee",,"Nee","6500","0","0.00","2023","Geen oordeel","05","Ja","2024-09-13T00:00:00.000","2019-12-12T00:00:00.000","2019-09-13T00:00:00.000","2019-12-12T00:00:00.000",,,,,,,,,,,"260",,,,,,,,,,,,,,,,,"https://opendata.rdw.nl/resource/3huj-srit.json","https://opendata.rdw.nl/resource/8ys7-d773.json","https://opendata.rdw.nl/resource/vezc-m2t6.json","https://opendata.rdw.nl/resource/jhie-znh9.json","https://opendata.rdw.nl/resource/kmfi-hrps.json"
"G872SJ","Personenauto","ADRIA","TWIN 640 SLX","20241126","20191129","11432","kampeerwagen","4","GRIJS","Niet geregistreerd","4","1997","2872","3500","2972","750","3000","20170404","20191129","Geen verstrekking in Open Data","47248","Ja","155",,,,,,"4","4","0","0",,"0","205","M1",,,"r.","3500","P",,"e1*2007/46*1610*00","73DB","K34","0","0.04","404","Nee","Nee",,"Nee","6500","0","0.00","2024","Geen oordeel","05","Ja","2024-11-26T00:00:00.000","2019-11-29T00:00:00.000","2017-04-04T00:00:00.000","2019-11-29T00:00:00.000",,,,,,,,,,,"260",,,,,,,,,,,,,,,,,"https://opendata.rdw.nl/resource/3huj-srit.json","https://opendata.rdw.nl/resource/8ys7-d773.json","https://opendata.rdw.nl/resource/vezc-m2t6.json","https://opendata.rdw.nl/resource/jhie-znh9.json","https://opendata.rdw.nl/resource/kmfi-hrps.json"
"G949FD","Personenauto","ADRIA","TWIN 640 SLX","20250510","20191211","11036","kampeerwagen","4","GRIJS","Niet geregistreerd","4","2287","2847","3500","2947","750","2500","20170613","20191211","Geen verstrekking in Open Data","45581","Ja","150",,,,,,"4","4",,,,,"205","M1",,,"r.","3500","C",,,,,,"0.03","404","Nee","Nee",,"Nee","6000",,,"2024","Geen oordeel","05","Ja","2025-05-10T00:00:00.000","2019-12-11T00:00:00.000","2017-06-13T00:00:00.000","2019-12-11T00:00:00.000",,,,,,,,,,,"260",,,,,,,,,,,,,,,,,"https://opendata.rdw.nl/resource/3huj-srit.json","https://opendata.rdw.nl/resource/8ys7-d773.json","https://opendata.rdw.nl/resource/vezc-m2t6.json","https://opendata.rdw.nl/resource/jhie-znh9.json","https://opendata.rdw.nl/resource/kmfi-hrps.json"
"G987LB","Personenauto","ADRIA","TWIN 640 SLX","20240524","20191025","11883","kampeerwagen","4","GRIJS","Niet geregistreerd","4","1997","2872","3500","2972","750","3000","20180524","20191025","Geen verstrekking in Open Data","49152","Ja","155",,,,,,"3","4","0","0",,"0","205","M1",,,"r.","3500","P",,"e1*2007/46*1610*01","73DB","K34","0","0.04","404","Nee","Nee",,"Nee","6500","0","0.00","2023","Geen oordeel","05","Ja","2024-05-24T00:00:00.000","2019-10-25T00:00:00.000","2018-05-24T00:00:00.000","2019-10-25T00:00:00.000",,,,,,,,,,,"260",,,,,,,,,,,,,,,,,"https://opendata.rdw.nl/resource/3huj-srit.json","https://opendata.rdw.nl/resource/8ys7-d773.json","https://opendata.rdw.nl/resource/vezc-m2t6.json","https://opendata.rdw.nl/resource/jhie-znh9.json","https://opendata.rdw.nl/resource/kmfi-hrps.json"
"GB969T","Personenauto","ADRIA","TWIN 640 SLX","20240804","20150422","12620","kampeerwagen","4","GRIJS","Niet geregistreerd","4","2287","2897","3500","2997","750","3000","20150422","20150422","Geen verstrekking in Open Data","66380","Ja",,,,,,,"3","4","0","0",,"0","0","M1",,,"r.","3500","C",,"e1*2007/46*0767*08","7FM","K34","0","0.04","404","Nee","Nee",,"Nee","6500","0","0.00","2023","Logisch","00","Ja","2024-08-04T00:00:00.000","2015-04-22T00:00:00.000","2015-04-22T00:00:00.000","2015-04-22T00:00:00.000",,,,,,,,,,,,,,,,,,,,,,,,,,,,"https://opendata.rdw.nl/resource/3huj-srit.json","https://opendata.rdw.nl/resource/8ys7-d773.json","https://opendata.rdw.nl/resource/vezc-m2t6.json","https://opendata.rdw.nl/resource/jhie-znh9.json","https://opendata.rdw.nl/resource/kmfi-hrps.json"
"GD101G","Personenauto","ADRIA","TWIN 640 SLX","20250507","20201002","11456","kampeerwagen","4","GEEL","Niet geregistreerd","4","2287","2887","3500","2987","750","3000","20150421","20150421","Geen verstrekking in Open Data","61139","Ja",,,,,,,"3","4","0","0",,"0","0","M1",,,"r.","3500","C",,"e1*2007/46*0767*08","7CM","K34","0","0.03","404","Nee","Nee",,"Nee","6500","0","0.00","2024","Logisch","00","Ja","2025-05-07T00:00:00.000","2020-10-02T00:00:00.000","2015-04-21T00:00:00.000","2015-04-21T00:00:00.000",,,,,,,,,,,,,,,,,,,,,,,,,,,,"https://opendata.rdw.nl/resource/3huj-srit.json","https://opendata.rdw.nl/resource/8ys7-d773.json","https://opendata.rdw.nl/resource/vezc-m2t6.json","https://opendata.rdw.nl/resource/jhie-znh9.json","https://opendata.rdw.nl/resource/kmfi-hrps.json"
"GD550G","Personenauto","ADRIA","TWIN 640 SLX","20250328","20211229","11168","kampeerwagen","4","GRIJS","Niet geregistreerd","4","2287","2887","3500","2987","750","3000","20140401","20150414","Geen verstrekking in Open Data",,"Ja",,,,,,,"3","4","0","0",,"0","0","M1",,,"r.","3500","C",,"e1*2007/46*0767*05","7CM","K34","0","0.03","404","Nee","Nee",,"Nee","6500","0","0.00","2024","Geen oordeel","05","Ja","2025-03-28T00:00:00.000","2021-12-29T00:00:00.000","2014-04-01T00:00:00.000","2015-04-14T00:00:00.000",,,,,,,,,,,,,,,,,,,,,,,,,,,,"https://opendata.rdw.nl/resource/3huj-srit.json","https://opendata.rdw.nl/resource/8ys7-d773.json","https://opendata.rdw.nl/resource/vezc-m2t6.json","https://opendata.rdw.nl/resource/jhie-znh9.json","https://opendata.rdw.nl/resource/kmfi-hrps.json"
"GD558X","Personenauto","ADRIA","TWIN 640 SLX","20250423","20160428","12468","kampeerwagen","4","GRIJS","Niet geregistreerd","4","2287","2897","3500","2997","750","3000","20150423","20150423","Geen verstrekking in Open Data","66373","Ja",,,,,,,"3","4","0","0",,"0","0","M1",,,"r.","3500","C",,"e1*2007/46*0767*06","7FM","K34","0","0.04","404","Nee","Nee",,"Nee","6500","0","0.00","2024","Logisch","00","Ja","2025-04-23T00:00:00.000","2016-04-28T00:00:00.000","2015-04-23T00:00:00.000","2015-04-23T00:00:00.000",,,,,,,,,,,,,,,,,,,,,,,,,,,,"https://opendata.rdw.nl/resource/3huj-srit.json","https://opendata.rdw.nl/resource/8ys7-d773.json","https://opendata.rdw.nl/resource/vezc-m2t6.json","https://opendata.rdw.nl/resource/jhie-znh9.json","https://opendata.rdw.nl/resource/kmfi-hrps.json"
"GD616T","Personenauto","ADRIA","TWIN 640 SLX","20240602","20150425","11680","kampeerwagen","4","GRIJS","Niet geregistreerd","4","2287","2887","3500","2987","750","3000","20150425","20150425","Geen verstrekking in Open Data","62121","Ja",,,,,,,"3","4","0","0",,"0","0","M1",,,"r.","3500","C",,"e1*2007/46*0767*08","7CM","K34","0","0.03","404","Nee","Nee",,"Nee","6500","0","0.00","2023","Logisch","00","Ja","2024-06-02T00:00:00.000","2015-04-25T00:00:00.000","2015-04-25T00:00:00.000","2015-04-25T00:00:00.000",,,,,,,,,,,,,,,,,,,,,,,,,,,,"https://opendata.rdw.nl/resource/3huj-srit.json","https://opendata.rdw.nl/resource/8ys7-d773.json","https://opendata.rdw.nl/resource/vezc-m2t6.json","https://opendata.rdw.nl/resource/jhie-znh9.json","https://opendata.rdw.nl/resource/kmfi-hrps.json"
"GD966G","Personenauto","ADRIA","TWIN 640 SLX","20250422","20150421","12184","kampeerwagen","4","GRIJS","Niet geregistreerd","4","2287","2857","3500","2957","750","2500","20150421","20150421","Geen verstrekking in Open Data","63784","Ja",,,,,,,"3","4","0","0",,"0","0","M1",,,"r.","3500","C",,"e1*2007/46*0767*08","7DR","K34","0","0.03","404","Nee","Nee",,"Nee","6000","0","0.00","2024","Logisch","00","Ja","2025-04-22T00:00:00.000","2015-04-21T00:00:00.000","2015-04-21T00:00:00.000","2015-04-21T00:00:00.000",,,,,,,,,,,,,,,,,,,,,,,,,,,,"https://opendata.rdw.nl/resource/3huj-srit.json","https://opendata.rdw.nl/resource/8ys7-d773.json","https://opendata.rdw.nl/resource/vezc-m2t6.json","https://opendata.rdw.nl/resource/jhie-znh9.json","https://opendata.rdw.nl/resource/kmfi-hrps.json"
"GG394T","Personenauto","ADRIA","TWIN 640 SLX","20240624","20150528","11626","kampeerwagen","4","GRIJS","Niet geregistreerd","4","2287","2887","3500","2987","750","3000","20150528","20150528","Geen verstrekking in Open Data","62786","Ja",,,,,,,"3","4","0","0",,"0","0","M1",,,"r.","3500","C",,"e1*2007/46*0767*08","7CM","K34","0","0.03","404","Nee","Nee",,"Nee","6500","0","0.00","2023","Logisch","00","Ja","2024-06-24T00:00:00.000","2015-05-28T00:00:00.000","2015-05-28T00:00:00.000","2015-05-28T00:00:00.000",,,,,,,,,,,,,,,,,,,,,,,,,,,,"https://opendata.rdw.nl/resource/3huj-srit.json","https://opendata.rdw.nl/resource/8ys7-d773.json","https://opendata.rdw.nl/resource/vezc-m2t6.json","https://opendata.rdw.nl/resource/jhie-znh9.json","https://opendata.rdw.nl/resource/kmfi-hrps.json"
"GH865H","Personenauto","ADRIA","TWIN 640 SLX","20250605","20210618","11819","kampeerwagen","4","GRIJS","Niet geregistreerd","4","2287","2887","3500","2987","750","3000","20150605","20150605","Geen verstrekking in Open Data","62234","Ja",,,,,,,"3","4","0","0",,"0","0","M1",,,"r.","3500","C",,"e1*2007/46*0767*08","7CM","K34","0","0.03","404","Nee","Nee",,"Nee","6500","0","0.00","2024","Logisch","00","Ja","2025-06-05T00:00:00.000","2021-06-18T00:00:00.000","2015-06-05T00:00:00.000","2015-06-05T00:00:00.000",,,,,,,,,,,,,,,,,,,,,,,,,,,,"https://opendata.rdw.nl/resource/3huj-srit.json","https://opendata.rdw.nl/resource/8ys7-d773.json","https://opendata.rdw.nl/resource/vezc-m2t6.json","https://opendata.rdw.nl/resource/jhie-znh9.json","https://opendata.rdw.nl/resource/kmfi-hrps.json"
"GH866H","Personenauto","ADRIA","TWIN 640 SLX","20241212","20231010","12761","kampeerwagen","4","GRIJS","Niet geregistreerd","4","2999","2947","3500","3047","750","3000","20150529","20150529","Geen verstrekking in Open Data","69681","Ja",,,,,,,"3","4","0","0",,"0","0","M1",,,"r.","3500","C",,"e1*2007/46*0767*08","7BM","K34","0","0.04","404","Nee","Nee",,"Nee","6500","0","0.00","2023","Onlogisch","04","Ja","2024-12-12T00:00:00.000","2023-10-10T00:00:00.000","2015-05-29T00:00:00.000","2015-05-29T00:00:00.000",,,,,,,,,,,,,,,,,,,,,,,,,,,,"https://opendata.rdw.nl/resource/3huj-srit.json","https://opendata.rdw.nl/resource/8ys7-d773.json","https://opendata.rdw.nl/resource/vezc-m2t6.json","https://opendata.rdw.nl/resource/jhie-znh9.json","https://opendata.rdw.nl/resource/kmfi-hrps.json"