"kenteken","voertuigsoort","merk","handelsbenaming","vervaldatum_apk","datum_tenaamstelling","bruto_bpm","inrichting","aantal_zitplaatsen","eerste_kleur","tweede_kleur","aantal_cilinders","cilinderinhoud","massa_ledig_voertuig","toegestane_maximum_massa_voertuig","massa_rijklaar","maximum_massa_trekken_ongeremd","maximum_trekken_massa_geremd","datum_eerste_toelating","datum_eerste_tenaamstelling_in_nederland","wacht_op_keuren","catalogusprijs","wam_verzekerd","maximale_constructiesnelheid","laadvermogen","oplegger_geremd","aanhangwagen_autonoom_geremd","aanhangwagen_middenas_geremd","aantal_staanplaatsen","aantal_deuren","aantal_wielen","afstand_hart_koppeling_tot_achterzijde_voertuig","afstand_voorzijde_voertuig_tot_hart_koppeling","afwijkende_maximum_snelheid","lengte","breedte","europese_voertuigcategorie","europese_voertuigcategorie_toevoeging","europese_uitvoeringcategorie_toevoeging","plaats_chassisnummer","technische_max_massa_voertuig","type","type_gasinstallatie","typegoedkeuringsnummer","variant","uitvoering","volgnummer_wijziging_eu_typegoedkeuring","vermogen_massarijklaar","wielbasis","export_indicator","openstaande_terugroepactie_indicator","vervaldatum_tachograaf","taxi_indicator","maximum_massa_samenstelling","aantal_rolstoelplaatsen","maximum_ondersteunende_snelheid","jaar_laatste_registratie_tellerstand","tellerstandoordeel","code_toelichting_tellerstandoordeel","tenaamstellen_mogelijk","vervaldatum_apk_dt","datum_tenaamstelling_dt","datum_eerste_toelating_dt","datum_eerste_tenaamstelling_in_nederland_dt","vervaldatum_tachograaf_dt","maximum_last_onder_de_vooras_sen_tezamen_koppeling","type_remsysteem_voertuig_code","rupsonderstelconfiguratiecode","wielbasis_voertuig_minimum","wielbasis_voertuig_maximum","lengte_voertuig_minimum","lengte_voertuig_maximum","breedte_voertuig_minimum","breedte_voertuig_maximum","hoogte_voertuig","hoogte_voertuig_minimum","hoogte_voertuig_maximum","massa_bedrijfsklaar_minimaal","massa_bedrijfsklaar_maximaal","technisch_toelaatbaar_massa_koppelpunt","maximum_massa_technisch_maximaal","maximum_massa_technisch_minimaal","subcategorie_nederland","verticale_belasting_koppelpunt_getrokken_voertuig","zuinigheidsclassificatie","registratie_datum_goedkeuring_afschrijvingsmoment_bpm","registratie_datum_goedkeuring_afschrijvingsmoment_bpm_dt","gem_lading_wrde","aerodyn_voorz","massa_alt_aandr","verl_cab_ind","api_gekentekende_voertuigen_assen","api_gekentekende_voertuigen_brandstof","api_gekentekende_voertuigen_carrosserie","api_gekentekende_voertuigen_carrosserie_specifiek","api_gekentekende_voertuigen_voertuigklasse"
"4GV488","Motorrijtuig met beperkte snelheid","VOLKSWAGEN","CADDY",,"20230723",,"Niet geregistreerd",,"N.v.t.","N.v.t.",,,,,,,,"20040630","20210406","Geen verstrekking in Open Data",,"Ja",,,,,,,,,,,,,,"Z",,,,,,,,,,,"0.00",,"Nee","Nee",,"Nee",,,,,"Niet geregistreerd","NG","Ja",,"2023-07-23T00:00:00.000","2004-06-30T00:00:00.000","2021-04-06T00:00:00.000",,,,,,,,,,,,,,,,,,,"Overige machine voor transport",,,,,,,,,"https://opendata.rdw.nl/resource/3huj-srit.json","https://opendata.rdw.nl/resource/8ys7-d773.json","https://opendata.rdw.nl/resource/vezc-m2t6.json","https://opendata.rdw.nl/resource/jhie-znh9.json","https://opendata.rdw.nl/resource/kmfi-hrps.json"
"5GV254","Motorrijtuig met beperkte snelheid","VOLKSWAGEN","CADDY",,"20220303",,"Niet geregistreerd",,"N.v.t.","N.v.t.",,,,,,,,"19850630","20220303","Geen verstrekking in Open Data",,"Nee",,,,,,,,,,,,,,"Z",,,,,,,,,,,"0.00",,"Nee","Nee",,"Nee",,,,,"Niet geregistreerd","NG","Ja",,"2022-03-03T00:00:00.000","1985-06-30T00:00:00.000","2022-03-03T00:00:00.000",,,,,,,,,,,,,,,,,,,"Overige machine voor transport",,,,,,,,,"https://opendata.rdw.nl/resource/3huj-srit.json","https://opendata.rdw.nl/resource/8ys7-d773.json","https://opendata.rdw.nl/resource/vezc-m2t6.json","https://opendata.rdw.nl/resource/jhie-znh9.json","https://opendata.rdw.nl/resource/kmfi-hrps.json"
"93GV80","Motorrijtuig met beperkte snelheid","VOLKSWAGEN","CADDY",,"20230128",,"Niet geregistreerd",,"N.v.t.","N.v.t.",,,,,,,,"20000630","20210706","Geen verstrekking in Open Data",,"Ja",,,,,,,,,,,,,,"Z",,,,,,,,,,,"0.00",,"Nee","Nee",,"Nee",,,,,"Niet geregistreerd","NG","Ja",,"2023-01-28T00:00:00.000","2000-06-30T00:00:00.000","2021-07-06T00:00:00.000",,,,,,,,,,,,,,,,,,,"Overige agrarische machine",,,,,,,,,"https://opendata.rdw.nl/resource/3huj-srit.json","https://opendata.rdw.nl/resource/8ys7-d773.json","https://opendata.rdw.nl/resource/vezc-m2t6.json","https://opendata.rdw.nl/resource/jhie-znh9.json","https://opendata.rdw.nl/resource/kmfi-hrps.json"
"974GV3","Motorrijtuig met beperkte snelheid","VOLKSWAGEN","CADDY",,"20210122",,"Niet geregistreerd",,"N.v.t.","N.v.t.",,,,,,,,"20130630","20210122","Geen verstrekking in Open Data",,"Ja",,,,,,,,,,,,,,"Z",,,,,,,,,,,"0.00",,"Nee","Nee",,"Nee",,,,,"Niet geregistreerd","NG","Ja",,"2021-01-22T00:00:00.000","2013-06-30T00:00:00.000","2021-01-22T00:00:00.000",,,,,,,,,,,,,,,,,,,"Overige machine voor transport",,,,,,,,,"https://opendata.rdw.nl/resource/3huj-srit.json","https://opendata.rdw.nl/resource/8ys7-d773.json","https://opendata.rdw.nl/resource/vezc-m2t6.json","https://opendata.rdw.nl/resource/jhie-znh9.json","https://opendata.rdw.nl/resource/kmfi-hrps.json"
"T11BNZ","Motorrijtuig met beperkte snelheid","VOLKSWAGEN","CADDY",,"20220930",,"Niet geregistreerd",,"N.v.t.","N.v.t.",,,,,,,,"20030630","20220117","Geen verstrekking in Open Data",,"Ja",,,,,,,,,,,,,,"Z",,,,,,,,,,,"0.00",,"Nee","Nee",,"Nee",,,,,"Niet geregistreerd","NG","Ja",,"2022-09-30T00:00:00.000","2003-06-30T00:00:00.000","2022-01-17T00:00:00.000",,,,,,,,,,,,,,,,,,,"Overige agrarische machine",,,,,,,,,"https://opendata.rdw.nl/resource/3huj-srit.json","https://opendata.rdw.nl/resource/8ys7-d773.json","https://opendata.rdw.nl/resource/vezc-m2t6.json","https://opendata.rdw.nl/resource/jhie-znh9.json","https://opendata.rdw.nl/resource/kmfi-hrps.json"
"T16DGG","Motorrijtuig met beperkte snelheid","VOLKSWAGEN","CADDY",,"20220221",,"Niet geregistreerd",,"N.v.t.","N.v.t.",,,,,,,,"20030630","20220221","Geen verstrekking in Open Data",,"Ja",,,,,,,,,,,,,,"Z",,,,,,,,,,,"0.00",,"Nee","Nee",,"Nee",,,,,"Niet geregistreerd","NG","Ja",,"2022-02-21T00:00:00.000","2003-06-30T00:00:00.000","2022-02-21T00:00:00.000",,,,,,,,,,,,,,,,,,,"Overige agrarische machine",,,,,,,,,"https://opendata.rdw.nl/resource/3huj-srit.json","https://opendata.rdw.nl/resource/8ys7-d773.json","https://opendata.rdw.nl/resource/vezc-m2t6.json","https://opendata.rdw.nl/resource/jhie-znh9.json","https://opendata.rdw.nl/resource/kmfi-hrps.json"
"T16DJR","Motorrijtuig met beperkte snelheid","VOLKSWAGEN","CADDY",,"20220310",,"Niet geregistreerd",,"N.v.t.","N.v.t.",,,,,,,,"19990630","20220304","Geen verstrekking in Open Data",,"Ja",,,,,,,,,,,,,,"Z",,,,,,,,,,,"0.00",,"Nee","Nee",,"Nee",,,,,"Niet geregistreerd","NG","Ja",,"2022-03-10T00:00:00.000","1999-06-30T00:00:00.000","2022-03-04T00:00:00.000",,,,,,,,,,,,,,,,,,,"Overige machine voor transport",,,,,,,,,"https://opendata.rdw.nl/resource/3huj-srit.json","https://opendata.rdw.nl/resource/8ys7-d773.json","https://opendata.rdw.nl/resource/vezc-m2t6.json","https://opendata.rdw.nl/resource/jhie-znh9.json","https://opendata.rdw.nl/resource/kmfi-hrps.json"
"T17DJR","Motorrijtuig met beperkte snelheid","VOLKSWAGEN","CADDY",,"20230126",,"Niet geregistreerd","2","N.v.t.","N.v.t.","4","1968",,,"1465",,,"20080630","20220304","Geen verstrekking in Open Data",,"Ja",,,,,,,,"4",,,,"452","180","Z",,,,"2065",,,,,,,"0.00","268","Nee","Nee",,"Nee",,,,,"Niet geregistreerd","NG","Ja",,"2023-01-26T00:00:00.000","2008-06-30T00:00:00.000","2022-03-04T00:00:00.000",,,,,,,,,,,"220",,,,,,,,"Overige machine voor transport",,,"20230105","2023-01-05T00:00:00.000",,,,,"https://opendata.rdw.nl/resource/3huj-srit.json","https://opendata.rdw.nl/resource/8ys7-d773.json","https://opendata.rdw.nl/resource/vezc-m2t6.json","https://opendata.rdw.nl/resource/jhie-znh9.json","https://opendata.rdw.nl/resource/kmfi-hrps.json"
"T33BDT","Motorrijtuig met beperkte snelheid","VOLKSWAGEN","CADDY",,"20211231",,"Niet geregistreerd",,"N.v.t.","N.v.t.",,,,,,,,"20010630","20211231","Geen verstrekking in Open Data",,"Nee",,,,,,,,,,,,,,"Z",,,,,,,,,,,"0.00",,"Nee","Nee",,"Nee",,,,,"Niet geregistreerd","NG","Ja",,"2021-12-31T00:00:00.000","2001-06-30T00:00:00.000","2021-12-31T00:00:00.000",,,,,,,,,,,,,,,,,,,"Overlaadwagen",,,,,,,,,"https://opendata.rdw.nl/resource/3huj-srit.json","https://opendata.rdw.nl/resource/8ys7-d773.json","https://opendata.rdw.nl/resource/vezc-m2t6.json","https://opendata.rdw.nl/resource/jhie-znh9.json","https://opendata.rdw.nl/resource/kmfi-hrps.json"
"T35DVK","Motorrijtuig met beperkte snelheid","VOLKSWAGEN","CADDY",,"20220602",,"Niet geregistreerd",,"N.v.t.","N.v.t.",,,,,,,,"19980630","20220602","Geen verstrekking in Open Data",,"Ja",,,,,,,,,,,,,,"Z",,,,,,,,,,,"0.00",,"Nee","Nee",,"Nee",,,,,"Niet geregistreerd","NG","Ja",,"2022-06-02T00:00:00.000","1998-06-30T00:00:00.000","2022-06-02T00:00:00.000",,,,,,,,,,,,,,,,,,,"Overige machine voor transport",,,,,,,,,"https://opendata.rdw.nl/resource/3huj-srit.json","https://opendata.rdw.nl/resource/8ys7-d773.json","https://opendata.rdw.nl/resource/vezc-m2t6.json","https://opendata.rdw.nl/resource/jhie-znh9.json","https://opendata.rdw.nl/resource/kmfi-hrps.json"
"T42DFD","Motorrijtuig met beperkte snelheid","VOLKSWAGEN","CADDY",,"20230603",,"Niet geregistreerd",,"N.v.t.","N.v.t.",,,,,,,,"19990630","20220215","Geen verstrekking in Open Data",,"Ja",,,,,,,,,,,,,,"Z",,,,,,,,,,,"0.00",,"Nee","Nee",,"Nee",,,,,"Niet geregistreerd","NG","Ja",,"2023-06-03T00:00:00.000","1999-06-30T00:00:00.000","2022-02-15T00:00:00.000",,,,,,,,,,,,,,,,,,,"Overige machine voor transport",,,,,,,,,"https://opendata.rdw.nl/resource/3huj-srit.json","https://opendata.rdw.nl/resource/8ys7-d773.json","https://opendata.rdw.nl/resource/vezc-m2t6.json","https://opendata.rdw.nl/resource/jhie-znh9.json","https://opendata.rdw.nl/resource/kmfi-hrps.json"
"T44BKK","Motorrijtuig met beperkte snelheid","VOLKSWAGEN","CADDY",,"20220808",,"Niet geregistreerd","2","N.v.t.","N.v.t.","4","1896",,,"1235",,,"20030630","20220110","Geen verstrekking in Open Data",,"Ja",,,,,,,,"4",,,,,"187","Z",,,,,,,,,,,"0.04","250","Nee","Nee",,"Nee",,,,,"Niet geregistreerd","NG","Ja",,"2022-08-08T00:00:00.000","2003-06-30T00:00:00.000","2022-01-10T00:00:00.000",,,,,,,,,,,,,,,,,,,"Overige machine voor transport",,,"20240312","2024-03-12T00:00:00.000",,,,,"https://opendata.rdw.nl/resource/3huj-srit.json","https://opendata.rdw.nl/resource/8ys7-d773.json","https://opendata.rdw.nl/resource/vezc-m2t6.json","https://opendata.rdw.nl/resource/jhie-znh9.json","https://opendata.rdw.nl/resource/kmfi-hrps.json"
"T48BXF","Motorrijtuig met beperkte snelheid","VOLKSWAGEN","CADDY",,"20220201",,"Niet geregistreerd",,"N.v.t.","N.v.t.",,,,,,,,"20000630","20220201","Geen verstrekking in Open Data",,"Nee",,,,,,,,,,,,,,"Z",,,,,,,,,,,"0.00",,"Nee","Nee",,"Nee",,,,,"Niet geregistreerd","NG","Ja",,"2022-02-01T00:00:00.000","2000-06-30T00:00:00.000","2022-02-01T00:00:00.000",,,,,,,,,,,,,,,,,,,"Overige agrarische machine",,,,,,,,,"https://opendata.rdw.nl/resource/3huj-srit.json","https://opendata.rdw.nl/resource/8ys7-d773.json","https://opendata.rdw.nl/resource/vezc-m2t6.json","https://opendata.rdw.nl/resource/jhie-znh9.json","https://opendata.rdw.nl/resource/kmfi-hrps.json"
"T55DJL","Motorrijtuig met beperkte snelheid","VOLKSWAGEN","CADDY",,"20220303",,"Niet geregistreerd",,"N.v.t.","N.v.t.",,,,,,,,"19860630","20220303","Geen verstrekking in Open Data",,"Ja",,,,,,,,,,,,,,"Z",,,,,,,,,,,"0.00",,"Nee","Nee",,"Nee",,,,,"Niet geregistreerd","NG","Ja",,"2022-03-03T00:00:00.000","1986-06-30T00:00:00.000","2022-03-03T00:00:00.000",,,,,,,,,,,,,,,,,,,"Overige agrarische machine",,,,,,,,,"https://opendata.rdw.nl/resource/3huj-srit.json","https://opendata.rdw.nl/resource/8ys7-d773.json","https://opendata.rdw.nl/resource/vezc-m2t6.json","https://opendata.rdw.nl/resource/jhie-znh9.json","https://opendata.rdw.nl/resource/kmfi-hrps.json"
"T57DHV","Motorrijtuig met beperkte snelheid","VOLKSWAGEN","CADDY",,"20220301",,"Niet geregistreerd",,"N.v.t.","N.v.t.",,,,,,,,"19980630","20220301","Geen verstrekking in Open Data",,"Nee",,,,,,,,,,,,,,"Z",,,,,,,,,,,"0.00",,"Nee","Nee",,"Nee",,,,,"Niet geregistreerd","NG","Ja",,"2022-03-01T00:00:00.000","1998-06-30T00:00:00.000","2022-03-01T00:00:00.000",,,,,,,,,,,,,,,,,,,"Overige machine voor transport",,,,,,,,,"https://opendata.rdw.nl/resource/3huj-srit.json","https://opendata.rdw.nl/resource/8ys7-d773.json","https://opendata.rdw.nl/resource/vezc-m2t6.json","https://opendata.rdw.nl/resource/jhie-znh9.json","https://opendata.rdw.nl/resource/kmfi-hrps.json"
"T67DJZ","Motorrijtuig met beperkte snelheid","VOLKSWAGEN","CADDY",,"20230107",,"Niet geregistreerd","2","N.v.t.","N.v.t.","4","1896",,,"1200",,,"19950630","20220308","Geen verstrekking in Open Data",,"Ja",,,,,,,,"4",,,,"425","170","Z",,,,"1730",,,,,,,"0.04","260","Nee","Nee",,"Nee",,,,,"Niet geregistreerd","NG","Ja",,"2023-01-07T00:00:00.000","1995-06-30T00:00:00.000","2022-03-08T00:00:00.000",,,,,,,,,,,"190",,,,,,,,"Overige machine voor transport",,,"20231102","2023-11-02T00:00:00.000",,,,,"https://opendata.rdw.nl/resource/3huj-srit.json","https://opendata.rdw.nl/resource/8ys7-d773.json","https://opendata.rdw.nl/resource/vezc-m2t6.json","https://opendata.rdw.nl/resource/jhie-znh9.json","https://opendata.rdw.nl/resource/kmfi-hrps.json"
"T72BFV","Motorrijtuig met beperkte snelheid","VOLKSWAGEN","CADDY",,"20220103",,"Niet geregistreerd",,"N.v.t.","N.v.t.",,,,,,,,"20000630","20220103","Geen verstrekking in Open Data",,"Nee",,,,,,,,,,,,,,"Z",,,,,,,,,,,"0.00",,"Nee","Nee",,"Nee",,,,,"Niet geregistreerd","NG","Ja",,"2022-01-03T00:00:00.000","2000-06-30T00:00:00.000","2022-01-03T00:00:00.000",,,,,,,,,,,,,,,,,,,"Overige agrarische machine",,,,,,,,,"https://opendata.rdw.nl/resource/3huj-srit.json","https://opendata.rdw.nl/resource/8ys7-d773.json","https://opendata.rdw.nl/resource/vezc-m2t6.json","https://opendata.rdw.nl/resource/jhie-znh9.json","https://opendata.rdw.nl/resource/kmfi-hrps.json"
"T76DVB","Motorrijtuig met beperkte snelheid","VOLKSWAGEN","CADDY",,"20220525",,"Niet geregistreerd",,"N.v.t.","N.v.t.",,,,,,,,"20040630","20220525","Geen verstrekking in Open Data",,"Ja",,,,,,,,,,,,,,"Z",,,,,,,,,,,"0.00",,"Nee","Nee",,"Nee",,,,,"Niet geregistreerd","NG","Ja",,"2022-05-25T00:00:00.000","2004-06-30T00:00:00.000","2022-05-25T00:00:00.000",,,,,,,,,,,,,,,,,,,"Overige agrarische machine",,,,,,,,,"https://opendata.rdw.nl/resource/3huj-srit.json","https://opendata.rdw.nl/resource/8ys7-d773.json","https://opendata.rdw.nl/resource/vezc-m2t6.json","https://opendata.rdw.nl/resource/jhie-znh9.json","https://opendata.rdw.nl/resource/kmfi-hrps.json"
"T88DHP","Motorrijtuig met beperkte snelheid","VOLKSWAGEN","CADDY",,"20220228",,"Niet geregistreerd",,"N.v.t.","N.v.t.",,,,,,,,"20020630","20220228","Geen verstrekking in Open Data",,"Ja",,,,,,,,,,,,,,"Z",,,,,,,,,,,"0.00",,"Nee","Nee",,"Nee",,,,,"Niet geregistreerd","NG","Ja",,"2022-02-28T00:00:00.000","2002-06-30T00:00:00.000","2022-02-28T00:00:00.000",,,,,,,,,,,,,,,,,,,"Overige machine voor transport",,,,,,,,,"https://opendata.rdw.nl/resource/3huj-srit.json","https://opendata.rdw.nl/resource/8ys7-d773.json","https://opendata.rdw.nl/resource/vezc-m2t6.json","https://opendata.rdw.nl/resource/jhie-znh9.json","https://opendata.rdw.nl/resource/kmfi-hrps.json"
"T92BXD","Motorrijtuig met beperkte snelheid","VOLKSWAGEN","CADDY",,"20231002",,"Niet geregistreerd",,"N.v.t.","N.v.t.",,,,,,,,"20000630","20220201","Geen verstrekking in Open Data",,"Ja",,,,,,,,,,,,,,"Z",,,,,,,,,,,"0.00",,"Nee","Nee",,"Nee",,,,,"Niet geregistreerd","NG","Ja",,"2023-10-02T00:00:00.000","2000-06-30T00:00:00.000","2022-02-01T00:00:00.000",,,,,,,,,,,,,,,,,,,"Overige agrarische machine",,,,,,,,,"https://opendata.rdw.nl/resource/3huj-srit.json","https://opendata.rdw.nl/resource/8ys7-d773.json","https://opendata.rdw.nl/resource/vezc-m2t6.json","https://opendata.rdw.nl/resource/jhie-znh9.json","https://opendata.rdw.nl/resource/kmfi-hrps.json"
"T92DNV","Motorrijtuig met beperkte snelheid","VOLKSWAGEN","CADDY",,"20231207",,"Niet geregistreerd",,"N.v.t.","N.v.t.",,,,,,,,"19980630","20220329","Geen verstrekking in Open Data",,"Ja",,,,,,,,,,,,,,"Z",,,,,,,,,,,"0.00",,"Nee","Nee",,"Nee",,,,,"Niet geregistreerd","NG","Ja",,"2023-12-07T00:00:00.000","1998-06-30T00:00:00.000","2022-03-29T00:00:00.000",,,,,,,,,,,,,,,,,,,"Overige agrarische machine",,,,,,,,,"https://opendata.rdw.nl/resource/3huj-srit.json","https://opendata.rdw.nl/resource/8ys7-d773.json","https://opendata.rdw.nl/resource/vezc-m2t6.json","https://opendata.rdw.nl/resource/jhie-znh9.json","https://opendata.rdw.nl/resource/kmfi-hrps.json"
"T96BPG","Motorrijtuig met beperkte snelheid","VOLKSWAGEN","CADDY",,"20221112",,"Niet geregistreerd",,"N.v.t.","N.v.t.",,,,,,,,"20000630","20220117","Geen verstrekking in Open Data",,"Ja",,,,,,,,,,,,,,"Z",,,,,,,,,,,"0.00",,"Nee","Nee",,"Nee",,,,,"Niet geregistreerd","NG","Ja",,"2022-11-12T00:00:00.000","2000-06-30T00:00:00.000","2022-01-17T00:00:00.000",,,,,,,,,,,,,,,,,,,"Overige machine voor transport",,,,,,,,,"https://opendata.rdw.nl/resource/3huj-srit.json","https://opendata.rdw.nl/resource/8ys7-d773.json","https://opendata.rdw.nl/resource/vezc-m2t6.json","https://opendata.rdw.nl/resource/jhie-znh9.json","https://opendata.rdw.nl/resource/kmfi-hrps.json"
"TBB14J","Motorrijtuig met beperkte snelheid","VOLKSWAGEN","CADDY",,"20230908",,"Niet geregistreerd",,"N.v.t.","N.v.t.",,,,,,,,"20040630","20210106","Geen verstrekking in Open Data",,"Ja",,,,,,,,,,,,,,"Z",,,,,,,,,,,"0.00",,"Nee","Ja",,"Nee",,,,,"Niet geregistreerd","NG","Ja",,"2023-09-08T00:00:00.000","2004-06-30T00:00:00.000","2021-01-06T00:00:00.000",,,,,,,,,,,,,,,,,,,"Overige machine voor transport",,,,,,,,,"https://opendata.rdw.nl/resource/3huj-srit.json","https://opendata.rdw.nl/resource/8ys7-d773.json","https://opendata.rdw.nl/resource/vezc-m2t6.json","https://opendata.rdw.nl/resource/jhie-znh9.json","https://opendata.rdw.nl/resource/kmfi-hrps.json"
"TBB17J","Motorrijtuig met beperkte snelheid","VOLKSWAGEN","CADDY",,"20231025",,"Niet geregistreerd",,"N.v.t.","N.v.t.",,,,,,,,"20030630","20210106","Geen verstrekking in Open Data",,"Ja",,,,,,,,,,,,,,"Z",,,,,,,,,,,"0.00",,"Nee","Nee",,"Nee",,,,,"Niet geregistreerd","NG","Ja",,"2023-10-25T00:00:00.000","2003-06-30T00:00:00.000","2021-01-06T00:00:00.000",,,,,,,,,,,,,,,,,,,"Overige machine voor transport",,,,,,,,,"https://opendata.rdw.nl/resource/3huj-srit.json","https://opendata.rdw.nl/resource/8ys7-d773.json","https://opendata.rdw.nl/resource/vezc-m2t6.json","https://opendata.rdw.nl/resource/jhie-znh9.json","https://opendata.rdw.nl/resource/kmfi-hrps.json"
"TBB19J","Motorrijtuig met beperkte snelheid","VOLKSWAGEN","CADDY",,"20211105",,"Niet geregistreerd",,"N.v.t.","N.v.t.",,,,,,,,"20120630","20210106","Geen verstrekking in Open Data",,"Ja",,,,,,,,,,,,,,"Z",,,,,,,,,,,"0.00",,"Nee","Nee",,"Nee",,,,,"Niet geregistreerd","NG","Ja",,"2021-11-05T00:00:00.000","2012-06-30T00:00:00.000","2021-01-06T00:00:00.000",,,,,,,,,,,,,,,,,,,"Wegtrein",,,,,,,,,"https://opendata.rdw.nl/resource/3huj-srit.json","https://opendata.rdw.nl/resource/8ys7-d773.json","https://opendata.rdw.nl/resource/vezc-m2t6.json","https://opendata.rdw.nl/resource/jhie-znh9.json","https://opendata.rdw.nl/resource/kmfi-hrps.json"
"TBD12F","Motorrijtuig met beperkte snelheid","VOLKSWAGEN","CADDY",,"20230301",,"Niet geregistreerd",,"N.v.t.","N.v.t.",,,,,,,,"20020630","20210108","Geen verstrekking in Open Data",,"Ja",,,,,,,,,,,,,,"Z",,,,,,,,,,,"0.00",,"Nee","Nee",,"Nee",,,,,"Niet geregistreerd","NG","Ja",,"2023-03-01T00:00:00.000","2002-06-30T00:00:00.000","2021-01-08T00:00:00.000",,,,,,,,,,,,,,,,,,,"Overige agrarische machine",,,,,,,,,"https://opendata.rdw.nl/resource/3huj-srit.json","https://opendata.rdw.nl/resource/8ys7-d773.json","https://opendata.rdw.nl/resource/vezc-m2t6.json","https://opendata.rdw.nl/resource/jhie-znh9.json","https://opendata.rdw.nl/resource/kmfi-hrps.json"
"TBF14X","Motorrijtuig met beperkte snelheid","VOLKSWAGEN","CADDY",,"20221228",,"Niet geregistreerd",,"N.v.t.","N.v.t.",,,,,,,,"20050630","20210114","Geen verstrekking in Open Data",,"Ja",,,,,,,,,,,,,,"Z",,,,,,,,,,,"0.00",,"Nee","Nee",,"Nee",,,,,"Niet geregistreerd","NG","Ja",,"2022-12-28T00:00:00.000","2005-06-30T00:00:00.000","2021-01-14T00:00:00.000",,,,,,,,,,,,,,,,,,,"Overige machine voor transport",,,,,,,,,"https://opendata.rdw.nl/resource/3huj-srit.json","https://opendata.rdw.nl/resource/8ys7-d773.json","https://opendata.rdw.nl/resource/vezc-m2t6.json","https://opendata.rdw.nl/resource/jhie-znh9.json","https://opendata.rdw.nl/resource/kmfi-hrps.json"
"TBF37J","Motorrijtuig met beperkte snelheid","VOLKSWAGEN","CADDY",,"20210112",,"Niet geregistreerd",,"N.v.t.","N.v.t.",,,,,,,,"20070630","20210112","Geen verstrekking in Open Data",,"Ja",,,,,,,,,,,,,,"Z",,,,,,,,,,,"0.00",,"Nee","Nee",,"Nee",,,,,"Niet geregistreerd","NG","Ja",,"2021-01-12T00:00:00.000","2007-06-30T00:00:00.000","2021-01-12T00:00:00.000",,,,,,,,,,,,,,,,,,,"Overige machine voor transport",,,,,,,,,"https://opendata.rdw.nl/resource/3huj-srit.json","https://opendata.rdw.nl/resource/8ys7-d773.json","https://opendata.rdw.nl/resource/vezc-m2t6.json","https://opendata.rdw.nl/resource/jhie-znh9.json","https://opendata.rdw.nl/resource/kmfi-hrps.json"
"TBF58J","Motorrijtuig met beperkte snelheid","VOLKSWAGEN","CADDY",,"20210112",,"Niet geregistreerd",,"N.v.t.","N.v.t.",,,,,,,,"19990630","20210112","Geen verstrekking in Open Data",,"Ja",,,,,,,,,,,,,,"Z",,,,,,,,,,,"0.00",,"Nee","Nee",,"Nee",,,,,"Niet geregistreerd","NG","Ja",,"2021-01-12T00:00:00.000","1999-06-30T00:00:00.000","2021-01-12T00:00:00.000",,,,,,,,,,,,,,,,,,,"Overige machine voor transport",,,,,,,,,"https://opendata.rdw.nl/resource/3huj-srit.json","https://opendata.rdw.nl/resource/8ys7-d773.json","https://opendata.rdw.nl/resource/vezc-m2t6.json","https://opendata.rdw.nl/resource/jhie-znh9.json","https://opendata.rdw.nl/resource/kmfi-hrps.json"
"TBF96T","Motorrijtuig met beperkte snelheid","VOLKSWAGEN","CADDY",,"20210113",,"Niet geregistreerd",,"N.v.t.","N.v.t.",,,,,,,,"20020630","20210113","Geen verstrekking in Open Data",,"Ja",,,,,,,,,,,,,,"Z",,,,,,,,,,,"0.00",,"Nee","Ja",,"Nee",,,,,"Niet geregistreerd","NG","Ja",,"2021-01-13T00:00:00.000","2002-06-30T00:00:00.000","2021-01-13T00:00:00.000",,,,,,,,,,,,,,,,,,,"Overige machine voor transport",,,,,,,,,"https://opendata.rdw.nl/resource/3huj-srit.json","https://opendata.rdw.nl/resource/8ys7-d773.json","https://opendata.rdw.nl/resource/vezc-m2t6.json","https://opendata.rdw.nl/resource/jhie-znh9.json","https://opendata.rdw.nl/resource/kmfi-hrps.json"
"TBF97T","Motorrijtuig met beperkte snelheid","VOLKSWAGEN","CADDY",,"20231226",,"Niet geregistreerd",,"N.v.t.","N.v.t.",,,,,,,,"20100630","20210113","Geen verstrekking in Open Data",,"Ja",,,,,,,,,,,,,,"Z",,,,,,,,,,,"0.00",,"Nee","Nee",,"Nee",,,,,"Niet geregistreerd","NG","Ja",,"2023-12-26T00:00:00.000","2010-06-30T00:00:00.000","2021-01-13T00:00:00.000",,,,,,,,,,,,,,,,,,,"Overige machine voor transport",,,,,,,,,"https://opendata.rdw.nl/resource/3huj-srit.json","https://opendata.rdw.nl/resource/8ys7-d773.json","https://opendata.rdw.nl/resource/vezc-m2t6.json","https://opendata.rdw.nl/resource/jhie-znh9.json","https://opendata.rdw.nl/resource/kmfi-hrps.json"