"kenteken","voertuigsoort","merk","handelsbenaming","vervaldatum_apk","datum_tenaamstelling","bruto_bpm","inrichting","aantal_zitplaatsen","eerste_kleur","tweede_kleur","aantal_cilinders","cilinderinhoud","massa_ledig_voertuig","toegestane_maximum_massa_voertuig","massa_rijklaar","maximum_massa_trekken_ongeremd","maximum_trekken_massa_geremd","datum_eerste_toelating","datum_eerste_tenaamstelling_in_nederland","wacht_op_keuren","catalogusprijs","wam_verzekerd","maximale_constructiesnelheid","laadvermogen","oplegger_geremd","aanhangwagen_autonoom_geremd","aanhangwagen_middenas_geremd","aantal_staanplaatsen","aantal_deuren","aantal_wielen","afstand_hart_koppeling_tot_achterzijde_voertuig","afstand_voorzijde_voertuig_tot_hart_koppeling","afwijkende_maximum_snelheid","lengte","breedte","europese_voertuigcategorie","europese_voertuigcategorie_toevoeging","europese_uitvoeringcategorie_toevoeging","plaats_chassisnummer","technische_max_massa_voertuig","type","type_gasinstallatie","typegoedkeuringsnummer","variant","uitvoering","volgnummer_wijziging_eu_typegoedkeuring","vermogen_massarijklaar","wielbasis","export_indicator","openstaande_terugroepactie_indicator","vervaldatum_tachograaf","taxi_indicator","maximum_massa_samenstelling","aantal_rolstoelplaatsen","maximum_ondersteunende_snelheid","jaar_laatste_registratie_tellerstand","tellerstandoordeel","code_toelichting_tellerstandoordeel","tenaamstellen_mogelijk","vervaldatum_apk_dt","datum_tenaamstelling_dt","datum_eerste_toelating_dt","datum_eerste_tenaamstelling_in_nederland_dt","vervaldatum_tachograaf_dt","maximum_last_onder_de_vooras_sen_tezamen_koppeling","type_remsysteem_voertuig_code","rupsonderstelconfiguratiecode","wielbasis_voertuig_minimum","wielbasis_voertuig_maximum","lengte_voertuig_minimum","lengte_voertuig_maximum","breedte_voertuig_minimum","breedte_voertuig_maximum","hoogte_voertuig","hoogte_voertuig_minimum","hoogte_voertuig_maximum","massa_bedrijfsklaar_minimaal","massa_bedrijfsklaar_maximaal","technisch_toelaatbaar_massa_koppelpunt","maximum_massa_technisch_maximaal","maximum_massa_technisch_minimaal","subcategorie_nederland","verticale_belasting_koppelpunt_getrokken_voertuig","zuinigheidsclassificatie","registratie_datum_goedkeuring_afschrijvingsmoment_bpm","registratie_datum_goedkeuring_afschrijvingsmoment_bpm_dt","gem_lading_wrde","aerodyn_voorz","massa_alt_aandr","verl_cab_ind","api_gekentekende_voertuigen_assen","api_gekentekende_voertuigen_brandstof","api_gekentekende_voertuigen_carrosserie","api_gekentekende_voertuigen_carrosserie_specifiek","api_gekentekende_voertuigen_voertuigklasse"
"4224GV","Motorrijtuig met beperkte snelheid","PEUGEOT","PARTNER",,"20230827",,"Niet geregistreerd",,"N.v.t.","N.v.t.",,,,,,,,"20090630","20210708","Geen verstrekking in Open Data",,"Ja",,,,,,,,,,,,,,"Z",,,,,,,,,,,"0.00",,"Nee","Nee",,"Nee",,,,,"Niet geregistreerd","NG","Ja",,"2023-08-27T00:00:00.000","2009-06-30T00:00:00.000","2021-07-08T00:00:00.000",,,,,,,,,,,,,,,,,,,"Overige agrarische machine",,,,,,,,,"https://opendata.rdw.nl/resource/3huj-srit.json","https://opendata.rdw.nl/resource/8ys7-d773.json","https://opendata.rdw.nl/resource/vezc-m2t6.json","https://opendata.rdw.nl/resource/jhie-znh9.json","https://opendata.rdw.nl/resource/kmfi-hrps.json"
"6GV499","Motorrijtuig met beperkte snelheid","PEUGEOT","PARTNER 1.9",,"20220117",,"Niet geregistreerd",,"N.v.t.","N.v.t.",,,,,,,,"19980630","20220117","Geen verstrekking in Open Data",,"Ja",,,,,,,,,,,,,,"Z",,,,,,,,,,,"0.00",,"Nee","Nee",,"Nee",,,,,"Niet geregistreerd","NG","Ja",,"2022-01-17T00:00:00.000","1998-06-30T00:00:00.000","2022-01-17T00:00:00.000",,,,,,,,,,,,,,,,,,,"Overige agrarische machine",,,,,,,,,"https://opendata.rdw.nl/resource/3huj-srit.json","https://opendata.rdw.nl/resource/8ys7-d773.json","https://opendata.rdw.nl/resource/vezc-m2t6.json","https://opendata.rdw.nl/resource/jhie-znh9.json","https://opendata.rdw.nl/resource/kmfi-hrps.json"
"8GV634","Motorrijtuig met beperkte snelheid","PEUGEOT","PARTNER 1.9",,"20230811",,"Niet geregistreerd",,"N.v.t.","N.v.t.",,,,,,,,"19990630","20210519","Geen verstrekking in Open Data",,"Ja",,,,,,,,,,,,,,"Z",,,,,,,,,,,"0.00",,"Nee","Nee",,"Nee",,,,,"Niet geregistreerd","NG","Ja",,"2023-08-11T00:00:00.000","1999-06-30T00:00:00.000","2021-05-19T00:00:00.000",,,,,,,,,,,,,,,,,,,"Overige machine voor transport",,,,,,,,,"https://opendata.rdw.nl/resource/3huj-srit.json","https://opendata.rdw.nl/resource/8ys7-d773.json","https://opendata.rdw.nl/resource/vezc-m2t6.json","https://opendata.rdw.nl/resource/jhie-znh9.json","https://opendata.rdw.nl/resource/kmfi-hrps.json"
"9GV693","Motorrijtuig met beperkte snelheid","PEUGEOT","PARTNER 1.9",,"20230830",,"Niet geregistreerd",,"N.v.t.","N.v.t.",,,,,,,,"20010630","20210412","Geen verstrekking in Open Data",,"Ja",,,,,,,,,,,,,,"Z",,,,,,,,,,,"0.00",,"Nee","Nee",,"Nee",,,,,"Niet geregistreerd","NG","Ja",,"2023-08-30T00:00:00.000","2001-06-30T00:00:00.000","2021-04-12T00:00:00.000",,,,,,,,,,,,,,,,,,,"Overige agrarische machine",,,,,,,,,"https://opendata.rdw.nl/resource/3huj-srit.json","https://opendata.rdw.nl/resource/8ys7-d773.json","https://opendata.rdw.nl/resource/vezc-m2t6.json","https://opendata.rdw.nl/resource/jhie-znh9.json","https://opendata.rdw.nl/resource/kmfi-hrps.json"
"T12FGT","Motorrijtuig met beperkte snelheid","PEUGEOT","PARTNER",,"20221222",,"Niet geregistreerd",,"N.v.t.","N.v.t.",,,,,,,,"20030630","20221222","Geen verstrekking in Open Data",,"Ja",,,,,,,,,,,,,,"Z",,,,,,,,,,,"0.00",,"Nee","Nee",,"Nee",,,,,"Niet geregistreerd","NG","Ja",,"2022-12-22T00:00:00.000","2003-06-30T00:00:00.000","2022-12-22T00:00:00.000",,,,,,,,,,,,,,,,,,,"Overige agrarische machine",,,,,,,,,"https://opendata.rdw.nl/resource/3huj-srit.json","https://opendata.rdw.nl/resource/8ys7-d773.json","https://opendata.rdw.nl/resource/vezc-m2t6.json","https://opendata.rdw.nl/resource/jhie-znh9.json","https://opendata.rdw.nl/resource/kmfi-hrps.json"
"T25BBH","Motorrijtuig met beperkte snelheid","PEUGEOT","PARTNER",,"20231213",,"Niet geregistreerd",,"N.v.t.","N.v.t.",,,,,,,,"20040630","20211231","Geen verstrekking in Open Data",,"Ja",,,,,,,,,,,,,,"Z",,,,,,,,,,,"0.00",,"Nee","Nee",,"Nee",,,,,"Niet geregistreerd","NG","Ja",,"2023-12-13T00:00:00.000","2004-06-30T00:00:00.000","2021-12-31T00:00:00.000",,,,,,,,,,,,,,,,,,,"Overige machine voor transport",,,,,,,,,"https://opendata.rdw.nl/resource/3huj-srit.json","https://opendata.rdw.nl/resource/8ys7-d773.json","https://opendata.rdw.nl/resource/vezc-m2t6.json","https://opendata.rdw.nl/resource/jhie-znh9.json","https://opendata.rdw.nl/resource/kmfi-hrps.json"
"T31DHF","Motorrijtuig met beperkte snelheid","PEUGEOT","PARTNER",,"20220317",,"Niet geregistreerd",,"N.v.t.","N.v.t.",,,,,,,,"20100630","20220224","Geen verstrekking in Open Data",,"Ja",,,,,,,,,,,,,,"Z",,,,,,,,,,,"0.00",,"Nee","Nee",,"Nee",,,,,"Niet geregistreerd","NG","Ja",,"2022-03-17T00:00:00.000","2010-06-30T00:00:00.000","2022-02-24T00:00:00.000",,,,,,,,,,,,,,,,,,,"Overige machine voor transport",,,,,,,,,"https://opendata.rdw.nl/resource/3huj-srit.json","https://opendata.rdw.nl/resource/8ys7-d773.json","https://opendata.rdw.nl/resource/vezc-m2t6.json","https://opendata.rdw.nl/resource/jhie-znh9.json","https://opendata.rdw.nl/resource/kmfi-hrps.json"
"T34BKX","Motorrijtuig met beperkte snelheid","PEUGEOT","PARTNER",,"20230210",,"Niet geregistreerd",,"N.v.t.","N.v.t.",,,,,,,,"20000630","20220111","Geen verstrekking in Open Data",,"Ja",,,,,,,,,,,,,,"Z",,,,,,,,,,,"0.00",,"Nee","Nee",,"Nee",,,,,"Niet geregistreerd","NG","Ja",,"2023-02-10T00:00:00.000","2000-06-30T00:00:00.000","2022-01-11T00:00:00.000",,,,,,,,,,,,,,,,,,,"Overige machine voor transport",,,,,,,,,"https://opendata.rdw.nl/resource/3huj-srit.json","https://opendata.rdw.nl/resource/8ys7-d773.json","https://opendata.rdw.nl/resource/vezc-m2t6.json","https://opendata.rdw.nl/resource/jhie-znh9.json","https://opendata.rdw.nl/resource/kmfi-hrps.json"
"T59DNL","Motorrijtuig met beperkte snelheid","PEUGEOT","PARTNER",,"20240122",,"Niet geregistreerd","2","N.v.t.","N.v.t.","4","1905",,,"1233",,,"19980630","20220325","Geen verstrekking in Open Data",,"Ja",,,,,,,,"4",,,,"410","172","Z",,,,"1755",,,,,,,"0.04","269","Nee","Nee",,"Nee",,,,,"Niet geregistreerd","NG","Ja",,"2024-01-22T00:00:00.000","1998-06-30T00:00:00.000","2022-03-25T00:00:00.000",,,,,,,,,,,"198",,,,,,,,"Overige machine voor transport",,,"20240115","2024-01-15T00:00:00.000",,,,,"https://opendata.rdw.nl/resource/3huj-srit.json","https://opendata.rdw.nl/resource/8ys7-d773.json","https://opendata.rdw.nl/resource/vezc-m2t6.json","https://opendata.rdw.nl/resource/jhie-znh9.json","https://opendata.rdw.nl/resource/kmfi-hrps.json"
"T69BZT","Motorrijtuig met beperkte snelheid","PEUGEOT","PARTNER",,"20240130",,"Niet geregistreerd",,"N.v.t.","N.v.t.",,,,,,,,"19950630","20220208","Geen verstrekking in Open Data",,"Nee",,,,,,,,,,,,,,"Z",,,,,,,,,,,"0.00",,"Nee","Nee",,"Nee",,,,,"Niet geregistreerd","NG","Ja",,"2024-01-30T00:00:00.000","1995-06-30T00:00:00.000","2022-02-08T00:00:00.000",,,,,,,,,,,,,,,,,,,"Overige agrarische machine",,,,,,,,,"https://opendata.rdw.nl/resource/3huj-srit.json","https://opendata.rdw.nl/resource/8ys7-d773.json","https://opendata.rdw.nl/resource/vezc-m2t6.json","https://opendata.rdw.nl/resource/jhie-znh9.json","https://opendata.rdw.nl/resource/kmfi-hrps.json"
"T74BZT","Motorrijtuig met beperkte snelheid","PEUGEOT","PARTNER",,"20230131",,"Niet geregistreerd",,"N.v.t.","N.v.t.",,,,,,,,"19970630","20220208","Geen verstrekking in Open Data",,"Ja",,,,,,,,,,,,,,"Z",,,,,,,,,,,"0.00",,"Nee","Nee",,"Nee",,,,,"Niet geregistreerd","NG","Ja",,"2023-01-31T00:00:00.000","1997-06-30T00:00:00.000","2022-02-08T00:00:00.000",,,,,,,,,,,,,,,,,,,"Overige machine voor transport",,,,,,,,,"https://opendata.rdw.nl/resource/3huj-srit.json","https://opendata.rdw.nl/resource/8ys7-d773.json","https://opendata.rdw.nl/resource/vezc-m2t6.json","https://opendata.rdw.nl/resource/jhie-znh9.json","https://opendata.rdw.nl/resource/kmfi-hrps.json"
"TBF72R","Motorrijtuig met beperkte snelheid","PEUGEOT","PARTNER",,"20230311",,"Niet geregistreerd",,"N.v.t.","N.v.t.","4","1868",,,"1238",,,"20030509","20210113","Geen verstrekking in Open Data",,"Ja",,,,,,,,"4",,,,,"17","Z",,,,"1755",,,,,,,"0.04","27","Nee","Nee",,"Nee",,,,,"Niet geregistreerd","NG","Ja",,"2023-03-11T00:00:00.000","2003-05-09T00:00:00.000","2021-01-13T00:00:00.000",,,,,,,,,,,,,,,,,,,"Overige machine voor transport",,,,,,,,,"https://opendata.rdw.nl/resource/3huj-srit.json","https://opendata.rdw.nl/resource/8ys7-d773.json","https://opendata.rdw.nl/resource/vezc-m2t6.json","https://opendata.rdw.nl/resource/jhie-znh9.json","https://opendata.rdw.nl/resource/kmfi-hrps.json"
"TBG30D","Motorrijtuig met beperkte snelheid","PEUGEOT","PARTNER",,"20210301",,"Niet geregistreerd",,"N.v.t.","N.v.t.",,,,,,,,"20060630","20210114","Geen verstrekking in Open Data",,"Ja",,,,,,,,,,,,,,"Z",,,,,,,,,,,"0.00",,"Nee","Nee",,"Nee",,,,,"Niet geregistreerd","NG","Ja",,"2021-03-01T00:00:00.000","2006-06-30T00:00:00.000","2021-01-14T00:00:00.000",,,,,,,,,,,,,,,,,,,"Overige machine voor transport",,,,,,,,,"https://opendata.rdw.nl/resource/3huj-srit.json","https://opendata.rdw.nl/resource/8ys7-d773.json","https://opendata.rdw.nl/resource/vezc-m2t6.json","https://opendata.rdw.nl/resource/jhie-znh9.json","https://opendata.rdw.nl/resource/kmfi-hrps.json"
"TBH27J","Motorrijtuig met beperkte snelheid","PEUGEOT","PARTNER",,"20210217",,"Niet geregistreerd",,"N.v.t.","N.v.t.",,,,,,,,"20010815","20210118","Geen verstrekking in Open Data",,"Ja",,,,,,,,,,,,,,"Z",,,,,,,,,,,"0.00",,"Nee","Nee",,"Nee",,,,,"Niet geregistreerd","NG","Ja",,"2021-02-17T00:00:00.000","2001-08-15T00:00:00.000","2021-01-18T00:00:00.000",,,,,,,,,,,,,,,,,,,"Overige machine voor transport",,,,,,,,,"https://opendata.rdw.nl/resource/3huj-srit.json","https://opendata.rdw.nl/resource/8ys7-d773.json","https://opendata.rdw.nl/resource/vezc-m2t6.json","https://opendata.rdw.nl/resource/jhie-znh9.json","https://opendata.rdw.nl/resource/kmfi-hrps.json"
"TBH32J","Motorrijtuig met beperkte snelheid","PEUGEOT","PARTNER",,"20230930",,"Niet geregistreerd",,"N.v.t.","N.v.t.",,,,,,,,"20030630","20210118","Geen verstrekking in Open Data",,"Ja",,,,,,,,,,,,,,"Z",,,,,,,,,,,"0.00",,"Nee","Nee",,"Nee",,,,,"Niet geregistreerd","NG","Ja",,"2023-09-30T00:00:00.000","2003-06-30T00:00:00.000","2021-01-18T00:00:00.000",,,,,,,,,,,,,,,,,,,"Overige machine voor transport",,,,,,,,,"https://opendata.rdw.nl/resource/3huj-srit.json","https://opendata.rdw.nl/resource/8ys7-d773.json","https://opendata.rdw.nl/resource/vezc-m2t6.json","https://opendata.rdw.nl/resource/jhie-znh9.json","https://opendata.rdw.nl/resource/kmfi-hrps.json"
"TBK12R","Motorrijtuig met beperkte snelheid","PEUGEOT","PARTNER",,"20210701",,"Niet geregistreerd",,"N.v.t.","N.v.t.",,,,,,,,"20050630","20210121","Geen verstrekking in Open Data",,"Ja",,,,,,,,,,,,,,"Z",,,,,,,,,,,"0.00",,"Nee","Nee",,"Nee",,,,,"Niet geregistreerd","NG","Ja",,"2021-07-01T00:00:00.000","2005-06-30T00:00:00.000","2021-01-21T00:00:00.000",,,,,,,,,,,,,,,,,,,"Overige machine voor transport",,,,,,,,,"https://opendata.rdw.nl/resource/3huj-srit.json","https://opendata.rdw.nl/resource/8ys7-d773.json","https://opendata.rdw.nl/resource/vezc-m2t6.json","https://opendata.rdw.nl/resource/jhie-znh9.json","https://opendata.rdw.nl/resource/kmfi-hrps.json"
"TBL36V","Motorrijtuig met beperkte snelheid","PEUGEOT","PARTNER",,"20210122",,"Niet geregistreerd",,"N.v.t.","N.v.t.",,,,,,,,"20000630","20210122","Geen verstrekking in Open Data",,"Ja",,,,,,,,,,,,,,"Z",,,,,,,,,,,"0.00",,"Nee","Nee",,"Nee",,,,,"Niet geregistreerd","NG","Ja",,"2021-01-22T00:00:00.000","2000-06-30T00:00:00.000","2021-01-22T00:00:00.000",,,,,,,,,,,,,,,,,,,"Overige machine voor transport",,,,,,,,,"https://opendata.rdw.nl/resource/3huj-srit.json","https://opendata.rdw.nl/resource/8ys7-d773.json","https://opendata.rdw.nl/resource/vezc-m2t6.json","https://opendata.rdw.nl/resource/jhie-znh9.json","https://opendata.rdw.nl/resource/kmfi-hrps.json"
"TBP87Z","Motorrijtuig met beperkte snelheid","PEUGEOT","PARTNER",,"20240112",,"Niet geregistreerd",,"N.v.t.","N.v.t.",,,,,,,,"20070630","20210127","Geen verstrekking in Open Data",,"Ja",,,,,,,,,,,,,,"Z",,,,,,,,,,,"0.00",,"Nee","Nee",,"Nee",,,,,"Niet geregistreerd","NG","Ja",,"2024-01-12T00:00:00.000","2007-06-30T00:00:00.000","2021-01-27T00:00:00.000",,,,,,,,,,,,,,,,,,,"Overige agrarische machine",,,,,,,,,"https://opendata.rdw.nl/resource/3huj-srit.json","https://opendata.rdw.nl/resource/8ys7-d773.json","https://opendata.rdw.nl/resource/vezc-m2t6.json","https://opendata.rdw.nl/resource/jhie-znh9.json","https://opendata.rdw.nl/resource/kmfi-hrps.json"
"TDG33Z","Motorrijtuig met beperkte snelheid","PEUGEOT","PARTNER 1.9",,"20240504",,"Niet geregistreerd",,"N.v.t.","N.v.t.",,,,,,,,"19970630","20210216","Geen verstrekking in Open Data",,"Ja",,,,,,,,,,,,,,"Z",,,,,,,,,,,"0.00",,"Nee","Nee",,"Nee",,,,,"Niet geregistreerd","NG","Ja",,"2024-05-04T00:00:00.000","1997-06-30T00:00:00.000","2021-02-16T00:00:00.000",,,,,,,,,,,,,,,,,,,"Overige machine voor transport",,,,,,,,,"https://opendata.rdw.nl/resource/3huj-srit.json","https://opendata.rdw.nl/resource/8ys7-d773.json","https://opendata.rdw.nl/resource/vezc-m2t6.json","https://opendata.rdw.nl/resource/jhie-znh9.json","https://opendata.rdw.nl/resource/kmfi-hrps.json"
"TDG35Z","Motorrijtuig met beperkte snelheid","PEUGEOT","PARTNER 1.9",,"20220228",,"Niet geregistreerd",,"N.v.t.","N.v.t.",,,,,,,,"19970630","20210216","Geen verstrekking in Open Data",,"Ja",,,,,,,,,,,,,,"Z",,,,,,,,,,,"0.00",,"Nee","Nee",,"Nee",,,,,"Niet geregistreerd","NG","Ja",,"2022-02-28T00:00:00.000","1997-06-30T00:00:00.000","2021-02-16T00:00:00.000",,,,,,,,,,,,,,,,,,,"Overige machine voor transport",,,,,,,,,"https://opendata.rdw.nl/resource/3huj-srit.json","https://opendata.rdw.nl/resource/8ys7-d773.json","https://opendata.rdw.nl/resource/vezc-m2t6.json","https://opendata.rdw.nl/resource/jhie-znh9.json","https://opendata.rdw.nl/resource/kmfi-hrps.json"
"TDG36Z","Motorrijtuig met beperkte snelheid","PEUGEOT","PARTNER",,"20220414",,"Niet geregistreerd",,"N.v.t.","N.v.t.",,,,,,,,"20020630","20210216","Geen verstrekking in Open Data",,"Ja",,,,,,,,,,,,,,"Z",,,,,,,,,,,"0.00",,"Nee","Nee",,"Nee",,,,,"Niet geregistreerd","NG","Ja",,"2022-04-14T00:00:00.000","2002-06-30T00:00:00.000","2021-02-16T00:00:00.000",,,,,,,,,,,,,,,,,,,"Overige machine voor transport",,,,,,,,,"https://opendata.rdw.nl/resource/3huj-srit.json","https://opendata.rdw.nl/resource/8ys7-d773.json","https://opendata.rdw.nl/resource/vezc-m2t6.json","https://opendata.rdw.nl/resource/jhie-znh9.json","https://opendata.rdw.nl/resource/kmfi-hrps.json"
"TDG78H","Motorrijtuig met beperkte snelheid","PEUGEOT","PARTNER",,"20231006",,"Niet geregistreerd",,"N.v.t.","N.v.t.",,,,,,,,"20010630","20210215","Geen verstrekking in Open Data",,"Ja",,,,,,,,,,,,,,"Z",,,,,,,,,,,"0.00",,"Nee","Nee",,"Nee",,,,,"Niet geregistreerd","NG","Ja",,"2023-10-06T00:00:00.000","2001-06-30T00:00:00.000","2021-02-15T00:00:00.000",,,,,,,,,,,,,,,,,,,"Overige agrarische machine",,,,,,,,,"https://opendata.rdw.nl/resource/3huj-srit.json","https://opendata.rdw.nl/resource/8ys7-d773.json","https://opendata.rdw.nl/resource/vezc-m2t6.json","https://opendata.rdw.nl/resource/jhie-znh9.json","https://opendata.rdw.nl/resource/kmfi-hrps.json"
"TDG90K","Motorrijtuig met beperkte snelheid","PEUGEOT","PARTNER",,"20240417",,"Niet geregistreerd",,"N.v.t.","N.v.t.",,,,,,,,"20020630","20210215","Geen verstrekking in Open Data",,"Ja",,,,,,,,,,,,,,"Z",,,,,,,,,,,"0.00",,"Nee","Nee",,"Nee",,,,,"Niet geregistreerd","NG","Ja",,"2024-04-17T00:00:00.000","2002-06-30T00:00:00.000","2021-02-15T00:00:00.000",,,,,,,,,,,,,,,,,,,"Overige machine voor transport",,,,,,,,,"https://opendata.rdw.nl/resource/3huj-srit.json","https://opendata.rdw.nl/resource/8ys7-d773.json","https://opendata.rdw.nl/resource/vezc-m2t6.json","https://opendata.rdw.nl/resource/jhie-znh9.json","https://opendata.rdw.nl/resource/kmfi-hrps.json"
"TDG91F","Motorrijtuig met beperkte snelheid","PEUGEOT","PARTNER",,"20210215",,"Niet geregistreerd",,"N.v.t.","N.v.t.",,,,,,,,"20000630","20210215","Geen verstrekking in Open Data",,"Ja",,,,,,,,,,,,,,"Z",,,,,,,,,,,"0.00",,"Nee","Nee",,"Nee",,,,,"Niet geregistreerd","NG","Ja",,"2021-02-15T00:00:00.000","2000-06-30T00:00:00.000","2021-02-15T00:00:00.000",,,,,,,,,,,,,,,,,,,"Overige machine voor transport",,,,,,,,,"https://opendata.rdw.nl/resource/3huj-srit.json","https://opendata.rdw.nl/resource/8ys7-d773.json","https://opendata.rdw.nl/resource/vezc-m2t6.json","https://opendata.rdw.nl/resource/jhie-znh9.json","https://opendata.rdw.nl/resource/kmfi-hrps.json"
"TDH54J","Motorrijtuig met beperkte snelheid","PEUGEOT","PARTNER",,"20210216",,"Niet geregistreerd",,"N.v.t.","N.v.t.",,,,,,,,"20010630","20210216","Geen verstrekking in Open Data",,"Ja",,,,,,,,,,,,,,"Z",,,,,,,,,,,"0.00",,"Nee","Nee",,"Nee",,,,,"Niet geregistreerd","NG","Ja",,"2021-02-16T00:00:00.000","2001-06-30T00:00:00.000","2021-02-16T00:00:00.000",,,,,,,,,,,,,,,,,,,"Overige agrarische machine",,,,,,,,,"https://opendata.rdw.nl/resource/3huj-srit.json","https://opendata.rdw.nl/resource/8ys7-d773.json","https://opendata.rdw.nl/resource/vezc-m2t6.json","https://opendata.rdw.nl/resource/jhie-znh9.json","https://opendata.rdw.nl/resource/kmfi-hrps.json"
"TDK62L","Motorrijtuig met beperkte snelheid","PEUGEOT","PARTNER",,"20211106",,"Niet geregistreerd",,"N.v.t.","N.v.t.","4",,,,"1275",,,"20010914","20210222","Geen verstrekking in Open Data",,"Nee",,,,,,,,"4",,,,"409","172","Z",,,,"1786",,,,,,,"0.00","269","Nee","Nee",,"Nee",,,,,"Niet geregistreerd","NG","Ja",,"2021-11-06T00:00:00.000","2001-09-14T00:00:00.000","2021-02-22T00:00:00.000",,,,,,,,,,,"179",,,,,,,,"Overige machine voor transport",,,,,,,,,"https://opendata.rdw.nl/resource/3huj-srit.json","https://opendata.rdw.nl/resource/8ys7-d773.json","https://opendata.rdw.nl/resource/vezc-m2t6.json","https://opendata.rdw.nl/resource/jhie-znh9.json","https://opendata.rdw.nl/resource/kmfi-hrps.json"
"TFD21H","Motorrijtuig met beperkte snelheid","PEUGEOT","PARTNER",,"20230531",,"Niet geregistreerd",,"N.v.t.","N.v.t.",,,,,,,,"20050630","20210319","Geen verstrekking in Open Data",,"Ja",,,,,,,,,,,,,,"Z",,,,,,,,,,,"0.00",,"Nee","Nee",,"Nee",,,,,"Niet geregistreerd","NG","Ja",,"2023-05-31T00:00:00.000","2005-06-30T00:00:00.000","2021-03-19T00:00:00.000",,,,,,,,,,,,,,,,,,,"Overige machine voor transport",,,,,,,,,"https://opendata.rdw.nl/resource/3huj-srit.json","https://opendata.rdw.nl/resource/8ys7-d773.json","https://opendata.rdw.nl/resource/vezc-m2t6.json","https://opendata.rdw.nl/resource/jhie-znh9.json","https://opendata.rdw.nl/resource/kmfi-hrps.json"
"TFF08S","Motorrijtuig met beperkte snelheid","PEUGEOT","PARTNER 1.9",,"20210323",,"Niet geregistreerd",,"N.v.t.","N.v.t.",,,,,,,,"20010630","20210323","Geen verstrekking in Open Data",,"Ja",,,,,,,,,,,,,,"Z",,,,,,,,,,,"0.00",,"Nee","Nee",,"Nee",,,,,"Niet geregistreerd","NG","Ja",,"2021-03-23T00:00:00.000","2001-06-30T00:00:00.000","2021-03-23T00:00:00.000",,,,,,,,,,,,,,,,,,,"Overige machine voor transport",,,,,,,,,"https://opendata.rdw.nl/resource/3huj-srit.json","https://opendata.rdw.nl/resource/8ys7-d773.json","https://opendata.rdw.nl/resource/vezc-m2t6.json","https://opendata.rdw.nl/resource/jhie-znh9.json","https://opendata.rdw.nl/resource/kmfi-hrps.json"
"TFH31J","Motorrijtuig met beperkte snelheid","PEUGEOT","PARTNER",,"20230322",,"Niet geregistreerd",,"N.v.t.","N.v.t.",,,,,,,,"20040630","20210329","Geen verstrekking in Open Data",,"Ja",,,,,,,,,,,,,,"Z",,,,,,,,,,,"0.00",,"Nee","Nee",,"Nee",,,,,"Niet geregistreerd","NG","Ja",,"2023-03-22T00:00:00.000","2004-06-30T00:00:00.000","2021-03-29T00:00:00.000",,,,,,,,,,,,,,,,,,,"Overige machine voor transport",,,,,,,,,"https://opendata.rdw.nl/resource/3huj-srit.json","https://opendata.rdw.nl/resource/8ys7-d773.json","https://opendata.rdw.nl/resource/vezc-m2t6.json","https://opendata.rdw.nl/resource/jhie-znh9.json","https://opendata.rdw.nl/resource/kmfi-hrps.json"
"TFH36P","Motorrijtuig met beperkte snelheid","PEUGEOT","PARTNER",,"20220126",,"Niet geregistreerd","2","N.v.t.","N.v.t.","4","1560",,,"1294",,,"20080630","20210330","Geen verstrekking in Open Data",,"Ja",,,,,,,,"4",,,,"410","180","Z",,,,"1730",,,,,,,"0.00","269","Nee","Nee",,"Nee",,,,,"Niet geregistreerd","NG","Ja",,"2022-01-26T00:00:00.000","2008-06-30T00:00:00.000","2021-03-30T00:00:00.000",,,,,,,,,,,"200",,,,,,,,"Overige machine voor transport",,,"20221021","2022-10-21T00:00:00.000",,,,,"https://opendata.rdw.nl/resource/3huj-srit.json","https://opendata.rdw.nl/resource/8ys7-d773.json","https://opendata.rdw.nl/resource/vezc-m2t6.json","https://opendata.rdw.nl/resource/jhie-znh9.json","https://opendata.rdw.nl/resource/kmfi-hrps.json"
"TFP43X","Motorrijtuig met beperkte snelheid","PEUGEOT","PARTNER",,"20220506",,"Niet geregistreerd",,"N.v.t.","N.v.t.",,,,,,,,"20010630","20210413","Geen verstrekking in Open Data",,"Ja",,,,,,,,,,,,,,"Z",,,,,,,,,,,"0.00",,"Nee","Nee",,"Nee",,,,,"Niet geregistreerd","NG","Ja",,"2022-05-06T00:00:00.000","2001-06-30T00:00:00.000","2021-04-13T00:00:00.000",,,,,,,,,,,,,,,,,,,"Overige machine voor transport",,,,,,,,,"https://opendata.rdw.nl/resource/3huj-srit.json","https://opendata.rdw.nl/resource/8ys7-d773.json","https://opendata.rdw.nl/resource/vezc-m2t6.json","https://opendata.rdw.nl/resource/jhie-znh9.json","https://opendata.rdw.nl/resource/kmfi-hrps.json"