"kenteken","voertuigsoort","merk","handelsbenaming","vervaldatum_apk","datum_tenaamstelling","bruto_bpm","inrichting","aantal_zitplaatsen","eerste_kleur","tweede_kleur","aantal_cilinders","cilinderinhoud","massa_ledig_voertuig","toegestane_maximum_massa_voertuig","massa_rijklaar","maximum_massa_trekken_ongeremd","maximum_trekken_massa_geremd","datum_eerste_toelating","datum_eerste_tenaamstelling_in_nederland","wacht_op_keuren","catalogusprijs","wam_verzekerd","maximale_constructiesnelheid","laadvermogen","oplegger_geremd","aanhangwagen_autonoom_geremd","aanhangwagen_middenas_geremd","aantal_staanplaatsen","aantal_deuren","aantal_wielen","afstand_hart_koppeling_tot_achterzijde_voertuig","afstand_voorzijde_voertuig_tot_hart_koppeling","afwijkende_maximum_snelheid","lengte","breedte","europese_voertuigcategorie","europese_voertuigcategorie_toevoeging","europese_uitvoeringcategorie_toevoeging","plaats_chassisnummer","technische_max_massa_voertuig","type","type_gasinstallatie","typegoedkeuringsnummer","variant","uitvoering","volgnummer_wijziging_eu_typegoedkeuring","vermogen_massarijklaar","wielbasis","export_indicator","openstaande_terugroepactie_indicator","vervaldatum_tachograaf","taxi_indicator","maximum_massa_samenstelling","aantal_rolstoelplaatsen","maximum_ondersteunende_snelheid","jaar_laatste_registratie_tellerstand","tellerstandoordeel","code_toelichting_tellerstandoordeel","tenaamstellen_mogelijk","vervaldatum_apk_dt","datum_tenaamstelling_dt","datum_eerste_toelating_dt","datum_eerste_tenaamstelling_in_nederland_dt","vervaldatum_tachograaf_dt","maximum_last_onder_de_vooras_sen_tezamen_koppeling","type_remsysteem_voertuig_code","rupsonderstelconfiguratiecode","wielbasis_voertuig_minimum","wielbasis_voertuig_maximum","lengte_voertuig_minimum","lengte_voertuig_maximum","breedte_voertuig_minimum","breedte_voertuig_maximum","hoogte_voertuig","hoogte_voertuig_minimum","hoogte_voertuig_maximum","massa_bedrijfsklaar_minimaal","massa_bedrijfsklaar_maximaal","technisch_toelaatbaar_massa_koppelpunt","maximum_massa_technisch_maximaal","maximum_massa_technisch_minimaal","subcategorie_nederland","verticale_belasting_koppelpunt_getrokken_voertuig","zuinigheidsclassificatie","registratie_datum_goedkeuring_afschrijvingsmoment_bpm","registratie_datum_goedkeuring_afschrijvingsmoment_bpm_dt","gem_lading_wrde","aerodyn_voorz","massa_alt_aandr","verl_cab_ind","api_gekentekende_voertuigen_assen","api_gekentekende_voertuigen_brandstof","api_gekentekende_voertuigen_carrosserie","api_gekentekende_voertuigen_carrosserie_specifiek","api_gekentekende_voertuigen_voertuigklasse"
"D558VZ","Bromfiets","TRIUMPH","REX",,"20101221",,"N.v.t.","1","N.v.t.","N.v.t.","0","40","29",,"31",,,"19530630","20101221","Geen verstrekking in Open Data",,"Ja","25",,,,,,,"2",,,,,,"L1","e","e","l. onder zadel",,,,,,,,"0.01","117","Nee","Nee",,"Nee",,,,,"Niet geregistreerd","NG","Ja",,"2010-12-21T00:00:00.000","1953-06-30T00:00:00.000","2010-12-21T00:00:00.000",,"0",,,,,,,,,,,,,,,,,,,,,,,,,,"https://opendata.rdw.nl/resource/3huj-srit.json","https://opendata.rdw.nl/resource/8ys7-d773.json","https://opendata.rdw.nl/resource/vezc-m2t6.json","https://opendata.rdw.nl/resource/jhie-znh9.json","https://opendata.rdw.nl/resource/kmfi-hrps.json"
"DD953B","Bromfiets","TRIUMPH","KNIRPS",,"20060822",,"N.v.t.",,"N.v.t.","N.v.t.","0",,,,,,,"19731231","20060822","Geen verstrekking in Open Data",,"Ja","45",,,,,,,"2",,,,,,"L1","e","e","r. tegen framebuis onder zadel",,,,,,,,"0.00",,"Nee","Nee",,"Nee",,,,,"Niet geregistreerd","NG","Ja",,"2006-08-22T00:00:00.000","1973-12-31T00:00:00.000","2006-08-22T00:00:00.000",,"0",,,,,,,,,,,,,,,,,,,,,,,,,,"https://opendata.rdw.nl/resource/3huj-srit.json","https://opendata.rdw.nl/resource/8ys7-d773.json","https://opendata.rdw.nl/resource/vezc-m2t6.json","https://opendata.rdw.nl/resource/jhie-znh9.json","https://opendata.rdw.nl/resource/kmfi-hrps.json"
"DF508F","Bromfiets","TRIUMPH",,,"20060831",,"N.v.t.",,"N.v.t.","N.v.t.","0",,,,,,,"19731231","20060831","Geen verstrekking in Open Data",,"Ja","45",,,,,,,"2",,,,,,"L1","e","e","r. onder zadel",,,,,,,,"0.00",,"Nee","Nee",,"Nee",,,,,"Niet geregistreerd","NG","Ja",,"2006-08-31T00:00:00.000","1973-12-31T00:00:00.000","2006-08-31T00:00:00.000",,"0",,,,,,,,,,,,,,,,,,,,,,,,,,"https://opendata.rdw.nl/resource/3huj-srit.json","https://opendata.rdw.nl/resource/8ys7-d773.json","https://opendata.rdw.nl/resource/vezc-m2t6.json","https://opendata.rdw.nl/resource/jhie-znh9.json","https://opendata.rdw.nl/resource/kmfi-hrps.json"
"DJ538K","Bromfiets","TRIUMPH",,,"20210614",,"N.v.t.",,"N.v.t.","N.v.t.","0",,,,,,,"19731231","20060923","Geen verstrekking in Open Data",,"Ja","45",,,,,,,"2",,,,,,"L1","e","e","r. tegen framebuis onder zadel",,,,,,,,"0.00",,"Nee","Nee",,"Nee",,,,,"Niet geregistreerd","NG","Ja",,"2021-06-14T00:00:00.000","1973-12-31T00:00:00.000","2006-09-23T00:00:00.000",,"0",,,,,,,,,,,,,,,,,,,,,,,,,,"https://opendata.rdw.nl/resource/3huj-srit.json","https://opendata.rdw.nl/resource/8ys7-d773.json","https://opendata.rdw.nl/resource/vezc-m2t6.json","https://opendata.rdw.nl/resource/jhie-znh9.json","https://opendata.rdw.nl/resource/kmfi-hrps.json"
"DK652G","Bromfiets","TRIUMPH","Knirps",,"20190403",,"N.v.t.",,"N.v.t.","N.v.t.","0","50",,,,,,"19731231","20060928","Geen verstrekking in Open Data",,"Ja","45",,,,,,,"2",,,,,,"L1","e","e","r. tegen frame onder zadel",,,,,,,,"0.00",,"Nee","Nee",,"Nee",,,,,"Niet geregistreerd","NG","Ja",,"2019-04-03T00:00:00.000","1973-12-31T00:00:00.000","2006-09-28T00:00:00.000",,"0",,,,,,,,,,,,,,,,,,,,,,,,,,"https://opendata.rdw.nl/resource/3huj-srit.json","https://opendata.rdw.nl/resource/8ys7-d773.json","https://opendata.rdw.nl/resource/vezc-m2t6.json","https://opendata.rdw.nl/resource/jhie-znh9.json","https://opendata.rdw.nl/resource/kmfi-hrps.json"
"DK909Z","Bromfiets","TRIUMPH","Knirps",,"20110120",,"N.v.t.",,"N.v.t.","N.v.t.","0",,,,,,,"19731231","20061002","Geen verstrekking in Open Data",,"Ja","45",,,,,,,"2",,,,,,"L1","e","e","r. op framebuis",,,,,,,,"0.00",,"Nee","Nee",,"Nee",,,,,"Niet geregistreerd","NG","Ja",,"2011-01-20T00:00:00.000","1973-12-31T00:00:00.000","2006-10-02T00:00:00.000",,"0",,,,,,,,,,,,,,,,,,,,,,,,,,"https://opendata.rdw.nl/resource/3huj-srit.json","https://opendata.rdw.nl/resource/8ys7-d773.json","https://opendata.rdw.nl/resource/vezc-m2t6.json","https://opendata.rdw.nl/resource/jhie-znh9.json","https://opendata.rdw.nl/resource/kmfi-hrps.json"
"DN558T","Bromfiets","TRIUMPH",,,"20211201",,"N.v.t.",,"N.v.t.","N.v.t.","0",,,,,,,"19731231","20061012","Geen verstrekking in Open Data",,"Ja","25",,,,,,,"2",,,,,,"L1","e","e","tegen frame onder zadel",,,,,,,,"0.00",,"Nee","Nee",,"Nee",,,,,"Niet geregistreerd","NG","Ja",,"2021-12-01T00:00:00.000","1973-12-31T00:00:00.000","2006-10-12T00:00:00.000",,"0",,,,,,,,,,,,,,,,,,,,,,,,,,"https://opendata.rdw.nl/resource/3huj-srit.json","https://opendata.rdw.nl/resource/8ys7-d773.json","https://opendata.rdw.nl/resource/vezc-m2t6.json","https://opendata.rdw.nl/resource/jhie-znh9.json","https://opendata.rdw.nl/resource/kmfi-hrps.json"
"FB103N","Bromfiets","TRIUMPH","KNIRPS",,"20061105",,"N.v.t.",,"N.v.t.","N.v.t.","0",,,,,,,"19731231","20061105","Geen verstrekking in Open Data",,"Ja","45",,,,,,,"2",,,,,,"L1","e","e","r. tegen framebuis onder zadel",,,,,,,,"0.00",,"Nee","Nee",,"Nee",,,,,"Niet geregistreerd","NG","Ja",,"2006-11-05T00:00:00.000","1973-12-31T00:00:00.000","2006-11-05T00:00:00.000",,"0",,,,,,,,,,,,,,,,,,,,,,,,,,"https://opendata.rdw.nl/resource/3huj-srit.json","https://opendata.rdw.nl/resource/8ys7-d773.json","https://opendata.rdw.nl/resource/vezc-m2t6.json","https://opendata.rdw.nl/resource/jhie-znh9.json","https://opendata.rdw.nl/resource/kmfi-hrps.json"
"FB909L","Bromfiets","TRIUMPH","FIPS STANDAARD",,"20171027",,"N.v.t.",,"N.v.t.","N.v.t.","0",,,,,,,"19731231","20061105","Geen verstrekking in Open Data",,"Ja","45",,,,,,,"2",,,,,,"L1","e","e","l. tegen framebuis onder zadel",,,,,,,,"0.00",,"Nee","Nee",,"Nee",,,,,"Niet geregistreerd","NG","Ja",,"2017-10-27T00:00:00.000","1973-12-31T00:00:00.000","2006-11-05T00:00:00.000",,"0",,,,,,,,,,,,,,,,,,,,,,,,,,"https://opendata.rdw.nl/resource/3huj-srit.json","https://opendata.rdw.nl/resource/8ys7-d773.json","https://opendata.rdw.nl/resource/vezc-m2t6.json","https://opendata.rdw.nl/resource/jhie-znh9.json","https://opendata.rdw.nl/resource/kmfi-hrps.json"
"FD490X","Bromfiets","TRIUMPH","KNIRPS",,"20061206",,"N.v.t.",,"N.v.t.","N.v.t.","0",,,,,,,"19731231","20061206","Geen verstrekking in Open Data",,"Ja","45",,,,,,,"2",,,,,,"L1","e","e","r. tegen framebuis onder zadel",,,,,,,,"0.00",,"Nee","Nee",,"Nee",,,,,"Niet geregistreerd","NG","Ja",,"2006-12-06T00:00:00.000","1973-12-31T00:00:00.000","2006-12-06T00:00:00.000",,"0",,,,,,,,,,,,,,,,,,,,,,,,,,"https://opendata.rdw.nl/resource/3huj-srit.json","https://opendata.rdw.nl/resource/8ys7-d773.json","https://opendata.rdw.nl/resource/vezc-m2t6.json","https://opendata.rdw.nl/resource/jhie-znh9.json","https://opendata.rdw.nl/resource/kmfi-hrps.json"
"FF129H","Bromfiets","TRIUMPH","KNIRPS",,"20110324",,"N.v.t.",,"N.v.t.","N.v.t.","0",,,,,,,"19731231","20061220","Geen verstrekking in Open Data",,"Ja","45",,,,,,,"2",,,,,,"L1","e","e","tegen framebuis onder zadel",,,,,,,,"0.00",,"Nee","Nee",,"Nee",,,,,"Niet geregistreerd","NG","Ja",,"2011-03-24T00:00:00.000","1973-12-31T00:00:00.000","2006-12-20T00:00:00.000",,"0",,,,,,,,,,,,,,,,,,,,,,,,,,"https://opendata.rdw.nl/resource/3huj-srit.json","https://opendata.rdw.nl/resource/8ys7-d773.json","https://opendata.rdw.nl/resource/vezc-m2t6.json","https://opendata.rdw.nl/resource/jhie-znh9.json","https://opendata.rdw.nl/resource/kmfi-hrps.json"
"FF278V","Bromfiets","TRIUMPH","KNIRPS",,"20210315",,"N.v.t.",,"N.v.t.","N.v.t.","0",,,,,,,"19731231","20070118","Geen verstrekking in Open Data",,"Nee","45",,,,,,,"2",,,,,,"L1","e","e","l. tegen framebuis onder zadel",,,,,,,,"0.00",,"Nee","Nee",,"Nee",,,,,"Niet geregistreerd","NG","Ja",,"2021-03-15T00:00:00.000","1973-12-31T00:00:00.000","2007-01-18T00:00:00.000",,"0",,,,,,,,,,,,,,,,,,,,,,,,,,"https://opendata.rdw.nl/resource/3huj-srit.json","https://opendata.rdw.nl/resource/8ys7-d773.json","https://opendata.rdw.nl/resource/vezc-m2t6.json","https://opendata.rdw.nl/resource/jhie-znh9.json","https://opendata.rdw.nl/resource/kmfi-hrps.json"
"FF484T","Bromfiets","TRIUMPH","KNIRPS",,"20230330",,"N.v.t.",,"N.v.t.","N.v.t.","0",,,,,,,"19731231","20070116","Geen verstrekking in Open Data",,"Nee","45",,,,,,,"2",,,,,,"L1","e","e","tegen framebuis onder zadel",,,,,,,,"0.00",,"Nee","Nee",,"Nee",,,,,"Niet geregistreerd","NG","Ja",,"2023-03-30T00:00:00.000","1973-12-31T00:00:00.000","2007-01-16T00:00:00.000",,"0",,,,,,,,,,,,,,,,,,,,,,,,,,"https://opendata.rdw.nl/resource/3huj-srit.json","https://opendata.rdw.nl/resource/8ys7-d773.json","https://opendata.rdw.nl/resource/vezc-m2t6.json","https://opendata.rdw.nl/resource/jhie-znh9.json","https://opendata.rdw.nl/resource/kmfi-hrps.json"
"FJ232G","Bromfiets","TRIUMPH","Knirps",,"20110112",,"N.v.t.",,"N.v.t.","N.v.t.","0",,,,,,,"19731231","20070531","Geen verstrekking in Open Data",,"Ja","45",,,,,,,"2",,,,,,"L1","e","e","tegen framebuis onder zadel",,,,,,,,"0.00",,"Nee","Nee",,"Nee",,,,,"Niet geregistreerd","NG","Ja",,"2011-01-12T00:00:00.000","1973-12-31T00:00:00.000","2007-05-31T00:00:00.000",,"0",,,,,,,,,,,,,,,,,,,,,,,,,,"https://opendata.rdw.nl/resource/3huj-srit.json","https://opendata.rdw.nl/resource/8ys7-d773.json","https://opendata.rdw.nl/resource/vezc-m2t6.json","https://opendata.rdw.nl/resource/jhie-znh9.json","https://opendata.rdw.nl/resource/kmfi-hrps.json"
"FL297N","Bromfiets","TRIUMPH","FIPS",,"20070920",,"N.v.t.",,"N.v.t.","N.v.t.","0","49","40",,"47",,,"19550630","20070920","Geen verstrekking in Open Data",,"Ja","25",,,,,,,"2",,,,,,"L1","e","e","l. op framebuis onder zadel",,,,,,,,"0.00","111","Nee","Nee",,"Nee",,,,,"Niet geregistreerd","NG","Ja",,"2007-09-20T00:00:00.000","1955-06-30T00:00:00.000","2007-09-20T00:00:00.000",,"0",,,,,,,,,,,,,,,,,,,,,,,,,,"https://opendata.rdw.nl/resource/3huj-srit.json","https://opendata.rdw.nl/resource/8ys7-d773.json","https://opendata.rdw.nl/resource/vezc-m2t6.json","https://opendata.rdw.nl/resource/jhie-znh9.json","https://opendata.rdw.nl/resource/kmfi-hrps.json"
