"kenteken","voertuigsoort","merk","handelsbenaming","vervaldatum_apk","datum_tenaamstelling","bruto_bpm","inrichting","aantal_zitplaatsen","eerste_kleur","tweede_kleur","aantal_cilinders","cilinderinhoud","massa_ledig_voertuig","toegestane_maximum_massa_voertuig","massa_rijklaar","maximum_massa_trekken_ongeremd","maximum_trekken_massa_geremd","datum_eerste_toelating","datum_eerste_tenaamstelling_in_nederland","wacht_op_keuren","catalogusprijs","wam_verzekerd","maximale_constructiesnelheid","laadvermogen","oplegger_geremd","aanhangwagen_autonoom_geremd","aanhangwagen_middenas_geremd","aantal_staanplaatsen","aantal_deuren","aantal_wielen","afstand_hart_koppeling_tot_achterzijde_voertuig","afstand_voorzijde_voertuig_tot_hart_koppeling","afwijkende_maximum_snelheid","lengte","breedte","europese_voertuigcategorie","europese_voertuigcategorie_toevoeging","europese_uitvoeringcategorie_toevoeging","plaats_chassisnummer","technische_max_massa_voertuig","type","type_gasinstallatie","typegoedkeuringsnummer","variant","uitvoering","volgnummer_wijziging_eu_typegoedkeuring","vermogen_massarijklaar","wielbasis","export_indicator","openstaande_terugroepactie_indicator","vervaldatum_tachograaf","taxi_indicator","maximum_massa_samenstelling","aantal_rolstoelplaatsen","maximum_ondersteunende_snelheid","jaar_laatste_registratie_tellerstand","tellerstandoordeel","code_toelichting_tellerstandoordeel","tenaamstellen_mogelijk","vervaldatum_apk_dt","datum_tenaamstelling_dt","datum_eerste_toelating_dt","datum_eerste_tenaamstelling_in_nederland_dt","vervaldatum_tachograaf_dt","maximum_last_onder_de_vooras_sen_tezamen_koppeling","type_remsysteem_voertuig_code","rupsonderstelconfiguratiecode","wielbasis_voertuig_minimum","wielbasis_voertuig_maximum","lengte_voertuig_minimum","lengte_voertuig_maximum","breedte_voertuig_minimum","breedte_voertuig_maximum","hoogte_voertuig","hoogte_voertuig_minimum","hoogte_voertuig_maximum","massa_bedrijfsklaar_minimaal","massa_bedrijfsklaar_maximaal","technisch_toelaatbaar_massa_koppelpunt","maximum_massa_technisch_maximaal","maximum_massa_technisch_minimaal","subcategorie_nederland","verticale_belasting_koppelpunt_getrokken_voertuig","zuinigheidsclassificatie","registratie_datum_goedkeuring_afschrijvingsmoment_bpm","registratie_datum_goedkeuring_afschrijvingsmoment_bpm_dt","gem_lading_wrde","aerodyn_voorz","massa_alt_aandr","verl_cab_ind","api_gekentekende_voertuigen_assen","api_gekentekende_voertuigen_brandstof","api_gekentekende_voertuigen_carrosserie","api_gekentekende_voertuigen_carrosserie_specifiek","api_gekentekende_voertuigen_voertuigklasse"
"28BHGR","Bedrijfsauto","LAND ROVER","DEFENDER 110 TD5 HCPU","20240729","20210709",,"huifopbouw","3","N.v.t.","N.v.t.","5","2495","1816","3050","1916","750",,"20030220","20210709","Geen verstrekking in Open Data",,"Ja",,"1234",,"3500","3500",,,"4",,,,,"179","N1",,,,"3050",,,,,,,"0.05","280","Nee","Nee",,"Nee","6550",,,"2023","Geen oordeel","05","Ja","2024-07-29T00:00:00.000","2021-07-09T00:00:00.000","2003-02-20T00:00:00.000","2021-07-09T00:00:00.000",,,,,,,,,,,,,,,,,,,,,,,,,,,,"https://opendata.rdw.nl/resource/3huj-srit.json","https://opendata.rdw.nl/resource/8ys7-d773.json","https://opendata.rdw.nl/resource/vezc-m2t6.json","https://opendata.rdw.nl/resource/jhie-znh9.json","https://opendata.rdw.nl/resource/kmfi-hrps.json"
"2VHG78","Bedrijfsauto","LAND ROVER","DEFENDER 90 SOFT TOP 500","20241123","20151121","9807","huifopbouw","2","N.v.t.","N.v.t.","4","2402","1685","2185","1785","750",,"20100415","20100415","Geen verstrekking in Open Data","39900","Ja",,"500",,"3500","3500",,"0","4","0","0",,"0","179","N1",,,"tegen r. balk v. vooras","2185",,,,,,"0","0.05","236","Nee","Nee",,"Nee","5900",,,"2023","Logisch","00","Ja","2024-11-23T00:00:00.000","2015-11-21T00:00:00.000","2010-04-15T00:00:00.000","2010-04-15T00:00:00.000",,"0",,,,,,,,,,,,,,,,,,,,,,,,,,"https://opendata.rdw.nl/resource/3huj-srit.json","https://opendata.rdw.nl/resource/8ys7-d773.json","https://opendata.rdw.nl/resource/vezc-m2t6.json","https://opendata.rdw.nl/resource/jhie-znh9.json","https://opendata.rdw.nl/resource/kmfi-hrps.json"
"43VJSF","Bedrijfsauto","LAND ROVER","DEFENDER 130 TD5 CREW CAB","20241130","20181030",,"huifopbouw","5","N.v.t.","N.v.t.","5","2495","1944","3050","2044","750","3500","19990908","19990908","Geen verstrekking in Open Data",,"Ja",,"1106",,"3500","3500",,"0","4","0","0",,"0","179","N1",,,"r. balk a. vooras","3050",,,,,,"0","0.04","328","Nee","Nee",,"Nee","7050",,,"2023","Logisch","00","Ja","2024-11-30T00:00:00.000","2018-10-30T00:00:00.000","1999-09-08T00:00:00.000","1999-09-08T00:00:00.000",,"0",,,,,,,,,,,,,,,,,,,,,,,,,,"https://opendata.rdw.nl/resource/3huj-srit.json","https://opendata.rdw.nl/resource/8ys7-d773.json","https://opendata.rdw.nl/resource/vezc-m2t6.json","https://opendata.rdw.nl/resource/jhie-znh9.json","https://opendata.rdw.nl/resource/kmfi-hrps.json"
"58VXHN","Bedrijfsauto","LAND ROVER","DEFENDER 130 TD5 CREW CAB","20250513","20150724",,"huifopbouw","6","N.v.t.","N.v.t.","5","2495","1944","3050","2044","750","3500","20010704","20010704","Geen verstrekking in Open Data",,"Ja",,"1106",,,,,"0","4","0","0",,"0","179","N1",,,"r. balk v. achteras","3050",,,,,,"0","0.04","328","Nee","Nee",,"Nee","7050",,,"2024","Logisch","00","Ja","2025-05-13T00:00:00.000","2015-07-24T00:00:00.000","2001-07-04T00:00:00.000","2001-07-04T00:00:00.000",,"0",,,,,,,,,,,,,,,,,,,,,,,,,,"https://opendata.rdw.nl/resource/3huj-srit.json","https://opendata.rdw.nl/resource/8ys7-d773.json","https://opendata.rdw.nl/resource/vezc-m2t6.json","https://opendata.rdw.nl/resource/jhie-znh9.json","https://opendata.rdw.nl/resource/kmfi-hrps.json"
"5VTZ81","Bedrijfsauto","LAND ROVER","DEFENDER","20250313","20210517","13132","huifopbouw","5","N.v.t.","N.v.t.","4","2402","2162","3380","2262","750",,"20120327","20120327","Geen verstrekking in Open Data","53772","Ja",,"1218",,"3500","3500",,"0","4","0","0",,"0","179","N1",,,"r. balk v. vooras","3380","LD",,"e11*2007/46*0133*01","Z4EE2F","B5R1","0","0.04","323","Nee","Nee",,"Nee","6880","0",,"2024","Logisch","00","Ja","2025-03-13T00:00:00.000","2021-05-17T00:00:00.000","2012-03-27T00:00:00.000","2012-03-27T00:00:00.000",,"0",,,,,,,,,,,,,,,,,,,,,,,,,,"https://opendata.rdw.nl/resource/3huj-srit.json","https://opendata.rdw.nl/resource/8ys7-d773.json","https://opendata.rdw.nl/resource/vezc-m2t6.json","https://opendata.rdw.nl/resource/jhie-znh9.json","https://opendata.rdw.nl/resource/kmfi-hrps.json"
"63BTJF","Bedrijfsauto","LAND ROVER","DEFENDER 130 TD5 CREW CAB HCPU / DV","20241013","20180815",,"huifopbouw","5","N.v.t.","N.v.t.","5","2495","2011","3500","2111","750",,"20050603","20050603","Geen verstrekking in Open Data",,"Ja",,"1489",,"3500","3500",,"0","4","0","0",,"0","179","N1",,,"r. balk a. vooras","3500",,,,,,"0","0.04","325","Nee","Nee",,"Nee","7000",,,"2023","Logisch","00","Ja","2024-10-13T00:00:00.000","2018-08-15T00:00:00.000","2005-06-03T00:00:00.000","2005-06-03T00:00:00.000",,"0",,,,,,,,,,,,,,,,,,,,,,,,,,"https://opendata.rdw.nl/resource/3huj-srit.json","https://opendata.rdw.nl/resource/8ys7-d773.json","https://opendata.rdw.nl/resource/vezc-m2t6.json","https://opendata.rdw.nl/resource/jhie-znh9.json","https://opendata.rdw.nl/resource/kmfi-hrps.json"
"95VLL4","Bedrijfsauto","LAND ROVER","DEFENDER 130 CREW CAB","20250102","20080102","15438","huifopbouw","5","N.v.t.","N.v.t.","4","2402","1990","3500","2090","750",,"20080102","20080102","Geen verstrekking in Open Data",,"Ja",,"1510",,"3500","3500",,"4","4",,,,,"179","N1",,,"tegen r. balk v. vooras","3500",,,,,,,"0.04","328","Nee","Nee",,"Nee","7000",,,"2024","Onlogisch","04","Ja","2025-01-02T00:00:00.000","2008-01-02T00:00:00.000","2008-01-02T00:00:00.000","2008-01-02T00:00:00.000",,,,,,,,,,,,,,,,,,,,,,"20240306","2024-03-06T00:00:00.000",,,,,"https://opendata.rdw.nl/resource/3huj-srit.json","https://opendata.rdw.nl/resource/8ys7-d773.json","https://opendata.rdw.nl/resource/vezc-m2t6.json","https://opendata.rdw.nl/resource/jhie-znh9.json","https://opendata.rdw.nl/resource/kmfi-hrps.json"
"V039ZB","Bedrijfsauto","LAND ROVER","DEFENDER","20250417","20200527","11418","huifopbouw","5","N.v.t.","N.v.t.","4","2402","2031","3380","2131","750",,"20110826","20191010","Geen verstrekking in Open Data","46599","Ja",,"1349",,,"3500",,"0","4","0","0",,"0","179","N1",,,"r. balk v. vooras","3380","LD",,"e11*2007/46*0133*01","Z4EE2F","B5R1","0","0.04","323","Nee","Ja",,"Nee","6880","0",,"2024","Geen oordeel","05","Ja","2025-04-17T00:00:00.000","2020-05-27T00:00:00.000","2011-08-26T00:00:00.000","2019-10-10T00:00:00.000",,"0",,,,,,,,,,,,,,,,,,,,,,,,,,"https://opendata.rdw.nl/resource/3huj-srit.json","https://opendata.rdw.nl/resource/8ys7-d773.json","https://opendata.rdw.nl/resource/vezc-m2t6.json","https://opendata.rdw.nl/resource/jhie-znh9.json","https://opendata.rdw.nl/resource/kmfi-hrps.json"
"V272FN","Bedrijfsauto","LAND ROVER","DEFENDER 110C","20250503","20170323",,"huifopbouw","5","N.v.t.","N.v.t.","5","2495","1900","3050","2000",,,"20011219","20170323","Geen verstrekking in Open Data",,"Ja",,"1150",,,"3500",,,"4",,,,,"163","N1",,,"tegen r. balk 125 cm v. achteras","3050",,,,,,,"0.05","282","Nee","Nee",,"Nee","6550",,,"2024","Geen oordeel","05","Ja","2025-05-03T00:00:00.000","2017-03-23T00:00:00.000","2001-12-19T00:00:00.000","2017-03-23T00:00:00.000",,"0",,,,,,,,,,,,,,,,,,,,,,,,,,"https://opendata.rdw.nl/resource/3huj-srit.json","https://opendata.rdw.nl/resource/8ys7-d773.json","https://opendata.rdw.nl/resource/vezc-m2t6.json","https://opendata.rdw.nl/resource/jhie-znh9.json","https://opendata.rdw.nl/resource/kmfi-hrps.json"
"V424LP","Bedrijfsauto","LAND ROVER","DEFENDER 130 CREW CAB HCPU","20030510",,,"huifopbouw","5","N.v.t.","N.v.t.","5","2495","1942","3500","2042","750",,"20000510",,"Geen verstrekking in Open Data",,"Nee",,"1558",,"3500","3500",,,"4",,,,,"180","N1",,,"r. balk v. vooras","3500","LD/130CC",,,,,,"0.04","323","Nee","Nee",,"Nee","7000",,,"2018","Geen oordeel","05","Ja","2003-05-10T00:00:00.000",,"2000-05-10T00:00:00.000",,,"0",,,,,,,,,,,,,,,,,,,,,,,,,,"https://opendata.rdw.nl/resource/3huj-srit.json","https://opendata.rdw.nl/resource/8ys7-d773.json","https://opendata.rdw.nl/resource/vezc-m2t6.json","https://opendata.rdw.nl/resource/jhie-znh9.json","https://opendata.rdw.nl/resource/kmfi-hrps.json"
"V567DR","Bedrijfsauto","LAND ROVER","DEFENDER 130","20240831","20170125","13698","huifopbouw","5","N.v.t.","N.v.t.","5","2495","2017","3500","2117","750",,"20050829","20170125","Geen verstrekking in Open Data",,"Ja",,"1483",,"3500","3500",,,"4",,,,,"179","N1",,,"r. balk v. vooras","3500",,,,,,,"0.05","324","Nee","Nee",,"Nee","7000",,,"2024","Geen oordeel","05","Ja","2024-08-31T00:00:00.000","2017-01-25T00:00:00.000","2005-08-29T00:00:00.000","2017-01-25T00:00:00.000",,,,,,,,,,,,,,,,,,,,,,,,,,,,"https://opendata.rdw.nl/resource/3huj-srit.json","https://opendata.rdw.nl/resource/8ys7-d773.json","https://opendata.rdw.nl/resource/vezc-m2t6.json","https://opendata.rdw.nl/resource/jhie-znh9.json","https://opendata.rdw.nl/resource/kmfi-hrps.json"
"V600SR","Bedrijfsauto","LAND ROVER","DEFENDER","20201017","20190320","12755","huifopbouw","2","N.v.t.","N.v.t.","4","2198","1656","2505","1756","750",,"20131126","20181015","Geen verstrekking in Open Data","52818","Ja",,"849",,"3500","3500",,"0","4","0","0",,"0","179","N1",,,"r. balk v. vooras","2505","LD",,"e11*2007/46*0133*06","R2NE2F","B2H1","0","0.05","236","Nee","Nee",,"Nee","6005","0",,"2019","Geen oordeel","05","Ja","2020-10-17T00:00:00.000","2019-03-20T00:00:00.000","2013-11-26T00:00:00.000","2018-10-15T00:00:00.000",,"0",,,,,,,,,,,,,,,,,,,,,,,,,,"https://opendata.rdw.nl/resource/3huj-srit.json","https://opendata.rdw.nl/resource/8ys7-d773.json","https://opendata.rdw.nl/resource/vezc-m2t6.json","https://opendata.rdw.nl/resource/jhie-znh9.json","https://opendata.rdw.nl/resource/kmfi-hrps.json"
"VB539V","Bedrijfsauto","LAND ROVER","DEFENDER","20241018","20150603","11745","huifopbouw","2","N.v.t.","N.v.t.","4","2198","1690","2505","1790","750",,"20131018","20131018","Geen verstrekking in Open Data","39155","Ja",,"815",,"3500","3500",,,"4",,,,,"179","N1",,,"r. balk v. vooras","2505","LD",,,,,,"0.05","236","Nee","Nee",,"Nee","6005",,,"2023","Logisch","00","Ja","2024-10-18T00:00:00.000","2015-06-03T00:00:00.000","2013-10-18T00:00:00.000","2013-10-18T00:00:00.000",,"0",,,,,,,,,,,,,,,,,,,,,,,,,,"https://opendata.rdw.nl/resource/3huj-srit.json","https://opendata.rdw.nl/resource/8ys7-d773.json","https://opendata.rdw.nl/resource/vezc-m2t6.json","https://opendata.rdw.nl/resource/jhie-znh9.json","https://opendata.rdw.nl/resource/kmfi-hrps.json"
"VB540V","Bedrijfsauto","LAND ROVER","DEFENDER","20250125","20220119","10478","huifopbouw","2","N.v.t.","N.v.t.","4","2198","1690","2505","1790","750",,"20130322","20130322","Geen verstrekking in Open Data","39155","Ja",,"815",,"3500","3500",,,"4",,,,,"179","N1",,,"r. balk v. vooras","2505","LD",,,,,,"0.05","236","Nee","Nee",,"Nee","6005",,,"2024","Logisch","00","Ja","2025-01-25T00:00:00.000","2022-01-19T00:00:00.000","2013-03-22T00:00:00.000","2013-03-22T00:00:00.000",,"0",,,,,,,,,,,,,,,,,,,,,,,,,,"https://opendata.rdw.nl/resource/3huj-srit.json","https://opendata.rdw.nl/resource/8ys7-d773.json","https://opendata.rdw.nl/resource/vezc-m2t6.json","https://opendata.rdw.nl/resource/jhie-znh9.json","https://opendata.rdw.nl/resource/kmfi-hrps.json"
"VB579X","Bedrijfsauto","LAND ROVER","DEFENDER","20240731","20230801","11748","huifopbouw","2","N.v.t.","N.v.t.","4","2198","1690","2505","1790","750",,"20130405","20130405","Geen verstrekking in Open Data","39155","Ja",,"815",,"3500","3500",,,"4",,,,,"179","N1",,,"r. balk v. vooras","2505","LD",,,,,,"0.05","236","Nee","Nee",,"Nee","6005",,,"2023","Logisch","00","Ja","2024-07-31T00:00:00.000","2023-08-01T00:00:00.000","2013-04-05T00:00:00.000","2013-04-05T00:00:00.000",,"0",,,,,,,,,,,,,,,,,,,,,,,,,,"https://opendata.rdw.nl/resource/3huj-srit.json","https://opendata.rdw.nl/resource/8ys7-d773.json","https://opendata.rdw.nl/resource/vezc-m2t6.json","https://opendata.rdw.nl/resource/jhie-znh9.json","https://opendata.rdw.nl/resource/kmfi-hrps.json"
"VBT95Z","Bedrijfsauto","LAND ROVER","90 DEFENDER","20241029","20190913","9924","huifopbouw","2","N.v.t.","N.v.t.","4","2402","2100","2400","2200","750",,"20081110","20190906","Geen verstrekking in Open Data",,"Ja",,"300",,"3500","3500",,,"4",,,,,"188","N1",,,,"2400","LD",,,,,,"0.04","236","Nee","Nee",,"Nee","5900",,,"2023","Geen oordeel","05","Ja","2024-10-29T00:00:00.000","2019-09-13T00:00:00.000","2008-11-10T00:00:00.000","2019-09-06T00:00:00.000",,"0",,,,,,,,,,,,,,,,,,,,,,,,,,"https://opendata.rdw.nl/resource/3huj-srit.json","https://opendata.rdw.nl/resource/8ys7-d773.json","https://opendata.rdw.nl/resource/vezc-m2t6.json","https://opendata.rdw.nl/resource/jhie-znh9.json","https://opendata.rdw.nl/resource/kmfi-hrps.json"
"VF479K","Bedrijfsauto","LAND ROVER","DEFENDER","20240616","20160604","11013","huifopbouw","2","N.v.t.","N.v.t.","4","2198","1700","2200","1800","750",,"20130821","20130821","Geen verstrekking in Open Data","45486","Ja",,"500",,"3500","3500",,,"4",,,,,"179","N1",,,"r. balk v. vooras","2505","LD",,,,,,"0.05","236","Nee","Nee",,"Nee","6005",,,"2023","Logisch","00","Ja","2024-06-16T00:00:00.000","2016-06-04T00:00:00.000","2013-08-21T00:00:00.000","2013-08-21T00:00:00.000",,"0",,,,,,,,,,,,,,,,,,,,,,,,,,"https://opendata.rdw.nl/resource/3huj-srit.json","https://opendata.rdw.nl/resource/8ys7-d773.json","https://opendata.rdw.nl/resource/vezc-m2t6.json","https://opendata.rdw.nl/resource/jhie-znh9.json","https://opendata.rdw.nl/resource/kmfi-hrps.json"
"VG486H","Bedrijfsauto","LAND ROVER","DEFENDER","20240803","20230316","11511","huifopbouw","2","N.v.t.","N.v.t.","4","2198","1650","2505","1750","750",,"20140627","20140627","Geen verstrekking in Open Data","47581","Ja",,"855",,,"3500",,,"4",,,,,"179","N1",,,"r. balk v. vooras","2505","LD",,,,,,"0.05","236","Nee","Nee",,"Nee","6005",,,"2023","Logisch","00","Ja","2024-08-03T00:00:00.000","2023-03-16T00:00:00.000","2014-06-27T00:00:00.000","2014-06-27T00:00:00.000",,"0",,,,,,,,,,,,,,,,,,,,,,,,,,"https://opendata.rdw.nl/resource/3huj-srit.json","https://opendata.rdw.nl/resource/8ys7-d773.json","https://opendata.rdw.nl/resource/vezc-m2t6.json","https://opendata.rdw.nl/resource/jhie-znh9.json","https://opendata.rdw.nl/resource/kmfi-hrps.json"
"VG723B","Bedrijfsauto","LAND ROVER","DEFENDER","20241220","20231221","10776","huifopbouw","2","N.v.t.","N.v.t.","4","2198","1690","2505","1790","750",,"20131107","20131107","Geen verstrekking in Open Data","44487","Ja",,"815",,"3500","3500",,,"4",,,,,"179","N1",,,"r. balk v. vooras","2505","LD",,,,,,"0.05","236","Nee","Nee",,"Nee","6005",,,"2023","Logisch","00","Ja","2024-12-20T00:00:00.000","2023-12-21T00:00:00.000","2013-11-07T00:00:00.000","2013-11-07T00:00:00.000",,"0",,,,,,,,,,,,,,,,,,,,,,,,,,"https://opendata.rdw.nl/resource/3huj-srit.json","https://opendata.rdw.nl/resource/8ys7-d773.json","https://opendata.rdw.nl/resource/vezc-m2t6.json","https://opendata.rdw.nl/resource/jhie-znh9.json","https://opendata.rdw.nl/resource/kmfi-hrps.json"
"VG842F","Bedrijfsauto","LAND ROVER","DEFENDER","20241110","20221221","13765","huifopbouw","5","N.v.t.","N.v.t.","4","2198","2060","3380","2160","750",,"20140325","20140325","Geen verstrekking in Open Data","57071","Ja",,"1320",,"3500","3500",,,"4",,,,,"179","N1",,,"r. balk v. vooras","3380","LD",,,,,,"0.04","323","Nee","Nee",,"Nee","6880",,,"2023","Logisch","00","Ja","2024-11-10T00:00:00.000","2022-12-21T00:00:00.000","2014-03-25T00:00:00.000","2014-03-25T00:00:00.000",,"0",,,,,,,,,,,,,,,,,,,,,,,,,,"https://opendata.rdw.nl/resource/3huj-srit.json","https://opendata.rdw.nl/resource/8ys7-d773.json","https://opendata.rdw.nl/resource/vezc-m2t6.json","https://opendata.rdw.nl/resource/jhie-znh9.json","https://opendata.rdw.nl/resource/kmfi-hrps.json"
"VG921Z","Bedrijfsauto","LAND ROVER","DEFENDER","20240808","20180517",,"huifopbouw","5","N.v.t.","N.v.t.","5","2495","2070","3050","2170","750",,"20010703","20140130","Geen verstrekking in Open Data",,"Ja",,"980",,"3500","3500",,,"4",,,,,"179","N1",,,"r. balk v. vooras","3050","LD",,,,,,"0.04","280","Nee","Nee",,"Nee",,,,"2023","Geen oordeel","05","Ja","2024-08-08T00:00:00.000","2018-05-17T00:00:00.000","2001-07-03T00:00:00.000","2014-01-30T00:00:00.000",,"0",,,,,,,,,,,,,,,,,,,,,,,,,,"https://opendata.rdw.nl/resource/3huj-srit.json","https://opendata.rdw.nl/resource/8ys7-d773.json","https://opendata.rdw.nl/resource/vezc-m2t6.json","https://opendata.rdw.nl/resource/jhie-znh9.json","https://opendata.rdw.nl/resource/kmfi-hrps.json"
"VH789G","Bedrijfsauto","LAND ROVER","DEFENDER","20241025","20210317","12582","huifopbouw","2","N.v.t.","N.v.t.","4","2198","1700","2505","1800","750",,"20140303","20140303","Geen verstrekking in Open Data","52088","Ja",,"805",,,"3500",,,"4",,,,,"179","N1",,,"r. balk v. vooras","2505","LD",,,,,,"0.05","236","Nee","Nee",,"Nee","6005",,,"2023","Logisch","00","Ja","2024-10-25T00:00:00.000","2021-03-17T00:00:00.000","2014-03-03T00:00:00.000","2014-03-03T00:00:00.000",,"0",,,,,,,,,,,,,,,,,,,,,,,,,,"https://opendata.rdw.nl/resource/3huj-srit.json","https://opendata.rdw.nl/resource/8ys7-d773.json","https://opendata.rdw.nl/resource/vezc-m2t6.json","https://opendata.rdw.nl/resource/jhie-znh9.json","https://opendata.rdw.nl/resource/kmfi-hrps.json"
"VH791G","Bedrijfsauto","LAND ROVER","DEFENDER","20241126","20191125","13087","huifopbouw","2","N.v.t.","N.v.t.","4","2198","1700","2505","1800","750",,"20140501","20140501","Geen verstrekking in Open Data","54214","Ja",,"805",,,"3500",,,"4",,,,,"179","N1",,,"r. balk v. vooras","2505","LD",,,,,,"0.05","236","Nee","Nee",,"Nee","6005",,,"2023","Logisch","00","Ja","2024-11-26T00:00:00.000","2019-11-25T00:00:00.000","2014-05-01T00:00:00.000","2014-05-01T00:00:00.000",,"0",,,,,,,,,,,,,,,,,,,,,,,,,,"https://opendata.rdw.nl/resource/3huj-srit.json","https://opendata.rdw.nl/resource/8ys7-d773.json","https://opendata.rdw.nl/resource/vezc-m2t6.json","https://opendata.rdw.nl/resource/jhie-znh9.json","https://opendata.rdw.nl/resource/kmfi-hrps.json"
"VJ014K","Bedrijfsauto","LAND ROVER","DEFENDER","20241229","20221229","13954","huifopbouw","5","N.v.t.","N.v.t.","4","2198","2174","3380","2274",,,"20140606","20140606","Geen verstrekking in Open Data","43911","Ja",,"1206",,,,,,"4",,,,,"179","N1",,,,"3380","LD",,,,,,"0.04","323","Nee","Nee",,"Nee",,,,"2023","Logisch","00","Ja","2024-12-29T00:00:00.000","2022-12-29T00:00:00.000","2014-06-06T00:00:00.000","2014-06-06T00:00:00.000",,,,,,,,,,,,,,,,,,,,,,"20230426","2023-04-26T00:00:00.000",,,,,"https://opendata.rdw.nl/resource/3huj-srit.json","https://opendata.rdw.nl/resource/8ys7-d773.json","https://opendata.rdw.nl/resource/vezc-m2t6.json","https://opendata.rdw.nl/resource/jhie-znh9.json","https://opendata.rdw.nl/resource/kmfi-hrps.json"
"VJ152V","Bedrijfsauto","LAND ROVER","DEFENDER","20250424","20230301","13098","huifopbouw","2","N.v.t.","N.v.t.","4","2198","1745","2505","1845","750",,"20150424","20150424","Geen verstrekking in Open Data","54263","Ja",,"760",,,"3500",,,"4",,,,,"179","N1",,,"r. balk v. vooras","2505","LD",,,,,,"0.05","236","Nee","Nee",,"Nee","6005",,,"2024","Logisch","00","Ja","2025-04-24T00:00:00.000","2023-03-01T00:00:00.000","2015-04-24T00:00:00.000","2015-04-24T00:00:00.000",,"0",,,,,,,,,,,,,,,,,,,,,,,,,,"https://opendata.rdw.nl/resource/3huj-srit.json","https://opendata.rdw.nl/resource/8ys7-d773.json","https://opendata.rdw.nl/resource/vezc-m2t6.json","https://opendata.rdw.nl/resource/jhie-znh9.json","https://opendata.rdw.nl/resource/kmfi-hrps.json"
"VJ535S","Bedrijfsauto","LAND ROVER","DEFENDER","20250416","20211213","14312","huifopbouw","5","N.v.t.","N.v.t.","4","2198","2080","3380","2180","750",,"20150321","20150321","Geen verstrekking in Open Data","59373","Ja",,"1300",,,"3500",,,"4",,,,,"179","N1",,,"r. balk v. vooras","3380","LD",,,,,,"0.04","323","Nee","Nee",,"Nee",,,,"2024","Logisch","00","Ja","2025-04-16T00:00:00.000","2021-12-13T00:00:00.000","2015-03-21T00:00:00.000","2015-03-21T00:00:00.000",,"0",,,,,,,,,,,,,,,,,,,,,,,,,,"https://opendata.rdw.nl/resource/3huj-srit.json","https://opendata.rdw.nl/resource/8ys7-d773.json","https://opendata.rdw.nl/resource/vezc-m2t6.json","https://opendata.rdw.nl/resource/jhie-znh9.json","https://opendata.rdw.nl/resource/kmfi-hrps.json"
"VK337L","Bedrijfsauto","LAND ROVER","DEFENDER","20250103","20151116","12506","huifopbouw","2","N.v.t.","N.v.t.","4","2198","1730","2505","1830","750",,"20150102","20150102","Geen verstrekking in Open Data","51771","Ja",,"775",,,"3500",,,"4",,,,,"179","N1",,,"r. balk v. vooras","2505","LD",,,,,,"0.05","236","Nee","Nee",,"Nee","6005",,,"2023","Logisch","00","Ja","2025-01-03T00:00:00.000","2015-11-16T00:00:00.000","2015-01-02T00:00:00.000","2015-01-02T00:00:00.000",,"0",,,,,,,,,,,,,,,,,,,,,,,,,,"https://opendata.rdw.nl/resource/3huj-srit.json","https://opendata.rdw.nl/resource/8ys7-d773.json","https://opendata.rdw.nl/resource/vezc-m2t6.json","https://opendata.rdw.nl/resource/jhie-znh9.json","https://opendata.rdw.nl/resource/kmfi-hrps.json"
"VK803S","Bedrijfsauto","LAND ROVER","DEFENDER","20230527","20230315","11469","huifopbouw","2","N.v.t.","N.v.t.","4","2198","1647","2505","1747","750",,"20150403","20150403","Geen verstrekking in Open Data","47406","Ja",,"858",,,"3500",,,"4",,,,,"179","N1",,,"r. balk v. vooras","2505","LD",,,,,,"0.05","236","Nee","Nee",,"Nee","6005",,,"2022","Logisch","00","Ja","2023-05-27T00:00:00.000","2023-03-15T00:00:00.000","2015-04-03T00:00:00.000","2015-04-03T00:00:00.000",,"0",,,,,,,,,,,,,,,,,,,,,,,,,,"https://opendata.rdw.nl/resource/3huj-srit.json","https://opendata.rdw.nl/resource/8ys7-d773.json","https://opendata.rdw.nl/resource/vezc-m2t6.json","https://opendata.rdw.nl/resource/jhie-znh9.json","https://opendata.rdw.nl/resource/kmfi-hrps.json"