"kenteken","voertuigsoort","merk","handelsbenaming","vervaldatum_apk","datum_tenaamstelling","bruto_bpm","inrichting","aantal_zitplaatsen","eerste_kleur","tweede_kleur","aantal_cilinders","cilinderinhoud","massa_ledig_voertuig","toegestane_maximum_massa_voertuig","massa_rijklaar","maximum_massa_trekken_ongeremd","maximum_trekken_massa_geremd","datum_eerste_toelating","datum_eerste_tenaamstelling_in_nederland","wacht_op_keuren","catalogusprijs","wam_verzekerd","maximale_constructiesnelheid","laadvermogen","oplegger_geremd","aanhangwagen_autonoom_geremd","aanhangwagen_middenas_geremd","aantal_staanplaatsen","aantal_deuren","aantal_wielen","afstand_hart_koppeling_tot_achterzijde_voertuig","afstand_voorzijde_voertuig_tot_hart_koppeling","afwijkende_maximum_snelheid","lengte","breedte","europese_voertuigcategorie","europese_voertuigcategorie_toevoeging","europese_uitvoeringcategorie_toevoeging","plaats_chassisnummer","technische_max_massa_voertuig","type","type_gasinstallatie","typegoedkeuringsnummer","variant","uitvoering","volgnummer_wijziging_eu_typegoedkeuring","vermogen_massarijklaar","wielbasis","export_indicator","openstaande_terugroepactie_indicator","vervaldatum_tachograaf","taxi_indicator","maximum_massa_samenstelling","aantal_rolstoelplaatsen","maximum_ondersteunende_snelheid","jaar_laatste_registratie_tellerstand","tellerstandoordeel","code_toelichting_tellerstandoordeel","tenaamstellen_mogelijk","vervaldatum_apk_dt","datum_tenaamstelling_dt","datum_eerste_toelating_dt","datum_eerste_tenaamstelling_in_nederland_dt","vervaldatum_tachograaf_dt","maximum_last_onder_de_vooras_sen_tezamen_koppeling","type_remsysteem_voertuig_code","rupsonderstelconfiguratiecode","wielbasis_voertuig_minimum","wielbasis_voertuig_maximum","lengte_voertuig_minimum","lengte_voertuig_maximum","breedte_voertuig_minimum","breedte_voertuig_maximum","hoogte_voertuig","hoogte_voertuig_minimum","hoogte_voertuig_maximum","massa_bedrijfsklaar_minimaal","massa_bedrijfsklaar_maximaal","technisch_toelaatbaar_massa_koppelpunt","maximum_massa_technisch_maximaal","maximum_massa_technisch_minimaal","subcategorie_nederland","verticale_belasting_koppelpunt_getrokken_voertuig","zuinigheidsclassificatie","registratie_datum_goedkeuring_afschrijvingsmoment_bpm","registratie_datum_goedkeuring_afschrijvingsmoment_bpm_dt","gem_lading_wrde","aerodyn_voorz","massa_alt_aandr","verl_cab_ind","api_gekentekende_voertuigen_assen","api_gekentekende_voertuigen_brandstof","api_gekentekende_voertuigen_carrosserie","api_gekentekende_voertuigen_carrosserie_specifiek","api_gekentekende_voertuigen_voertuigklasse"
"V674VZ","Bedrijfsauto","JAGUAR LAND ROVER","DEFENDER","20240324","20190302","12450","gesloten opbouw","2","N.v.t.","N.v.t.","4","2198","1985","3050","2085","750",,"20130906","20190302","Geen verstrekking in Open Data","51533","Nee",,"1065",,,"3500",,,"4",,,,,"179","N1",,,"r. balk v. vooras","3050",,,,,,,"0.04","279","Nee","Nee",,"Nee","6550",,,"2023","Geen oordeel","05","Ja","2024-03-24T00:00:00.000","2019-03-02T00:00:00.000","2013-09-06T00:00:00.000","2019-03-02T00:00:00.000",,"0",,,,,,,,,,,,,,,,,,,,,,,,,,"https://opendata.rdw.nl/resource/3huj-srit.json","https://opendata.rdw.nl/resource/8ys7-d773.json","https://opendata.rdw.nl/resource/vezc-m2t6.json","https://opendata.rdw.nl/resource/jhie-znh9.json","https://opendata.rdw.nl/resource/kmfi-hrps.json"
"V77DKD","Bedrijfsauto","JAGUAR LAND ROVER","DEFENDER","20260301","20240215","26683","gesloten opbouw","2","N.v.t.","N.v.t.","6","2997","2394","3280","2494","750","3500","20230301","20240215","Geen verstrekking in Open Data","111449","Ja","191","886",,,"3500",,"5","4",,,,"476","200","N1",,,,"3280","LE",,,,,,"0.00","302","Nee","Nee",,"Nee","6780",,,"2024","Geen oordeel","05","Ja","2026-03-01T00:00:00.000","2024-02-15T00:00:00.000","2023-03-01T00:00:00.000","2024-02-15T00:00:00.000",,,,,,,,,,,"192",,,,,,,,,,,"20240209","2024-02-09T00:00:00.000",,,,,"https://opendata.rdw.nl/resource/3huj-srit.json","https://opendata.rdw.nl/resource/8ys7-d773.json","https://opendata.rdw.nl/resource/vezc-m2t6.json","https://opendata.rdw.nl/resource/jhie-znh9.json","https://opendata.rdw.nl/resource/kmfi-hrps.json"
"V83DBP","Bedrijfsauto","JAGUAR LAND ROVER","DEFENDER","20260530","20240116","30690","gesloten opbouw","2","N.v.t.","N.v.t.","6","2997","2352","3200","2452","750","3500","20230530","20240116","Geen verstrekking in Open Data","128316","Ja","191","848",,"3500","3500",,"5","4",,,,"476","200","N1",,,,"3200","LE",,,,,,"0.09","302","Nee","Nee",,"Nee","6700",,,"2024","Geen oordeel","05","Ja","2026-05-30T00:00:00.000","2024-01-16T00:00:00.000","2023-05-30T00:00:00.000","2024-01-16T00:00:00.000",,,,,,,,,,,"200",,,,,,,,,,,"20240110","2024-01-10T00:00:00.000",,,,,"https://opendata.rdw.nl/resource/3huj-srit.json","https://opendata.rdw.nl/resource/8ys7-d773.json","https://opendata.rdw.nl/resource/vezc-m2t6.json","https://opendata.rdw.nl/resource/jhie-znh9.json","https://opendata.rdw.nl/resource/kmfi-hrps.json"
"VB053R","Bedrijfsauto","JAGUAR LAND ROVER","DEFENDER","20241011","20230203","13177","gesloten opbouw","2","N.v.t.","N.v.t.","4","2198","1850","3050","1950","750",,"20130321","20130321","Geen verstrekking in Open Data","54596","Ja",,"1200",,"3500","3500",,,"4",,,,,"179","N1",,,"r. balk v. vooras","3050","LD",,,,,,"0.05","279","Nee","Nee",,"Nee","6550",,,"2023","Logisch","00","Ja","2024-10-11T00:00:00.000","2023-02-03T00:00:00.000","2013-03-21T00:00:00.000","2013-03-21T00:00:00.000",,"0",,,,,,,,,,,,,,,,,,,,,,,,,,"https://opendata.rdw.nl/resource/3huj-srit.json","https://opendata.rdw.nl/resource/8ys7-d773.json","https://opendata.rdw.nl/resource/vezc-m2t6.json","https://opendata.rdw.nl/resource/jhie-znh9.json","https://opendata.rdw.nl/resource/kmfi-hrps.json"
"VB054R","Bedrijfsauto","JAGUAR LAND ROVER","DEFENDER","20240106","20220922","12838","gesloten opbouw","2","N.v.t.","N.v.t.","4","2198","1850","3050","1950","750",,"20130321","20130321","Geen verstrekking in Open Data","53167","Ja",,"1200",,"3500","3500",,,"4",,,,,"179","N1",,,"r. balk v. vooras","3050","LD",,,,,,"0.05","279","Nee","Nee",,"Nee","6550",,,"2023","Logisch","00","Ja","2024-01-06T00:00:00.000","2022-09-22T00:00:00.000","2013-03-21T00:00:00.000","2013-03-21T00:00:00.000",,"0",,,,,,,,,,,,,,,,,,,,,,,,,,"https://opendata.rdw.nl/resource/3huj-srit.json","https://opendata.rdw.nl/resource/8ys7-d773.json","https://opendata.rdw.nl/resource/vezc-m2t6.json","https://opendata.rdw.nl/resource/jhie-znh9.json","https://opendata.rdw.nl/resource/kmfi-hrps.json"
"VB055R","Bedrijfsauto","JAGUAR LAND ROVER","DEFENDER","20250129","20240203","13177","gesloten opbouw","2","N.v.t.","N.v.t.","4","2198","1850","3050","1950","750",,"20130325","20130325","Geen verstrekking in Open Data","54596","Ja",,"1200",,"3500","3500",,,"4",,,,,"179","N1",,,"r. balk v. vooras","3050","LD",,,,,,"0.05","279","Nee","Nee",,"Nee","6550",,,"2024","Logisch","00","Ja","2025-01-29T00:00:00.000","2024-02-03T00:00:00.000","2013-03-25T00:00:00.000","2013-03-25T00:00:00.000",,"0",,,,,,,,,,,,,,,,,,,,,,,,,,"https://opendata.rdw.nl/resource/3huj-srit.json","https://opendata.rdw.nl/resource/8ys7-d773.json","https://opendata.rdw.nl/resource/vezc-m2t6.json","https://opendata.rdw.nl/resource/jhie-znh9.json","https://opendata.rdw.nl/resource/kmfi-hrps.json"
"VB056R","Bedrijfsauto","JAGUAR LAND ROVER","DEFENDER","20240111","20220922","13177","gesloten opbouw","2","N.v.t.","N.v.t.","4","2198","1850","3050","1950","750",,"20130325","20130325","Geen verstrekking in Open Data","55000","Ja",,"1200",,"3500","3500",,,"4",,,,,"179","N1",,,"r. balk v. vooras","3050","LD",,,,,,"0.05","279","Nee","Nee",,"Nee","6550",,,"2023","Onlogisch","04","Ja","2024-01-11T00:00:00.000","2022-09-22T00:00:00.000","2013-03-25T00:00:00.000","2013-03-25T00:00:00.000",,"0",,,,,,,,,,,,,,,,,,,,,,,,,,"https://opendata.rdw.nl/resource/3huj-srit.json","https://opendata.rdw.nl/resource/8ys7-d773.json","https://opendata.rdw.nl/resource/vezc-m2t6.json","https://opendata.rdw.nl/resource/jhie-znh9.json","https://opendata.rdw.nl/resource/kmfi-hrps.json"
"VB058R","Bedrijfsauto","JAGUAR LAND ROVER","DEFENDER","20240106","20220922","12838","gesloten opbouw","2","N.v.t.","N.v.t.","4","2198","1850","3050","1950","750",,"20130325","20130325","Geen verstrekking in Open Data","53167","Ja",,"1200",,"3500","3500",,,"4",,,,,"179","N1",,,"r. balk v. vooras","3050","LD",,,,,,"0.05","279","Nee","Nee",,"Nee","6550",,,"2023","Logisch","00","Ja","2024-01-06T00:00:00.000","2022-09-22T00:00:00.000","2013-03-25T00:00:00.000","2013-03-25T00:00:00.000",,"0",,,,,,,,,,,,,,,,,,,,,,,,,,"https://opendata.rdw.nl/resource/3huj-srit.json","https://opendata.rdw.nl/resource/8ys7-d773.json","https://opendata.rdw.nl/resource/vezc-m2t6.json","https://opendata.rdw.nl/resource/jhie-znh9.json","https://opendata.rdw.nl/resource/kmfi-hrps.json"
"VB059R","Bedrijfsauto","JAGUAR LAND ROVER","DEFENDER","20230106","20220922","12838","gesloten opbouw","2","N.v.t.","N.v.t.","4","2198","1850","3050","1950","750",,"20130325","20130325","Geen verstrekking in Open Data","53167","Ja",,"1200",,"3500","3500",,,"4",,,,,"179","N1",,,"r. balk v. vooras","3050","LD",,,,,,"0.05","279","Nee","Nee",,"Nee","6550",,,"2022","Logisch","00","Ja","2023-01-06T00:00:00.000","2022-09-22T00:00:00.000","2013-03-25T00:00:00.000","2013-03-25T00:00:00.000",,"0",,,,,,,,,,,,,,,,,,,,,,,,,,"https://opendata.rdw.nl/resource/3huj-srit.json","https://opendata.rdw.nl/resource/8ys7-d773.json","https://opendata.rdw.nl/resource/vezc-m2t6.json","https://opendata.rdw.nl/resource/jhie-znh9.json","https://opendata.rdw.nl/resource/kmfi-hrps.json"
"VB061R","Bedrijfsauto","JAGUAR LAND ROVER","DEFENDER","20240605","20230608","12838","gesloten opbouw","2","N.v.t.","N.v.t.","4","2198","1850","3050","1950","750",,"20130326","20130326","Geen verstrekking in Open Data","53167","Ja",,"1200",,"3500","3500",,,"4",,,,,"179","N1",,,"r. balk v. vooras","3050","LD",,,,,,"0.05","279","Nee","Nee",,"Nee","6550",,,"2024","Onlogisch","04","Ja","2024-06-05T00:00:00.000","2023-06-08T00:00:00.000","2013-03-26T00:00:00.000","2013-03-26T00:00:00.000",,"0",,,,,,,,,,,,,,,,,,,,,,,,,,"https://opendata.rdw.nl/resource/3huj-srit.json","https://opendata.rdw.nl/resource/8ys7-d773.json","https://opendata.rdw.nl/resource/vezc-m2t6.json","https://opendata.rdw.nl/resource/jhie-znh9.json","https://opendata.rdw.nl/resource/kmfi-hrps.json"
"VB365S","Bedrijfsauto","JAGUAR LAND ROVER","DEFENDER","20240624","20230915","12928","gesloten opbouw","2","N.v.t.","N.v.t.","4","2198","1850","3050","1950","750",,"20130513","20130513","Geen verstrekking in Open Data","47566","Ja",,"1200",,"3500","3500",,,"4",,,,,"179","N1",,,"r. balk v. vooras","3050","LD",,,,,,"0.05","279","Nee","Nee",,"Nee","6550",,,"2023","Logisch","00","Ja","2024-06-24T00:00:00.000","2023-09-15T00:00:00.000","2013-05-13T00:00:00.000","2013-05-13T00:00:00.000",,"0",,,,,,,,,,,,,,,,,,,,,,,,,,"https://opendata.rdw.nl/resource/3huj-srit.json","https://opendata.rdw.nl/resource/8ys7-d773.json","https://opendata.rdw.nl/resource/vezc-m2t6.json","https://opendata.rdw.nl/resource/jhie-znh9.json","https://opendata.rdw.nl/resource/kmfi-hrps.json"
"VB611S","Bedrijfsauto","JAGUAR LAND ROVER","DEFENDER","20250328","20130316","12721","gesloten opbouw","2","N.v.t.","N.v.t.","4","2198","1790","2505","1890","750",,"20130316","20130316","Geen verstrekking in Open Data","52800","Ja",,"715",,"3500","3500",,,"4",,,,,"179","N1",,,"r. balk v. vooras","2505","LD",,,,,,"0.05","236","Nee","Nee",,"Nee","6005",,,"2024","Logisch","00","Ja","2025-03-28T00:00:00.000","2013-03-16T00:00:00.000","2013-03-16T00:00:00.000","2013-03-16T00:00:00.000",,"0",,,,,,,,,,,,,,,,,,,,,,,,,,"https://opendata.rdw.nl/resource/3huj-srit.json","https://opendata.rdw.nl/resource/8ys7-d773.json","https://opendata.rdw.nl/resource/vezc-m2t6.json","https://opendata.rdw.nl/resource/jhie-znh9.json","https://opendata.rdw.nl/resource/kmfi-hrps.json"
"VB983R","Bedrijfsauto","JAGUAR LAND ROVER","DEFENDER","20250514","20140424","14188","gesloten opbouw","2","N.v.t.","N.v.t.","4","2198","1790","2505","1890","750",,"20130507","20130507","Geen verstrekking in Open Data","58849","Ja",,"715",,"3500","3500",,,"4",,,,,"179","N1",,,"r. balk v. vooras","2505","LD",,,,,,"0.05","236","Nee","Nee",,"Nee","6005",,,"2024","Logisch","00","Ja","2025-05-14T00:00:00.000","2014-04-24T00:00:00.000","2013-05-07T00:00:00.000","2013-05-07T00:00:00.000",,"0",,,,,,,,,,,,,,,,,,,,,,,,,,"https://opendata.rdw.nl/resource/3huj-srit.json","https://opendata.rdw.nl/resource/8ys7-d773.json","https://opendata.rdw.nl/resource/vezc-m2t6.json","https://opendata.rdw.nl/resource/jhie-znh9.json","https://opendata.rdw.nl/resource/kmfi-hrps.json"
"VKV86R","Bedrijfsauto","JAGUAR LAND ROVER","DEFENDER","20240828","20210708","12864","gesloten opbouw","2","N.v.t.","N.v.t.","4","2198","1770","2375","1870","750",,"20140428","20210708","Geen verstrekking in Open Data","53278","Ja",,"605",,,"3500",,"3","4",,,,,"179","N1",,,,"2375","LD-R",,,,,,"0.05","236","Nee","Nee",,"Nee","6005",,,"2023","Onlogisch","04","Ja","2024-08-28T00:00:00.000","2021-07-08T00:00:00.000","2014-04-28T00:00:00.000","2021-07-08T00:00:00.000",,,,,,,,,,,,,,,,,,,,,,,,,,,,"https://opendata.rdw.nl/resource/3huj-srit.json","https://opendata.rdw.nl/resource/8ys7-d773.json","https://opendata.rdw.nl/resource/vezc-m2t6.json","https://opendata.rdw.nl/resource/jhie-znh9.json","https://opendata.rdw.nl/resource/kmfi-hrps.json"
"VLV71H","Bedrijfsauto","JAGUAR LAND ROVER","DEFENDER","20250430","20230105","23944","gesloten opbouw","2","N.v.t.","N.v.t.","6","2997","2528","3200","2628","750",,"20210430","20211008","Geen verstrekking in Open Data","99917","Ja","191","672",,"3500","3500",,"5","4",,,,,"200","N1",,,,"3200","LE",,,,,,"0.00","302","Nee","Nee",,"Nee","6700",,,"2024","Geen oordeel","05","Ja","2025-04-30T00:00:00.000","2023-01-05T00:00:00.000","2021-04-30T00:00:00.000","2021-10-08T00:00:00.000",,,,,,,,,,,,,,,,,,,,,,,,,,,,"https://opendata.rdw.nl/resource/3huj-srit.json","https://opendata.rdw.nl/resource/8ys7-d773.json","https://opendata.rdw.nl/resource/vezc-m2t6.json","https://opendata.rdw.nl/resource/jhie-znh9.json","https://opendata.rdw.nl/resource/kmfi-hrps.json"
"VND69P","Bedrijfsauto","JAGUAR LAND ROVER","DEFENDER","20241102","20211102","17840","gesloten opbouw","2","N.v.t.","N.v.t.","6","2997","2319","2970","2419","750",,"20211102","20211102","Geen verstrekking in Open Data","74223","Ja","188","651",,,"3500",,"3","4",,,,,"200","N1",,,,"2970","LE",,,,,,"0.00","259","Nee","Ja",,"Nee","6470",,,"2023","Logisch","00","Ja","2024-11-02T00:00:00.000","2021-11-02T00:00:00.000","2021-11-02T00:00:00.000","2021-11-02T00:00:00.000",,,,,,,,,,,,,,,,,,,,,,"20211101","2021-11-01T00:00:00.000",,,,,"https://opendata.rdw.nl/resource/3huj-srit.json","https://opendata.rdw.nl/resource/8ys7-d773.json","https://opendata.rdw.nl/resource/vezc-m2t6.json","https://opendata.rdw.nl/resource/jhie-znh9.json","https://opendata.rdw.nl/resource/kmfi-hrps.json"
"VPH06B","Bedrijfsauto","JAGUAR LAND ROVER","DEFENDER","20250708","20220325","22278","gesloten opbouw","2","N.v.t.","N.v.t.","4","1997","2129","2950","2229","750",,"20210708","20220325","Geen verstrekking in Open Data","97900","Ja","191","821",,,"3500",,"3","4",,,,"432","200","N1",,,,"2950","LE",,,,,,"0.10","259","Nee","Nee",,"Nee","6450",,,"2023","Geen oordeel","05","Ja","2025-07-08T00:00:00.000","2022-03-25T00:00:00.000","2021-07-08T00:00:00.000","2022-03-25T00:00:00.000",,,,,,,,,,,,,,,,,,,,,,"20220308","2022-03-08T00:00:00.000",,,,,"https://opendata.rdw.nl/resource/3huj-srit.json","https://opendata.rdw.nl/resource/8ys7-d773.json","https://opendata.rdw.nl/resource/vezc-m2t6.json","https://opendata.rdw.nl/resource/jhie-znh9.json","https://opendata.rdw.nl/resource/kmfi-hrps.json"
"VPP90V","Bedrijfsauto","JAGUAR LAND ROVER","DEFENDER","20250413","20220413","20902","gesloten opbouw","2","N.v.t.","N.v.t.","6","2997","2264","2970","2364","750",,"20220413","20220413","Geen verstrekking in Open Data","87113","Ja","175","706",,,"3500",,"2","4",,,,"432","200","N1",,,,"2970","LE",,,,,,"0.00","259","Nee","Nee",,"Nee","6470",,,"2022","Logisch","00","Ja","2025-04-13T00:00:00.000","2022-04-13T00:00:00.000","2022-04-13T00:00:00.000","2022-04-13T00:00:00.000",,,,,,,,,,,"191",,,,,,,,,,,"20220413","2022-04-13T00:00:00.000",,,,,"https://opendata.rdw.nl/resource/3huj-srit.json","https://opendata.rdw.nl/resource/8ys7-d773.json","https://opendata.rdw.nl/resource/vezc-m2t6.json","https://opendata.rdw.nl/resource/jhie-znh9.json","https://opendata.rdw.nl/resource/kmfi-hrps.json"
"VTN43B","Bedrijfsauto","JAGUAR LAND ROVER","DEFENDER","20250314","20230318","7975","gesloten opbouw","2","N.v.t.","N.v.t.","4","2198","1844","2505","1944",,,"20150330","20230318","Geen verstrekking in Open Data","32696","Ja",,"661",,"3500","3500",,,"4",,,,,"179","N1",,,,"2505","LD-R",,,,,,"0.05","236","Nee","Nee",,"Nee","6005",,,"2024","Geen oordeel","05","Ja","2025-03-14T00:00:00.000","2023-03-18T00:00:00.000","2015-03-30T00:00:00.000","2023-03-18T00:00:00.000",,,,,,,,,,,,,,,,,,,,,,"20221223","2022-12-23T00:00:00.000",,,,,"https://opendata.rdw.nl/resource/3huj-srit.json","https://opendata.rdw.nl/resource/8ys7-d773.json","https://opendata.rdw.nl/resource/vezc-m2t6.json","https://opendata.rdw.nl/resource/jhie-znh9.json","https://opendata.rdw.nl/resource/kmfi-hrps.json"
"VXL31S","Bedrijfsauto","JAGUAR LAND ROVER","DEFENDER","20270810","20230920","30018","gesloten opbouw","3","N.v.t.","N.v.t.","6","2996","2269","3000","2369","750",,"20230810","20230810","Geen verstrekking in Open Data","130483","Ja","191","731",,,"3500",,"2","4",,,,"432","200","N1",,,,"3000","LE",,,,,,"0.00","259","Nee","Nee",,"Nee","6500",,,"2024","Logisch","00","Ja","2027-08-10T00:00:00.000","2023-09-20T00:00:00.000","2023-08-10T00:00:00.000","2023-08-10T00:00:00.000",,,,,,,,,,,"191",,,,,,,,,,,"20230810","2023-08-10T00:00:00.000",,,,,"https://opendata.rdw.nl/resource/3huj-srit.json","https://opendata.rdw.nl/resource/8ys7-d773.json","https://opendata.rdw.nl/resource/vezc-m2t6.json","https://opendata.rdw.nl/resource/jhie-znh9.json","https://opendata.rdw.nl/resource/kmfi-hrps.json"
