"kenteken","voertuigsoort","merk","handelsbenaming","vervaldatum_apk","datum_tenaamstelling","bruto_bpm","inrichting","aantal_zitplaatsen","eerste_kleur","tweede_kleur","aantal_cilinders","cilinderinhoud","massa_ledig_voertuig","toegestane_maximum_massa_voertuig","massa_rijklaar","maximum_massa_trekken_ongeremd","maximum_trekken_massa_geremd","datum_eerste_toelating","datum_eerste_tenaamstelling_in_nederland","wacht_op_keuren","catalogusprijs","wam_verzekerd","maximale_constructiesnelheid","laadvermogen","oplegger_geremd","aanhangwagen_autonoom_geremd","aanhangwagen_middenas_geremd","aantal_staanplaatsen","aantal_deuren","aantal_wielen","afstand_hart_koppeling_tot_achterzijde_voertuig","afstand_voorzijde_voertuig_tot_hart_koppeling","afwijkende_maximum_snelheid","lengte","breedte","europese_voertuigcategorie","europese_voertuigcategorie_toevoeging","europese_uitvoeringcategorie_toevoeging","plaats_chassisnummer","technische_max_massa_voertuig","type","type_gasinstallatie","typegoedkeuringsnummer","variant","uitvoering","volgnummer_wijziging_eu_typegoedkeuring","vermogen_massarijklaar","wielbasis","export_indicator","openstaande_terugroepactie_indicator","vervaldatum_tachograaf","taxi_indicator","maximum_massa_samenstelling","aantal_rolstoelplaatsen","maximum_ondersteunende_snelheid","jaar_laatste_registratie_tellerstand","tellerstandoordeel","code_toelichting_tellerstandoordeel","tenaamstellen_mogelijk","vervaldatum_apk_dt","datum_tenaamstelling_dt","datum_eerste_toelating_dt","datum_eerste_tenaamstelling_in_nederland_dt","vervaldatum_tachograaf_dt","maximum_last_onder_de_vooras_sen_tezamen_koppeling","type_remsysteem_voertuig_code","rupsonderstelconfiguratiecode","wielbasis_voertuig_minimum","wielbasis_voertuig_maximum","lengte_voertuig_minimum","lengte_voertuig_maximum","breedte_voertuig_minimum","breedte_voertuig_maximum","hoogte_voertuig","hoogte_voertuig_minimum","hoogte_voertuig_maximum","massa_bedrijfsklaar_minimaal","massa_bedrijfsklaar_maximaal","technisch_toelaatbaar_massa_koppelpunt","maximum_massa_technisch_maximaal","maximum_massa_technisch_minimaal","subcategorie_nederland","verticale_belasting_koppelpunt_getrokken_voertuig","zuinigheidsclassificatie","registratie_datum_goedkeuring_afschrijvingsmoment_bpm","registratie_datum_goedkeuring_afschrijvingsmoment_bpm_dt","gem_lading_wrde","aerodyn_voorz","massa_alt_aandr","verl_cab_ind","api_gekentekende_voertuigen_assen","api_gekentekende_voertuigen_brandstof","api_gekentekende_voertuigen_carrosserie","api_gekentekende_voertuigen_carrosserie_specifiek","api_gekentekende_voertuigen_voertuigklasse"
"J331GX","Personenauto","VOLVO","XC90 EXCELLENCE","20240815","20220420","469","MPV","4","GRIJS","Niet geregistreerd","4","1969","2267","2770","2367","750","2400","20160707","20200728","Geen verstrekking in Open Data","126400","Ja","230",,,,,,"5","4","0","0",,"495","0","M1",,,"r. bodemplaat by voorzitting","2770","L",,"e4*2007/46*0929*04","LTBA","LTBABD??","0","0.01","298","Nee","Ja",,"Nee","5170","0","0.00","2022","Geen oordeel","05","Ja","2024-08-15T00:00:00.000","2022-04-20T00:00:00.000","2016-07-07T00:00:00.000","2020-07-28T00:00:00.000",,,,,,,,,,,"173",,,,,,,,,,"A",,,,,,,"https://opendata.rdw.nl/resource/3huj-srit.json","https://opendata.rdw.nl/resource/8ys7-d773.json","https://opendata.rdw.nl/resource/vezc-m2t6.json","https://opendata.rdw.nl/resource/jhie-znh9.json","https://opendata.rdw.nl/resource/kmfi-hrps.json"
"K647BP","Personenauto","VOLVO","XC90 EXCELLENCE","20250802","20220304","1326","MPV","4","GRIJS","Niet geregistreerd","4","1969","2267","2770","2367","750","2400","20171018","20210216","Geen verstrekking in Open Data","128470","Ja",,,,,,,"5","4","0","0",,"495","0","M1",,,,"2770","L",,"e4*2007/46*0929*05","LTBA","LTBABD??","1","0.01","298","Nee","Nee",,"Nee","5170","0","0.00","2023","Geen oordeel","05","Ja","2025-08-02T00:00:00.000","2022-03-04T00:00:00.000","2017-10-18T00:00:00.000","2021-02-16T00:00:00.000",,,,,,,,,,,"173",,,,,,,,,,"A",,,,,,,"https://opendata.rdw.nl/resource/3huj-srit.json","https://opendata.rdw.nl/resource/8ys7-d773.json","https://opendata.rdw.nl/resource/vezc-m2t6.json","https://opendata.rdw.nl/resource/jhie-znh9.json","https://opendata.rdw.nl/resource/kmfi-hrps.json"
"KD080D","Personenauto","VOLVO","XC90 EXCELLENCE","20240801","20161222","469","MPV","4","GRIJS","Niet geregistreerd","4","1969","2267","2770","2367","750","2400","20160801","20160801","Geen verstrekking in Open Data","127109","Ja",,,,,,,"5","4","0","0",,"495","196","M1",,,"in bodemplaat r. v.","2770","L",,"e4*2007/46*0929*04","LTBA","LTBABD??","0","0.01","298","Nee","Nee",,"Nee","5170","0","0.00","2024","Logisch","00","Ja","2024-08-01T00:00:00.000","2016-12-22T00:00:00.000","2016-08-01T00:00:00.000","2016-08-01T00:00:00.000",,,,,,,,,,,"173",,,,,,,,,,"A",,,,,,,"https://opendata.rdw.nl/resource/3huj-srit.json","https://opendata.rdw.nl/resource/8ys7-d773.json","https://opendata.rdw.nl/resource/vezc-m2t6.json","https://opendata.rdw.nl/resource/jhie-znh9.json","https://opendata.rdw.nl/resource/kmfi-hrps.json"
"KD202Z","Personenauto","VOLVO","XC90 EXCELLENCE","20240819","20221026","469","MPV","4","ZWART","Niet geregistreerd","4","1969","2267","2770","2367","750","2400","20160809","20160809","Geen verstrekking in Open Data","127109","Ja",,,,,,,"5","4","0","0",,"495","196","M1",,,"in bodemplaat r. v.","2770","L",,"e4*2007/46*0929*04","LTBA","LTBABD??","0","0.01","298","Nee","Nee",,"Nee","5170","0","0.00","2024","Logisch","00","Ja","2024-08-19T00:00:00.000","2022-10-26T00:00:00.000","2016-08-09T00:00:00.000","2016-08-09T00:00:00.000",,,,,,,,,,,"173",,,,,,,,,,"A",,,,,,,"https://opendata.rdw.nl/resource/3huj-srit.json","https://opendata.rdw.nl/resource/8ys7-d773.json","https://opendata.rdw.nl/resource/vezc-m2t6.json","https://opendata.rdw.nl/resource/jhie-znh9.json","https://opendata.rdw.nl/resource/kmfi-hrps.json"
"KJ462H","Personenauto","VOLVO","XC90 EXCELLENCE","20240922","20160922","469","MPV","4","BLAUW","Niet geregistreerd","4","1969","2267","2770","2367","750","2400","20160922","20160922","Geen verstrekking in Open Data","127109","Ja",,,,,,,"5","4","0","0",,"495","196","M1",,,"in bodemplaat r. v.","2770","L",,"e4*2007/46*0929*04","LTBA","LTBABD??","0","0.01","298","Nee","Ja",,"Nee","5170","0","0.00","2024","Logisch","00","Ja","2024-09-22T00:00:00.000","2016-09-22T00:00:00.000","2016-09-22T00:00:00.000","2016-09-22T00:00:00.000",,,,,,,,,,,"173",,,,,,,,,,"A",,,,,,,"https://opendata.rdw.nl/resource/3huj-srit.json","https://opendata.rdw.nl/resource/8ys7-d773.json","https://opendata.rdw.nl/resource/vezc-m2t6.json","https://opendata.rdw.nl/resource/jhie-znh9.json","https://opendata.rdw.nl/resource/kmfi-hrps.json"
"KJ591V","Personenauto","VOLVO","XC90 EXCELLENCE","20241207","20231211","469","MPV","4","BLAUW","Niet geregistreerd","4","1969","2267","2770","2367","750","2400","20160930","20160930","Geen verstrekking in Open Data","126000","Ja",,,,,,,"5","4","0","0",,"495","196","M1",,,"in bodemplaat r. v.","2770","L",,"e4*2007/46*0929*04","LTBA","LTBABD??","0","0.01","298","Nee","Nee",,"Nee","5170","0","0.00","2023","Logisch","00","Ja","2024-12-07T00:00:00.000","2023-12-11T00:00:00.000","2016-09-30T00:00:00.000","2016-09-30T00:00:00.000",,,,,,,,,,,"173",,,,,,,,,,"A",,,,,,,"https://opendata.rdw.nl/resource/3huj-srit.json","https://opendata.rdw.nl/resource/8ys7-d773.json","https://opendata.rdw.nl/resource/vezc-m2t6.json","https://opendata.rdw.nl/resource/jhie-znh9.json","https://opendata.rdw.nl/resource/kmfi-hrps.json"
"KV416L","Personenauto","VOLVO","XC90 EXCELLENCE","20240702","20200702","469","MPV","4","ZWART","Niet geregistreerd","4","1969","2267","2770","2367","750","2400","20161212","20161212","Geen verstrekking in Open Data","127109","Ja",,,,,,,"5","4","0","0",,"495","196","M1",,,"in bodemplaat r. v.","2770","L",,"e4*2007/46*0929*04","LTBA","LTBABD??","0","0.01","298","Nee","Ja",,"Nee","5170","0","0.00","2024","Logisch","00","Ja","2024-07-02T00:00:00.000","2020-07-02T00:00:00.000","2016-12-12T00:00:00.000","2016-12-12T00:00:00.000",,,,,,,,,,,"173",,,,,,,,,,"A",,,,,,,"https://opendata.rdw.nl/resource/3huj-srit.json","https://opendata.rdw.nl/resource/8ys7-d773.json","https://opendata.rdw.nl/resource/vezc-m2t6.json","https://opendata.rdw.nl/resource/jhie-znh9.json","https://opendata.rdw.nl/resource/kmfi-hrps.json"
"KV418L","Personenauto","VOLVO","XC90 EXCELLENCE","20241203","20190227","469","MPV","4","BLAUW","Niet geregistreerd","4","1969","2267","2770","2367","750","2400","20161203","20161203","Geen verstrekking in Open Data","127109","Ja",,,,,,,"5","4","0","0",,"495","196","M1",,,"in bodemplaat r. v.","2770","L",,"e4*2007/46*0929*04","LTBA","LTBABD??","0","0.01","298","Nee","Nee",,"Nee","5170","0","0.00","2023","Logisch","00","Ja","2024-12-03T00:00:00.000","2019-02-27T00:00:00.000","2016-12-03T00:00:00.000","2016-12-03T00:00:00.000",,,,,,,,,,,"173",,,,,,,,,,"A",,,,,,,"https://opendata.rdw.nl/resource/3huj-srit.json","https://opendata.rdw.nl/resource/8ys7-d773.json","https://opendata.rdw.nl/resource/vezc-m2t6.json","https://opendata.rdw.nl/resource/jhie-znh9.json","https://opendata.rdw.nl/resource/kmfi-hrps.json"
"KX078P","Personenauto","VOLVO","XC90 EXCELLENCE","20251211","20230701","469","MPV","4","WIT","Niet geregistreerd","4","1969","2267","2770","2367","750","2400","20161216","20161216","Geen verstrekking in Open Data","126440","Ja",,,,,,,"5","4","0","0",,"495","196","M1",,,"in bodemplaat r. v.","2770","L",,"e4*2007/46*0929*04","LTBA","LTBABD??","0","0.01","298","Nee","Nee",,"Nee","5170","0","0.00","2023","Logisch","00","Ja","2025-12-11T00:00:00.000","2023-07-01T00:00:00.000","2016-12-16T00:00:00.000","2016-12-16T00:00:00.000",,,,,,,,,,,"173",,,,,,,,,,"A",,,,,,,"https://opendata.rdw.nl/resource/3huj-srit.json","https://opendata.rdw.nl/resource/8ys7-d773.json","https://opendata.rdw.nl/resource/vezc-m2t6.json","https://opendata.rdw.nl/resource/jhie-znh9.json","https://opendata.rdw.nl/resource/kmfi-hrps.json"
"KX910D","Personenauto","VOLVO","XC90 EXCELLENCE","20241230","20220505","469","MPV","4","BLAUW","Niet geregistreerd","4","1969","2267","2770","2367","750","2400","20161223","20161223","Geen verstrekking in Open Data","127109","Ja",,,,,,,"5","4","0","0",,"495","196","M1",,,"in bodemplaat r. v.","2770","L",,"e4*2007/46*0929*04","LTBA","LTBABD??","0","0.01","298","Nee","Nee",,"Nee","5170","0","0.00","2023","Logisch","00","Ja","2024-12-30T00:00:00.000","2022-05-05T00:00:00.000","2016-12-23T00:00:00.000","2016-12-23T00:00:00.000",,,,,,,,,,,"173",,,,,,,,,,"A",,,,,,,"https://opendata.rdw.nl/resource/3huj-srit.json","https://opendata.rdw.nl/resource/8ys7-d773.json","https://opendata.rdw.nl/resource/vezc-m2t6.json","https://opendata.rdw.nl/resource/jhie-znh9.json","https://opendata.rdw.nl/resource/kmfi-hrps.json"
"L687RT","Personenauto","VOLVO","XC90 EXCELLENCE","20250907","20210907","461","MPV","4","WIT","Niet geregistreerd","4","1969","2267","2770","2367","750","2400","20160830","20210907","Geen verstrekking in Open Data","126400","Ja","230",,,,,,"5","4","0","0",,"495","0","M1",,,,"2770","L",,"e4*2007/46*0929*04","LTBA","LTBABD??","0","0.01","298","Nee","Nee",,"Nee","5170","0","0.00","2023","Geen oordeel","05","Ja","2025-09-07T00:00:00.000","2021-09-07T00:00:00.000","2016-08-30T00:00:00.000","2021-09-07T00:00:00.000",,,,,,,,,,,"173",,,,,,,,,,,,,,,,,"https://opendata.rdw.nl/resource/3huj-srit.json","https://opendata.rdw.nl/resource/8ys7-d773.json","https://opendata.rdw.nl/resource/vezc-m2t6.json","https://opendata.rdw.nl/resource/jhie-znh9.json","https://opendata.rdw.nl/resource/kmfi-hrps.json"
"N377ZH","Personenauto","VOLVO","XC90 EXCELLENCE","20250223","20240226","467","MPV","4","ZWART","Niet geregistreerd","4","1969","2267","2770","2367","750","2400","20160614","20220314","Geen verstrekking in Open Data","127510","Ja","230",,,,,,"5","4","0","0",,"495","0","M1",,,,"2770","L",,"e4*2007/46*0929*04","LTBA","LTBABD??","0","0.01","298","Nee","Nee",,"Nee","5170","0","0.00","2024","Geen oordeel","05","Ja","2025-02-23T00:00:00.000","2024-02-26T00:00:00.000","2016-06-14T00:00:00.000","2022-03-14T00:00:00.000",,,,,,,,,,,"173",,,,,,,,,,,"20220111","2022-01-11T00:00:00.000",,,,,"https://opendata.rdw.nl/resource/3huj-srit.json","https://opendata.rdw.nl/resource/8ys7-d773.json","https://opendata.rdw.nl/resource/vezc-m2t6.json","https://opendata.rdw.nl/resource/jhie-znh9.json","https://opendata.rdw.nl/resource/kmfi-hrps.json"
"N786RR","Personenauto","VOLVO","XC90 EXCELLENCE","20260104","20231116","4385","MPV","4","ZWART","Niet geregistreerd","4","1969","2304","2770","2404","750","2400","20180919","20211210","Geen verstrekking in Open Data","126914","Ja","230",,,,,,"5","4","0","0",,"495","0","M1",,,,"2770","L",,"e4*2007/46*0929*09","LTBM","LTBMTD0?","0","0.01","298","Nee","Nee",,"Nee","5170","0","0.00","2024","Geen oordeel","05","Ja","2026-01-04T00:00:00.000","2023-11-16T00:00:00.000","2018-09-19T00:00:00.000","2021-12-10T00:00:00.000",,,,,,,,,,,"173",,,,,,,,,,,"20211209","2021-12-09T00:00:00.000",,,,,"https://opendata.rdw.nl/resource/3huj-srit.json","https://opendata.rdw.nl/resource/8ys7-d773.json","https://opendata.rdw.nl/resource/vezc-m2t6.json","https://opendata.rdw.nl/resource/jhie-znh9.json","https://opendata.rdw.nl/resource/kmfi-hrps.json"
"NG468D","Personenauto","VOLVO","XC90 EXCELLENCE","20241124","20181002","469","MPV","4","ZWART","Niet geregistreerd","4","1969","2267","2770","2367","750","2400","20161124","20170126","Geen verstrekking in Open Data","126000","Ja",,,,,,,"5","4","0","0",,"495","0","M1",,,"r. bodemplaat by voorzitting","2770","L",,"e4*2007/46*0929*04","LTBA","LTBABD??","0","0.01","298","Nee","Nee",,"Nee","5170","0","0.00","2023","Geen oordeel","05","Ja","2024-11-24T00:00:00.000","2018-10-02T00:00:00.000","2016-11-24T00:00:00.000","2017-01-26T00:00:00.000",,,,,,,,,,,,,,,,,,,,,"A",,,,,,,"https://opendata.rdw.nl/resource/3huj-srit.json","https://opendata.rdw.nl/resource/8ys7-d773.json","https://opendata.rdw.nl/resource/vezc-m2t6.json","https://opendata.rdw.nl/resource/jhie-znh9.json","https://opendata.rdw.nl/resource/kmfi-hrps.json"
"NG601D","Personenauto","VOLVO","XC90 EXCELLENCE","20241123","20220124","469","MPV","4","ZWART","Niet geregistreerd","4","1969","2267","2770","2367","750","2400","20161123","20170126","Geen verstrekking in Open Data","126000","Ja",,,,,,,"5","4","0","0",,"495","0","M1",,,"r. bodemplaat by voorzitting","2770","L",,"e4*2007/46*0929*04","LTBA","LTBABD??","0","0.01","298","Nee","Nee",,"Nee","5170","0","0.00","2023","Geen oordeel","05","Ja","2024-11-23T00:00:00.000","2022-01-24T00:00:00.000","2016-11-23T00:00:00.000","2017-01-26T00:00:00.000",,,,,,,,,,,,,,,,,,,,,"A",,,,,,,"https://opendata.rdw.nl/resource/3huj-srit.json","https://opendata.rdw.nl/resource/8ys7-d773.json","https://opendata.rdw.nl/resource/vezc-m2t6.json","https://opendata.rdw.nl/resource/jhie-znh9.json","https://opendata.rdw.nl/resource/kmfi-hrps.json"
"P048BF","Personenauto","VOLVO","XC90 EXCELLENCE","20260513","20220723","17450","MPV","7","ZWART","Niet geregistreerd","4","1969","2043","2790","2143","750","2700","20200513","20220303","Geen verstrekking in Open Data","100407","Ja","230",,,,,,"5","4","0","0",,"495","0","M1",,,,"2790","L",,"e4*2007/46*0929*13","LF06","LF06TC0?","0","0.00","298","Nee","Nee",,"Nee","5490","0","0.00","2024","Geen oordeel","05","Ja","2026-05-13T00:00:00.000","2022-07-23T00:00:00.000","2020-05-13T00:00:00.000","2022-03-03T00:00:00.000",,,,,,,,,,,,,,,,,,,,,,"20220120","2022-01-20T00:00:00.000",,,,,"https://opendata.rdw.nl/resource/3huj-srit.json","https://opendata.rdw.nl/resource/8ys7-d773.json","https://opendata.rdw.nl/resource/vezc-m2t6.json","https://opendata.rdw.nl/resource/jhie-znh9.json","https://opendata.rdw.nl/resource/kmfi-hrps.json"
"P296KL","Personenauto","VOLVO","XC90 EXCELLENCE","20240802","20220726","467","MPV","4","BLAUW","Niet geregistreerd","4","1969","2267","2770","2367","750","2400","20160729","20220726","Geen verstrekking in Open Data","126000","Ja","230",,,,,,"5","4","0","0",,"495","0","M1",,,,"2770","L",,"e4*2007/46*0929*04","LTBA","LTBABD??","0","0.01","298","Nee","Nee",,"Nee","5170","0","0.00","2022","Geen oordeel","05","Ja","2024-08-02T00:00:00.000","2022-07-26T00:00:00.000","2016-07-29T00:00:00.000","2022-07-26T00:00:00.000",,,,,,,,,,,"173",,,,,,,,,,,"20220323","2022-03-23T00:00:00.000",,,,,"https://opendata.rdw.nl/resource/3huj-srit.json","https://opendata.rdw.nl/resource/8ys7-d773.json","https://opendata.rdw.nl/resource/vezc-m2t6.json","https://opendata.rdw.nl/resource/jhie-znh9.json","https://opendata.rdw.nl/resource/kmfi-hrps.json"
"P313KP","Personenauto","VOLVO","XC90 EXCELLENCE","20250712","20230718","2222","MPV","4","GRIJS","Niet geregistreerd","4","1969","2267","2770","2367","750","2400","20170919","20220401","Geen verstrekking in Open Data","153560","Ja",,,,,,,"5","4","0","0",,"495","0","M1",,,,"2770","L",,"e4*2007/46*0929*05","LTBA","LTBABD??","1","0.01","298","Nee","Nee",,"Nee","5170","0","0.00","2023","Geen oordeel","05","Ja","2025-07-12T00:00:00.000","2023-07-18T00:00:00.000","2017-09-19T00:00:00.000","2022-04-01T00:00:00.000",,,,,,,,,,,"173",,,,,,,,,,,"20220321","2022-03-21T00:00:00.000",,,,,"https://opendata.rdw.nl/resource/3huj-srit.json","https://opendata.rdw.nl/resource/8ys7-d773.json","https://opendata.rdw.nl/resource/vezc-m2t6.json","https://opendata.rdw.nl/resource/jhie-znh9.json","https://opendata.rdw.nl/resource/kmfi-hrps.json"
"PH422G","Personenauto","VOLVO","XC90 EXCELLENCE","20250316","20170705","2310","MPV","4","WIT","Niet geregistreerd","4","1969","2267","2770","2367","750","2400","20170705","20170705","Geen verstrekking in Open Data","129579","Ja",,,,,,,"5","4","0","0",,"495","196","M1",,,"in bodemplaat r. v.","2770","L",,"e4*2007/46*0929*05","LTBA","LTBABD??","1","0.01","298","Nee","Nee",,"Nee","5170","0","0.00","2024","Logisch","00","Ja","2025-03-16T00:00:00.000","2017-07-05T00:00:00.000","2017-07-05T00:00:00.000","2017-07-05T00:00:00.000",,,,,,,,,,,"173",,,,,,,,,,"A",,,,,,,"https://opendata.rdw.nl/resource/3huj-srit.json","https://opendata.rdw.nl/resource/8ys7-d773.json","https://opendata.rdw.nl/resource/vezc-m2t6.json","https://opendata.rdw.nl/resource/jhie-znh9.json","https://opendata.rdw.nl/resource/kmfi-hrps.json"
"RS842G","Personenauto","VOLVO","XC90 EXCELLENCE","20250822","20230911","2223","MPV","4","GRIJS","Niet geregistreerd","4","1969","2284","2770","2384","750","2400","20180118","20180118","Geen verstrekking in Open Data","128470","Ja",,,,,,,"5","4","0","0",,"495","196","M1",,,,"2770","L",,"e4*2007/46*0929*06","LTBA","LTBABD??","0","0.10","298","Nee","Nee",,"Nee","5170","0","0.00","2023","Logisch","00","Ja","2025-08-22T00:00:00.000","2023-09-11T00:00:00.000","2018-01-18T00:00:00.000","2018-01-18T00:00:00.000",,,,,,,,,,,"173",,,,,,,,,,"A",,,,,,,"https://opendata.rdw.nl/resource/3huj-srit.json","https://opendata.rdw.nl/resource/8ys7-d773.json","https://opendata.rdw.nl/resource/vezc-m2t6.json","https://opendata.rdw.nl/resource/jhie-znh9.json","https://opendata.rdw.nl/resource/kmfi-hrps.json"
"S819SK","Personenauto","VOLVO","XC90 EXCELLENCE","20240926","20230328","26407","MPV","7","ZWART","Niet geregistreerd","4","1969","2043","2790","2143","750","2700","20200926","20230328","Geen verstrekking in Open Data","111717","Ja","230",,,,,,"5","4","0","0",,"495","0","M1",,,,"2790","L",,"e4*2007/46*0929*13","LF06","LF06TC0?","0","0.00","298","Nee","Nee",,"Nee","5490","0","0.00","2024","Geen oordeel","05","Ja","2024-09-26T00:00:00.000","2023-03-28T00:00:00.000","2020-09-26T00:00:00.000","2023-03-28T00:00:00.000",,,,,,,,,,,,,,,,,,,,,,"20230327","2023-03-27T00:00:00.000",,,,,"https://opendata.rdw.nl/resource/3huj-srit.json","https://opendata.rdw.nl/resource/8ys7-d773.json","https://opendata.rdw.nl/resource/vezc-m2t6.json","https://opendata.rdw.nl/resource/jhie-znh9.json","https://opendata.rdw.nl/resource/kmfi-hrps.json"
"SJ514H","Personenauto","VOLVO","XC90 EXCELLENCE","20260420","20240322","2223","MPV","4","GRIJS","Niet geregistreerd","4","1969","2284","2770","2384","750","2400","20180420","20180420","Geen verstrekking in Open Data","128070","Ja",,,,,,,"5","4","0","0",,"495","196","M1",,,,"2770","L",,"e4*2007/46*0929*06","LTBA","LTBABD??","0","0.10","298","Nee","Nee",,"Nee","5170","0","0.00","2024","Logisch","00","Ja","2026-04-20T00:00:00.000","2024-03-22T00:00:00.000","2018-04-20T00:00:00.000","2018-04-20T00:00:00.000",,,,,,,,,,,"173",,,,,,,,,,"A",,,,,,,"https://opendata.rdw.nl/resource/3huj-srit.json","https://opendata.rdw.nl/resource/8ys7-d773.json","https://opendata.rdw.nl/resource/vezc-m2t6.json","https://opendata.rdw.nl/resource/jhie-znh9.json","https://opendata.rdw.nl/resource/kmfi-hrps.json"
"SN009V","Personenauto","VOLVO","XC90 EXCELLENCE","20240627","20220628","2223","MPV","4","BRUIN","Niet geregistreerd","4","1969","2284","2770","2384","750","2400","20180517","20180517","Geen verstrekking in Open Data","128070","Ja",,,,,,,"5","4","0","0",,"495","196","M1",,,,"2770","L",,"e4*2007/46*0929*07","LTBA","LTBABD??","0","0.10","298","Nee","Nee",,"Nee","5170","0","0.00","2024","Logisch","00","Ja","2024-06-27T00:00:00.000","2022-06-28T00:00:00.000","2018-05-17T00:00:00.000","2018-05-17T00:00:00.000",,,,,,,,,,,"173",,,,,,,,,,"A",,,,,,,"https://opendata.rdw.nl/resource/3huj-srit.json","https://opendata.rdw.nl/resource/8ys7-d773.json","https://opendata.rdw.nl/resource/vezc-m2t6.json","https://opendata.rdw.nl/resource/jhie-znh9.json","https://opendata.rdw.nl/resource/kmfi-hrps.json"
"SN032V","Personenauto","VOLVO","XC90 EXCELLENCE","20250119","20211227","1620","MPV","4","WIT","Niet geregistreerd","4","1969","2267","2770","2367","750","2400","20170119","20180628","Geen verstrekking in Open Data","128400","Ja",,,,,,,"5","4","0","0",,"495","0","M1",,,,"2770","L",,"e4*2007/46*0929*04","LTBA","LTBABD??","0","0.01","298","Nee","Nee",,"Nee","5170","0","0.00","2023","Geen oordeel","05","Ja","2025-01-19T00:00:00.000","2021-12-27T00:00:00.000","2017-01-19T00:00:00.000","2018-06-28T00:00:00.000",,,,,,,,,,,,,,,,,,,,,"A",,,,,,,"https://opendata.rdw.nl/resource/3huj-srit.json","https://opendata.rdw.nl/resource/8ys7-d773.json","https://opendata.rdw.nl/resource/vezc-m2t6.json","https://opendata.rdw.nl/resource/jhie-znh9.json","https://opendata.rdw.nl/resource/kmfi-hrps.json"
"TS467J","Personenauto","VOLVO","XC90 EXCELLENCE","20241014","20240404","2223","MPV","4","WIT","Niet geregistreerd","4","1969","2284","2770","2384","750","2400","20181012","20181012","Geen verstrekking in Open Data","128470","Ja",,,,,,,"5","4","0","0",,"495","196","M1",,,,"2770","L",,"e4*2007/46*0929*06","LTBA","LTBABD??","0","0.10","298","Nee","Nee",,"Nee","5170","0","0.00","2023","Logisch","00","Ja","2024-10-14T00:00:00.000","2024-04-04T00:00:00.000","2018-10-12T00:00:00.000","2018-10-12T00:00:00.000",,,,,,,,,,,"173",,,,,,,,,,"A",,,,,,,"https://opendata.rdw.nl/resource/3huj-srit.json","https://opendata.rdw.nl/resource/8ys7-d773.json","https://opendata.rdw.nl/resource/vezc-m2t6.json","https://opendata.rdw.nl/resource/jhie-znh9.json","https://opendata.rdw.nl/resource/kmfi-hrps.json"
"XJ034F","Personenauto","VOLVO","XC90 EXCELLENCE","20250305","20181228","469","MPV","4","ZWART","Niet geregistreerd","4","1969","2267","2770","2367","750","2400","20160524","20181228","Geen verstrekking in Open Data","125999","Ja",,,,,,,"5","4","0","0",,"495","0","M1",,,,"2770","L",,"e4*2007/46*0929*04","LTBA","LTBABD??","0","0.01","298","Nee","Nee",,"Nee","5170","0","0.00","2024","Geen oordeel","05","Ja","2025-03-05T00:00:00.000","2018-12-28T00:00:00.000","2016-05-24T00:00:00.000","2018-12-28T00:00:00.000",,,,,,,,,,,,,,,,,,,,,"A",,,,,,,"https://opendata.rdw.nl/resource/3huj-srit.json","https://opendata.rdw.nl/resource/8ys7-d773.json","https://opendata.rdw.nl/resource/vezc-m2t6.json","https://opendata.rdw.nl/resource/jhie-znh9.json","https://opendata.rdw.nl/resource/kmfi-hrps.json"