"kenteken","voertuigsoort","merk","handelsbenaming","vervaldatum_apk","datum_tenaamstelling","bruto_bpm","inrichting","aantal_zitplaatsen","eerste_kleur","tweede_kleur","aantal_cilinders","cilinderinhoud","massa_ledig_voertuig","toegestane_maximum_massa_voertuig","massa_rijklaar","maximum_massa_trekken_ongeremd","maximum_trekken_massa_geremd","datum_eerste_toelating","datum_eerste_tenaamstelling_in_nederland","wacht_op_keuren","catalogusprijs","wam_verzekerd","maximale_constructiesnelheid","laadvermogen","oplegger_geremd","aanhangwagen_autonoom_geremd","aanhangwagen_middenas_geremd","aantal_staanplaatsen","aantal_deuren","aantal_wielen","afstand_hart_koppeling_tot_achterzijde_voertuig","afstand_voorzijde_voertuig_tot_hart_koppeling","afwijkende_maximum_snelheid","lengte","breedte","europese_voertuigcategorie","europese_voertuigcategorie_toevoeging","europese_uitvoeringcategorie_toevoeging","plaats_chassisnummer","technische_max_massa_voertuig","type","type_gasinstallatie","typegoedkeuringsnummer","variant","uitvoering","volgnummer_wijziging_eu_typegoedkeuring","vermogen_massarijklaar","wielbasis","export_indicator","openstaande_terugroepactie_indicator","vervaldatum_tachograaf","taxi_indicator","maximum_massa_samenstelling","aantal_rolstoelplaatsen","maximum_ondersteunende_snelheid","jaar_laatste_registratie_tellerstand","tellerstandoordeel","code_toelichting_tellerstandoordeel","tenaamstellen_mogelijk","vervaldatum_apk_dt","datum_tenaamstelling_dt","datum_eerste_toelating_dt","datum_eerste_tenaamstelling_in_nederland_dt","vervaldatum_tachograaf_dt","maximum_last_onder_de_vooras_sen_tezamen_koppeling","type_remsysteem_voertuig_code","rupsonderstelconfiguratiecode","wielbasis_voertuig_minimum","wielbasis_voertuig_maximum","lengte_voertuig_minimum","lengte_voertuig_maximum","breedte_voertuig_minimum","breedte_voertuig_maximum","hoogte_voertuig","hoogte_voertuig_minimum","hoogte_voertuig_maximum","massa_bedrijfsklaar_minimaal","massa_bedrijfsklaar_maximaal","technisch_toelaatbaar_massa_koppelpunt","maximum_massa_technisch_maximaal","maximum_massa_technisch_minimaal","subcategorie_nederland","verticale_belasting_koppelpunt_getrokken_voertuig","zuinigheidsclassificatie","registratie_datum_goedkeuring_afschrijvingsmoment_bpm","registratie_datum_goedkeuring_afschrijvingsmoment_bpm_dt","gem_lading_wrde","aerodyn_voorz","massa_alt_aandr","verl_cab_ind","api_gekentekende_voertuigen_assen","api_gekentekende_voertuigen_brandstof","api_gekentekende_voertuigen_carrosserie","api_gekentekende_voertuigen_carrosserie_specifiek","api_gekentekende_voertuigen_voertuigklasse"
"3TNK96","Personenauto","VOLVO","XC60 T5","20250424","20240426","14209","MPV","5","BRUIN","Niet geregistreerd","4","2000","1598","2270","1698",,"1800","20130630","20140325","Geen verstrekking in Open Data","61486","Ja",,,,,,,"4","4",,,,,,"M1",,,"r. bodemplaat by voorzitting","2270",,,,,,,"0.10","277","Nee","Nee",,"Nee","4070",,,"2024","Geen oordeel","05","Ja","2025-04-24T00:00:00.000","2024-04-26T00:00:00.000","2013-06-30T00:00:00.000","2014-03-25T00:00:00.000",,"0",,,,,,,,,,,,,,,,,,,,,,,,,,"https://opendata.rdw.nl/resource/3huj-srit.json","https://opendata.rdw.nl/resource/8ys7-d773.json","https://opendata.rdw.nl/resource/vezc-m2t6.json","https://opendata.rdw.nl/resource/jhie-znh9.json","https://opendata.rdw.nl/resource/kmfi-hrps.json"
"G531FK","Personenauto","VOLVO","XC60 T5 INSCRIPTION","20260114","20200115","3913","MPV","5","ZWART","Niet geregistreerd","4","1969","1733","2400","1833",,,"20170228","20191108","Geen verstrekking in Open Data","103451","Ja",,,,,,,"5","4",,,,,,"M1",,,"r. bodemplaat v. voorzitting","2400",,,,,,,"0.10","276","Nee","Nee",,"Nee",,,,"2024","Geen oordeel","05","Ja","2026-01-14T00:00:00.000","2020-01-15T00:00:00.000","2017-02-28T00:00:00.000","2019-11-08T00:00:00.000",,,,,,,,,,,,,,,,,,,,,,,,,,,,"https://opendata.rdw.nl/resource/3huj-srit.json","https://opendata.rdw.nl/resource/8ys7-d773.json","https://opendata.rdw.nl/resource/vezc-m2t6.json","https://opendata.rdw.nl/resource/jhie-znh9.json","https://opendata.rdw.nl/resource/kmfi-hrps.json"
"GT350H","Personenauto","VOLVO","XC60 T5","20241201","20150812","7863","stationwagen","5","GRIJS","Niet geregistreerd","4","1969","1769","2330","1869",,,"20141201","20150812","Geen verstrekking in Open Data","75617","Ja",,,,,,,"4","4",,,,,,"M1",,,"by r. voorzitting","2330",,,,,,,"0.10","278","Nee","Nee",,"Nee",,,,"2024","Geen oordeel","05","Ja","2024-12-01T00:00:00.000","2015-08-12T00:00:00.000","2014-12-01T00:00:00.000","2015-08-12T00:00:00.000",,,,,,,,,,,,,,,,,,,,,,,,,,,,"https://opendata.rdw.nl/resource/3huj-srit.json","https://opendata.rdw.nl/resource/8ys7-d773.json","https://opendata.rdw.nl/resource/vezc-m2t6.json","https://opendata.rdw.nl/resource/jhie-znh9.json","https://opendata.rdw.nl/resource/kmfi-hrps.json"
"GX966P","Personenauto","VOLVO","XC60 T5","20250228","20190125","7863","stationwagen","5","BRUIN","Niet geregistreerd","4","1969","1816","2330","1916",,,"20140228","20150907","Geen verstrekking in Open Data","64220","Ja",,,,,,,"4","4",,,,,,"M1",,,"r. voorzitting bodemplaat","2330",,,,,,,"0.09","277","Nee","Nee",,"Nee",,,,"2024","Geen oordeel","05","Ja","2025-02-28T00:00:00.000","2019-01-25T00:00:00.000","2014-02-28T00:00:00.000","2015-09-07T00:00:00.000",,,,,,,,,,,,,,,,,,,,,,,,,,,,"https://opendata.rdw.nl/resource/3huj-srit.json","https://opendata.rdw.nl/resource/8ys7-d773.json","https://opendata.rdw.nl/resource/vezc-m2t6.json","https://opendata.rdw.nl/resource/jhie-znh9.json","https://opendata.rdw.nl/resource/kmfi-hrps.json"
"H237HN","Personenauto","VOLVO","XC60 T5R","20251124","20211130","49971","MPV","5","GRIJS","Niet geregistreerd","4","1969","1614","2430","1714",,,"20180228","20200131","Geen verstrekking in Open Data","102596","Ja",,,,,,,"4","4",,,,,,"M1",,,"r. bodemplaat by voorzitting","2430",,,,,,,"0.11","287","Nee","Nee",,"Nee",,,,"2023","Geen oordeel","05","Ja","2025-11-24T00:00:00.000","2021-11-30T00:00:00.000","2018-02-28T00:00:00.000","2020-01-31T00:00:00.000",,,,,,,,,,,,,,,,,,,,,,,,,,,,"https://opendata.rdw.nl/resource/3huj-srit.json","https://opendata.rdw.nl/resource/8ys7-d773.json","https://opendata.rdw.nl/resource/vezc-m2t6.json","https://opendata.rdw.nl/resource/jhie-znh9.json","https://opendata.rdw.nl/resource/kmfi-hrps.json"
"J159NR","Personenauto","VOLVO","XC60 T5","20250510","20240511","2388","stationwagen","5","ZWART","Niet geregistreerd","4","1969","1733","2330","1833","750","1600","20150624","20200919","Geen verstrekking in Open Data","65005","Nee","210",,,,,,"4","4",,,,,,"M1",,,,"2330",,,,,,,"0.10","277","Nee","Ja",,"Nee",,,,"2024","Geen oordeel","05","Ja","2025-05-10T00:00:00.000","2024-05-11T00:00:00.000","2015-06-24T00:00:00.000","2020-09-19T00:00:00.000",,,,,,,,,,,,,,,,,,,,,,,,,,,,"https://opendata.rdw.nl/resource/3huj-srit.json","https://opendata.rdw.nl/resource/8ys7-d773.json","https://opendata.rdw.nl/resource/vezc-m2t6.json","https://opendata.rdw.nl/resource/jhie-znh9.json","https://opendata.rdw.nl/resource/kmfi-hrps.json"
"J253KH","Personenauto","VOLVO","XC60 T5","20240825","20200829","7859","stationwagen","5","ZWART","Niet geregistreerd","4","1969","1781","2330","1881","750","1600","20141211","20200829","Geen verstrekking in Open Data","53634","Ja","210",,,,,,"4","4",,,,,,"M1",,,"r. dwarsbalk r. voorzitting","2330",,,,,,,"0.10","277","Nee","Nee",,"Nee","3930",,,"2023","Geen oordeel","05","Ja","2024-08-25T00:00:00.000","2020-08-29T00:00:00.000","2014-12-11T00:00:00.000","2020-08-29T00:00:00.000",,,,,,,,,,,,,,,,,,,,,,"20221118","2022-11-18T00:00:00.000",,,,,"https://opendata.rdw.nl/resource/3huj-srit.json","https://opendata.rdw.nl/resource/8ys7-d773.json","https://opendata.rdw.nl/resource/vezc-m2t6.json","https://opendata.rdw.nl/resource/jhie-znh9.json","https://opendata.rdw.nl/resource/kmfi-hrps.json"
"J402TP","Personenauto","VOLVO","XC60 T5 INSCRIPTION","20241002","20220202","5639","stationwagen","5","GRIJS","Niet geregistreerd","4","1969","1827","2410","1927","750","2300","20181002","20201022","Geen verstrekking in Open Data","90196","Ja","210",,,,,,"4","4",,,,,,"M1",,,,"2410",,,,,,,"0.10","287","Nee","Nee",,"Nee","4710",,,"2022","Geen oordeel","05","Ja","2024-10-02T00:00:00.000","2022-02-02T00:00:00.000","2018-10-02T00:00:00.000","2020-10-22T00:00:00.000",,,,,,,,,,,,,,,,,,,,,,,,,,,,"https://opendata.rdw.nl/resource/3huj-srit.json","https://opendata.rdw.nl/resource/8ys7-d773.json","https://opendata.rdw.nl/resource/vezc-m2t6.json","https://opendata.rdw.nl/resource/jhie-znh9.json","https://opendata.rdw.nl/resource/kmfi-hrps.json"
"JP736D","Personenauto","VOLVO","XC60 T5","20250405","20160510","7863","MPV","5","ZWART","Niet geregistreerd","4","1998","1780","2505","1880",,,"20150331","20160510","Geen verstrekking in Open Data","53407","Ja",,,,,,,"4","4",,,,,,"M1",,,"r. bodemplaat onder voorzitting","2505",,,,,,,"0.10","278","Nee","Nee",,"Nee",,,,"2024","Geen oordeel","05","Ja","2025-04-05T00:00:00.000","2016-05-10T00:00:00.000","2015-03-31T00:00:00.000","2016-05-10T00:00:00.000",,,,,,,,,,,,,,,,,,,,,,,,,,,,"https://opendata.rdw.nl/resource/3huj-srit.json","https://opendata.rdw.nl/resource/8ys7-d773.json","https://opendata.rdw.nl/resource/vezc-m2t6.json","https://opendata.rdw.nl/resource/jhie-znh9.json","https://opendata.rdw.nl/resource/kmfi-hrps.json"
"JZ073F","Personenauto","VOLVO","XC60 T5","20241126","20191127","39765","MPV","5","ZWART","Niet geregistreerd","4","1999","1720","2270","1820",,"1800","20140228","20160704","Geen verstrekking in Open Data","82547","Ja",,,,,,,"4","4",,,,,,"M1",,,"r. bodemplaat voorzitting","2270",,,,,,,"0.10","279","Nee","Nee",,"Nee","4070",,,"2023","Geen oordeel","05","Ja","2024-11-26T00:00:00.000","2019-11-27T00:00:00.000","2014-02-28T00:00:00.000","2016-07-04T00:00:00.000",,,,,,,,,,,,,,,,,,,,,,,,,,,,"https://opendata.rdw.nl/resource/3huj-srit.json","https://opendata.rdw.nl/resource/8ys7-d773.json","https://opendata.rdw.nl/resource/vezc-m2t6.json","https://opendata.rdw.nl/resource/jhie-znh9.json","https://opendata.rdw.nl/resource/kmfi-hrps.json"
"JZ089P","Personenauto","VOLVO","XC60 T5","20240630","20160708","7938","MPV","5","GRIJS","Niet geregistreerd","4","1969","1617","2505","1717","750","1600","20140630","20160708","Geen verstrekking in Open Data","72068","Ja",,,,,,,"4","4",,,,,,"M1",,,"r. balk by voorzitting","2505",,,,,,,"0.10","277","Nee","Nee",,"Nee",,,,"2023","Geen oordeel","05","Ja","2024-06-30T00:00:00.000","2016-07-08T00:00:00.000","2014-06-30T00:00:00.000","2016-07-08T00:00:00.000",,,,,,,,,,,,,,,,,,,,,,,,,,,,"https://opendata.rdw.nl/resource/3huj-srit.json","https://opendata.rdw.nl/resource/8ys7-d773.json","https://opendata.rdw.nl/resource/vezc-m2t6.json","https://opendata.rdw.nl/resource/jhie-znh9.json","https://opendata.rdw.nl/resource/kmfi-hrps.json"
"K535NZ","Personenauto","VOLVO","XC60 T5","20250126","20210618","4674","MPV","5","BRUIN","Niet geregistreerd","4","1999","1805","2270","1905",,"1800","20171027","20210320","Geen verstrekking in Open Data","104414","Ja","210",,,,,,"4","4",,,,,,"M1",,,,"2270",,,,,,,"0.09","278","Nee","Nee",,"Nee","4070",,,"2023","Geen oordeel","05","Ja","2025-01-26T00:00:00.000","2021-06-18T00:00:00.000","2017-10-27T00:00:00.000","2021-03-20T00:00:00.000",,,,,,,,,,,,,,,,,,,,,,,,,,,,"https://opendata.rdw.nl/resource/3huj-srit.json","https://opendata.rdw.nl/resource/8ys7-d773.json","https://opendata.rdw.nl/resource/vezc-m2t6.json","https://opendata.rdw.nl/resource/jhie-znh9.json","https://opendata.rdw.nl/resource/kmfi-hrps.json"
"K555GG","Personenauto","VOLVO","XC60 T5","20250510","20210122","1917","stationwagen","5","WIT","Niet geregistreerd","4","1969","1801","2330","1901","750","1722","20170510","20201214","Geen verstrekking in Open Data","61076","Ja","210",,,,,,"4","4",,,,,,"M1",,,,"2330","D",,,,,,"0.09","278","Nee","Nee",,"Nee",,,,"2024","Geen oordeel","05","Ja","2025-05-10T00:00:00.000","2021-01-22T00:00:00.000","2017-05-10T00:00:00.000","2020-12-14T00:00:00.000",,,,,,,,,,,,,,,,,,,,,,,,,,,,"https://opendata.rdw.nl/resource/3huj-srit.json","https://opendata.rdw.nl/resource/8ys7-d773.json","https://opendata.rdw.nl/resource/vezc-m2t6.json","https://opendata.rdw.nl/resource/jhie-znh9.json","https://opendata.rdw.nl/resource/kmfi-hrps.json"
"K700HK","Personenauto","VOLVO","XC60 T5","20241224","20240323","5732","stationwagen","5","ZWART","Niet geregistreerd","4","1969","1801","2331","1901",,,"20150701","20201216","Geen verstrekking in Open Data","101449","Ja","210",,,,,,"4","4",,,,,,"M1",,,,"2331","D",,,,,,"0.09","277","Nee","Ja",,"Nee",,,,"2023","Geen oordeel","05","Ja","2024-12-24T00:00:00.000","2024-03-23T00:00:00.000","2015-07-01T00:00:00.000","2020-12-16T00:00:00.000",,,,,,,,,,,,,,,,,,,,,,,,,,,,"https://opendata.rdw.nl/resource/3huj-srit.json","https://opendata.rdw.nl/resource/8ys7-d773.json","https://opendata.rdw.nl/resource/vezc-m2t6.json","https://opendata.rdw.nl/resource/jhie-znh9.json","https://opendata.rdw.nl/resource/kmfi-hrps.json"
"K970ZL","Personenauto","VOLVO","XC60 T5","20250318","20210331","37464","stationwagen","5","GRIJS","Niet geregistreerd","4","1999","1769","2270","1869",,,"20140228","20210331","Geen verstrekking in Open Data","87191","Ja",,,,,,,"4","4",,,,,,"M1",,,,"2270",,,,,,,"0.09","227","Nee","Nee",,"Nee",,,,"2024","Geen oordeel","05","Ja","2025-03-18T00:00:00.000","2021-03-31T00:00:00.000","2014-02-28T00:00:00.000","2021-03-31T00:00:00.000",,,,,,,,,,,,,,,,,,,,,,,,,,,,"https://opendata.rdw.nl/resource/3huj-srit.json","https://opendata.rdw.nl/resource/8ys7-d773.json","https://opendata.rdw.nl/resource/vezc-m2t6.json","https://opendata.rdw.nl/resource/jhie-znh9.json","https://opendata.rdw.nl/resource/kmfi-hrps.json"
"K971ZL","Personenauto","VOLVO","XC60 T5","20250318","20220602","45089","stationwagen","5","ZWART","Niet geregistreerd","4","1969","1746","2505","1846",,,"20160228","20210331","Geen verstrekking in Open Data","98575","Ja",,,,,,,"4","4",,,,,,"M1",,,,"2505",,,,,,,"0.09","277","Nee","Nee",,"Nee",,,,"2024","Geen oordeel","05","Ja","2025-03-18T00:00:00.000","2022-06-02T00:00:00.000","2016-02-28T00:00:00.000","2021-03-31T00:00:00.000",,,,,,,,,,,,,,,,,,,,,,,,,,,,"https://opendata.rdw.nl/resource/3huj-srit.json","https://opendata.rdw.nl/resource/8ys7-d773.json","https://opendata.rdw.nl/resource/vezc-m2t6.json","https://opendata.rdw.nl/resource/jhie-znh9.json","https://opendata.rdw.nl/resource/kmfi-hrps.json"
"KF926S","Personenauto","VOLVO","XC60 T5 AWD","20250514","20200514","49429","MPV","5","ZWART","Niet geregistreerd","5","2497","1817","2390","1917",,,"20150228","20160817","Geen verstrekking in Open Data","100363","Ja",,,,,,,"4","4",,,,,,"M1",,,"r. bodemplaat by voorzitting","2390",,,,,,,"0.10","277","Nee","Nee",,"Nee",,,,"2024","Geen oordeel","05","Ja","2025-05-14T00:00:00.000","2020-05-14T00:00:00.000","2015-02-28T00:00:00.000","2016-08-17T00:00:00.000",,,,,,,,,,,,,,,,,,,,,,,,,,,,"https://opendata.rdw.nl/resource/3huj-srit.json","https://opendata.rdw.nl/resource/8ys7-d773.json","https://opendata.rdw.nl/resource/vezc-m2t6.json","https://opendata.rdw.nl/resource/jhie-znh9.json","https://opendata.rdw.nl/resource/kmfi-hrps.json"
"KG894Z","Personenauto","VOLVO","XC60 T5","20241228","20231229","14880","hatchback","5","GRIJS","Niet geregistreerd","4","1999","1710","2270","1810","750","1800","20140520","20160830","Geen verstrekking in Open Data","52995","Ja",,,,,,,"4","4",,,,,,"M1",,,"r. bodemplaat by voorzitting","2270",,,,,,,"0.10","277","Nee","Nee",,"Nee",,,,"2024","Geen oordeel","05","Ja","2024-12-28T00:00:00.000","2023-12-29T00:00:00.000","2014-05-20T00:00:00.000","2016-08-30T00:00:00.000",,,,,,,,,,,,,,,,,,,,,,,,,,,,"https://opendata.rdw.nl/resource/3huj-srit.json","https://opendata.rdw.nl/resource/8ys7-d773.json","https://opendata.rdw.nl/resource/vezc-m2t6.json","https://opendata.rdw.nl/resource/jhie-znh9.json","https://opendata.rdw.nl/resource/kmfi-hrps.json"
"KL102R","Personenauto","VOLVO","XC60 T5","20240621","20230622","9511","stationwagen","5","WIT","Niet geregistreerd","4","1969","1650","2505","1750",,,"20160211","20161005","Geen verstrekking in Open Data","49995","Ja",,,,,,,"4","4",,,,,,"M1",,,"r. bodemplaat by voorzitting","2505",,,,,,,"0.10","278","Nee","Nee",,"Nee",,,,"2023","Geen oordeel","05","Ja","2024-06-21T00:00:00.000","2023-06-22T00:00:00.000","2016-02-11T00:00:00.000","2016-10-05T00:00:00.000",,,,,,,,,,,,,,,,,,,,,,,,,,,,"https://opendata.rdw.nl/resource/3huj-srit.json","https://opendata.rdw.nl/resource/8ys7-d773.json","https://opendata.rdw.nl/resource/vezc-m2t6.json","https://opendata.rdw.nl/resource/jhie-znh9.json","https://opendata.rdw.nl/resource/kmfi-hrps.json"
"KL109R","Personenauto","VOLVO","XC60 T5","20240527","20200525","37395","stationwagen","5","GRIJS","Niet geregistreerd","4","2000","1670","2270","1770",,,"20140917","20161005","Geen verstrekking in Open Data","73181","Ja",,,,,,,"4","4",,,,,,"M1",,,"r. by voorzitting","2270",,,,,,,"0.10","278","Nee","Nee",,"Nee",,,,"2023","Geen oordeel","05","Ja","2024-05-27T00:00:00.000","2020-05-25T00:00:00.000","2014-09-17T00:00:00.000","2016-10-05T00:00:00.000",,,,,,,,,,,,,,,,,,,,,,,,,,,,"https://opendata.rdw.nl/resource/3huj-srit.json","https://opendata.rdw.nl/resource/8ys7-d773.json","https://opendata.rdw.nl/resource/vezc-m2t6.json","https://opendata.rdw.nl/resource/jhie-znh9.json","https://opendata.rdw.nl/resource/kmfi-hrps.json"
"L998RT","Personenauto","VOLVO","XC60 T5","20250501","20210728","7855","stationwagen","5","BLAUW","Niet geregistreerd","4","1969","1801","2330","1901",,,"20150130","20210728","Geen verstrekking in Open Data","59680","Ja","210",,,,,,"4","4",,,,,,"M1",,,"r. op dwarsbalk by voorzitting","2330",,,,,,,"0.09","277","Nee","Nee",,"Nee",,,,"2024","Geen oordeel","05","Ja","2025-05-01T00:00:00.000","2021-07-28T00:00:00.000","2015-01-30T00:00:00.000","2021-07-28T00:00:00.000",,,,,,,,,,,,,,,,,,,,,,,,,,,,"https://opendata.rdw.nl/resource/3huj-srit.json","https://opendata.rdw.nl/resource/8ys7-d773.json","https://opendata.rdw.nl/resource/vezc-m2t6.json","https://opendata.rdw.nl/resource/jhie-znh9.json","https://opendata.rdw.nl/resource/kmfi-hrps.json"
"N015GN","Personenauto","VOLVO","XC60 T5 AWD","20250131","20211004","48442","MPV","5","BLAUW","Niet geregistreerd","4","1969","1866","2430","1966",,,"20190131","20211004","Geen verstrekking in Open Data","107812","Ja",,,,,,,"4","4",,,,,,"M1",,,,"2430",,,,,,,"0.10","287","Nee","Ja",,"Nee",,,,"2023","Geen oordeel","05","Ja","2025-01-31T00:00:00.000","2021-10-04T00:00:00.000","2019-01-31T00:00:00.000","2021-10-04T00:00:00.000",,,,,,,,,,,,,,,,,,,,,,,,,,,,"https://opendata.rdw.nl/resource/3huj-srit.json","https://opendata.rdw.nl/resource/8ys7-d773.json","https://opendata.rdw.nl/resource/vezc-m2t6.json","https://opendata.rdw.nl/resource/jhie-znh9.json","https://opendata.rdw.nl/resource/kmfi-hrps.json"
"N157PZ","Personenauto","VOLVO","XC60 T5","20241228","20211228","6244","stationwagen","5","ZWART","Niet geregistreerd","4","1969","1703","2331","1803","750","1800","20160714","20211228","Geen verstrekking in Open Data","63123","Ja","210",,,,,,"4","4",,,,"464","189","M1",,,,"2331","XC60",,,,,,"0.10","277","Nee","Nee",,"Nee","4131",,,"2024","Geen oordeel","05","Ja","2024-12-28T00:00:00.000","2021-12-28T00:00:00.000","2016-07-14T00:00:00.000","2021-12-28T00:00:00.000",,,,,,,,,,,"171",,,,,,,,,,,"20211008","2021-10-08T00:00:00.000",,,,,"https://opendata.rdw.nl/resource/3huj-srit.json","https://opendata.rdw.nl/resource/8ys7-d773.json","https://opendata.rdw.nl/resource/vezc-m2t6.json","https://opendata.rdw.nl/resource/jhie-znh9.json","https://opendata.rdw.nl/resource/kmfi-hrps.json"
"N433JB","Personenauto","VOLVO","XC60 T5 FWD","20241027","20211103","5316","stationwagen","5","ZWART","Niet geregistreerd","4","1969","1594","2330","1694","750","1600","20140925","20211103","Geen verstrekking in Open Data","87698","Ja","210",,,,,,"4","4",,,,,,"M1",,,,"2330","XC60 T5 FWD",,,,,,"0.11","277","Nee","Nee",,"Nee","3930",,,"2023","Geen oordeel","05","Ja","2024-10-27T00:00:00.000","2021-11-03T00:00:00.000","2014-09-25T00:00:00.000","2021-11-03T00:00:00.000",,,,,,,,,,,,,,,,,,,,,,"20211028","2021-10-28T00:00:00.000",,,,,"https://opendata.rdw.nl/resource/3huj-srit.json","https://opendata.rdw.nl/resource/8ys7-d773.json","https://opendata.rdw.nl/resource/vezc-m2t6.json","https://opendata.rdw.nl/resource/jhie-znh9.json","https://opendata.rdw.nl/resource/kmfi-hrps.json"
"N770ZP","Personenauto","VOLVO","XC60 T5","20250317","20220318","2707","stationwagen","5","GRIJS","Niet geregistreerd","4","1999","1594","2330","1694",,,"20130714","20220117","Geen verstrekking in Open Data","58267","Ja",,,,,,,"4","4",,,,,,"M1",,,,"2330","XC60 T5",,,,,,"0.10","277","Nee","Nee",,"Nee",,,,"2024","Geen oordeel","05","Ja","2025-03-17T00:00:00.000","2022-03-18T00:00:00.000","2013-07-14T00:00:00.000","2022-01-17T00:00:00.000",,,,,,,,,,,,,,,,,,,,,,"20211231","2021-12-31T00:00:00.000",,,,,"https://opendata.rdw.nl/resource/3huj-srit.json","https://opendata.rdw.nl/resource/8ys7-d773.json","https://opendata.rdw.nl/resource/vezc-m2t6.json","https://opendata.rdw.nl/resource/jhie-znh9.json","https://opendata.rdw.nl/resource/kmfi-hrps.json"
"NG126N","Personenauto","VOLVO","XC60 T5","20250411","20240412","40239","stationwagen","5","ZWART","Niet geregistreerd","4","1999","1730","2270","1830","750","1800","20140126","20170113","Geen verstrekking in Open Data","86198","Ja",,,,,,,"4","4",,,,,,"M1",,,"r. bodemplaat by voorzitting","2270",,,,,,,"0.10","277","Nee","Nee",,"Nee",,,,"2024","Geen oordeel","05","Ja","2025-04-11T00:00:00.000","2024-04-12T00:00:00.000","2014-01-26T00:00:00.000","2017-01-13T00:00:00.000",,,,,,,,,,,,,,,,,,,,,,,,,,,,"https://opendata.rdw.nl/resource/3huj-srit.json","https://opendata.rdw.nl/resource/8ys7-d773.json","https://opendata.rdw.nl/resource/vezc-m2t6.json","https://opendata.rdw.nl/resource/jhie-znh9.json","https://opendata.rdw.nl/resource/kmfi-hrps.json"
"R821SN","Personenauto","VOLVO","XC60 T5","20250126","20230204","2520","stationwagen","5","WIT","Niet geregistreerd","4","1999","1606","2270","1706",,"1800","20111005","20230204","Geen verstrekking in Open Data","68398","Ja",,,,,,,"4","4",,,,,,"M1",,,,"2270",,,,,,,"0.10","277","Nee","Nee",,"Nee","4070",,,"2024","Geen oordeel","05","Ja","2025-01-26T00:00:00.000","2023-02-04T00:00:00.000","2011-10-05T00:00:00.000","2023-02-04T00:00:00.000",,,,,,,,,,,,,,,,,,,,,,"20220812","2022-08-12T00:00:00.000",,,,,"https://opendata.rdw.nl/resource/3huj-srit.json","https://opendata.rdw.nl/resource/8ys7-d773.json","https://opendata.rdw.nl/resource/vezc-m2t6.json","https://opendata.rdw.nl/resource/jhie-znh9.json","https://opendata.rdw.nl/resource/kmfi-hrps.json"
"RF379S","Personenauto","VOLVO","XC60 T5","20250323","20230331","7938","stationwagen","5","BRUIN","Niet geregistreerd","4","1969","1733","2330","1833","750","1600","20140224","20171124","Geen verstrekking in Open Data","57110","Ja",,,,,,,"4","4",,,,,,"M1",,,"r. dwarsbalk v. voorzitting","2330","D",,,,,,"0.10","278","Nee","Nee",,"Nee",,,,"2024","Geen oordeel","05","Ja","2025-03-23T00:00:00.000","2023-03-31T00:00:00.000","2014-02-24T00:00:00.000","2017-11-24T00:00:00.000",,,,,,,,,,,,,,,,,,,,,,,,,,,,"https://opendata.rdw.nl/resource/3huj-srit.json","https://opendata.rdw.nl/resource/8ys7-d773.json","https://opendata.rdw.nl/resource/vezc-m2t6.json","https://opendata.rdw.nl/resource/jhie-znh9.json","https://opendata.rdw.nl/resource/kmfi-hrps.json"