"kenteken","voertuigsoort","merk","handelsbenaming","vervaldatum_apk","datum_tenaamstelling","bruto_bpm","inrichting","aantal_zitplaatsen","eerste_kleur","tweede_kleur","aantal_cilinders","cilinderinhoud","massa_ledig_voertuig","toegestane_maximum_massa_voertuig","massa_rijklaar","maximum_massa_trekken_ongeremd","maximum_trekken_massa_geremd","datum_eerste_toelating","datum_eerste_tenaamstelling_in_nederland","wacht_op_keuren","catalogusprijs","wam_verzekerd","maximale_constructiesnelheid","laadvermogen","oplegger_geremd","aanhangwagen_autonoom_geremd","aanhangwagen_middenas_geremd","aantal_staanplaatsen","aantal_deuren","aantal_wielen","afstand_hart_koppeling_tot_achterzijde_voertuig","afstand_voorzijde_voertuig_tot_hart_koppeling","afwijkende_maximum_snelheid","lengte","breedte","europese_voertuigcategorie","europese_voertuigcategorie_toevoeging","europese_uitvoeringcategorie_toevoeging","plaats_chassisnummer","technische_max_massa_voertuig","type","type_gasinstallatie","typegoedkeuringsnummer","variant","uitvoering","volgnummer_wijziging_eu_typegoedkeuring","vermogen_massarijklaar","wielbasis","export_indicator","openstaande_terugroepactie_indicator","vervaldatum_tachograaf","taxi_indicator","maximum_massa_samenstelling","aantal_rolstoelplaatsen","maximum_ondersteunende_snelheid","jaar_laatste_registratie_tellerstand","tellerstandoordeel","code_toelichting_tellerstandoordeel","tenaamstellen_mogelijk","vervaldatum_apk_dt","datum_tenaamstelling_dt","datum_eerste_toelating_dt","datum_eerste_tenaamstelling_in_nederland_dt","vervaldatum_tachograaf_dt","maximum_last_onder_de_vooras_sen_tezamen_koppeling","type_remsysteem_voertuig_code","rupsonderstelconfiguratiecode","wielbasis_voertuig_minimum","wielbasis_voertuig_maximum","lengte_voertuig_minimum","lengte_voertuig_maximum","breedte_voertuig_minimum","breedte_voertuig_maximum","hoogte_voertuig","hoogte_voertuig_minimum","hoogte_voertuig_maximum","massa_bedrijfsklaar_minimaal","massa_bedrijfsklaar_maximaal","technisch_toelaatbaar_massa_koppelpunt","maximum_massa_technisch_maximaal","maximum_massa_technisch_minimaal","subcategorie_nederland","verticale_belasting_koppelpunt_getrokken_voertuig","zuinigheidsclassificatie","registratie_datum_goedkeuring_afschrijvingsmoment_bpm","registratie_datum_goedkeuring_afschrijvingsmoment_bpm_dt","gem_lading_wrde","aerodyn_voorz","massa_alt_aandr","verl_cab_ind","api_gekentekende_voertuigen_assen","api_gekentekende_voertuigen_brandstof","api_gekentekende_voertuigen_carrosserie","api_gekentekende_voertuigen_carrosserie_specifiek","api_gekentekende_voertuigen_voertuigklasse"
"G165LL","Personenauto","VOLVO","V60 TWIN ENGINE","20240921","20230526","418","stationwagen","5","ROOD","Niet geregistreerd","5","2400","1880","2505","1980","750","1800","20161124","20191023","Geen verstrekking in Open Data","53784","Ja","210",,,,,,"5","4","0","0",,"464","187","M1",,,,"2505","G",,"e9*2007/46*0093*10","GWBN","GWBNH0??","0","0.01","278","Nee","Nee",,"Nee","4305","0","0.00","2023","Geen oordeel","05","Ja","2024-09-21T00:00:00.000","2023-05-26T00:00:00.000","2016-11-24T00:00:00.000","2019-10-23T00:00:00.000",,,,,,,,,,,"148",,,,,,,,,,"A",,,,,,,"https://opendata.rdw.nl/resource/3huj-srit.json","https://opendata.rdw.nl/resource/8ys7-d773.json","https://opendata.rdw.nl/resource/vezc-m2t6.json","https://opendata.rdw.nl/resource/jhie-znh9.json","https://opendata.rdw.nl/resource/kmfi-hrps.json"
"G227LH","Personenauto","VOLVO","V60 TWIN ENGINE","20240829","20191203","1654","stationwagen","5","ZWART","Niet geregistreerd","5","2400","1880","2505","1980","750","1800","20180829","20191203","Geen verstrekking in Open Data","56780","Ja","210",,,,,,"5","4","0","0",,"464","187","M1",,,,"2505","G",,"e9*2007/46*0093*11","GWBN","GWBNH0??","2","0.01","278","Nee","Nee",,"Nee","4305","0","0.00","2024","Geen oordeel","05","Ja","2024-08-29T00:00:00.000","2019-12-03T00:00:00.000","2018-08-29T00:00:00.000","2019-12-03T00:00:00.000",,,,,,,,,,,"148",,,,,,,,,,"A",,,,,,,"https://opendata.rdw.nl/resource/3huj-srit.json","https://opendata.rdw.nl/resource/8ys7-d773.json","https://opendata.rdw.nl/resource/vezc-m2t6.json","https://opendata.rdw.nl/resource/jhie-znh9.json","https://opendata.rdw.nl/resource/kmfi-hrps.json"
"G491FL","Personenauto","VOLVO","V60 TWIN ENGINE","20250402","20191106","1471","stationwagen","5","WIT","Niet geregistreerd","5","2400","1880","2505","1980","750","1800","20170315","20190911","Geen verstrekking in Open Data","53764","Ja","210",,,,,,"5","4","0","0",,"464","187","M1",,,,"2505","G",,"e9*2007/46*0093*10","GWBN","GWBNH0??","0","0.01","278","Nee","Nee",,"Nee","4305","0","0.00","2024","Geen oordeel","05","Ja","2025-04-02T00:00:00.000","2019-11-06T00:00:00.000","2017-03-15T00:00:00.000","2019-09-11T00:00:00.000",,,,,,,,,,,"148",,,,,,,,,,"A",,,,,,,"https://opendata.rdw.nl/resource/3huj-srit.json","https://opendata.rdw.nl/resource/8ys7-d773.json","https://opendata.rdw.nl/resource/vezc-m2t6.json","https://opendata.rdw.nl/resource/jhie-znh9.json","https://opendata.rdw.nl/resource/kmfi-hrps.json"
"G677GH","Personenauto","VOLVO","V60 TWIN ENGINE","20250320","20230323","1485","stationwagen","5","ZWART","Niet geregistreerd","5","2400","1880","2505","1980","750","1800","20171110","20190928","Geen verstrekking in Open Data","57146","Ja","210",,,,,,"5","4","0","0",,"464","187","M1",,,,"2505","G",,"e9*2007/46*0093*11","GWBN","GWBNH0??","2","0.01","278","Nee","Nee",,"Nee","4305","0","0.00","2024","Geen oordeel","05","Ja","2025-03-20T00:00:00.000","2023-03-23T00:00:00.000","2017-11-10T00:00:00.000","2019-09-28T00:00:00.000",,,,,,,,,,,"148",,,,,,,,,,"A",,,,,,,"https://opendata.rdw.nl/resource/3huj-srit.json","https://opendata.rdw.nl/resource/8ys7-d773.json","https://opendata.rdw.nl/resource/vezc-m2t6.json","https://opendata.rdw.nl/resource/jhie-znh9.json","https://opendata.rdw.nl/resource/kmfi-hrps.json"
"G925KN","Personenauto","VOLVO","V60 TWIN ENGINE","20241122","20191026","376","stationwagen","5","BLAUW","Niet geregistreerd","5","2400","1880","2505","1980","750","1800","20161122","20191026","Geen verstrekking in Open Data","53784","Ja","210",,,,,,"5","4","0","0",,"464","187","M1",,,,"2505","G",,"e9*2007/46*0093*10","GWBN","GWBNH0??","0","0.01","278","Nee","Nee",,"Nee","4305","0","0.00","2024","Geen oordeel","05","Ja","2024-11-22T00:00:00.000","2019-10-26T00:00:00.000","2016-11-22T00:00:00.000","2019-10-26T00:00:00.000",,,,,,,,,,,"148",,,,,,,,,,"A",,,,,,,"https://opendata.rdw.nl/resource/3huj-srit.json","https://opendata.rdw.nl/resource/8ys7-d773.json","https://opendata.rdw.nl/resource/vezc-m2t6.json","https://opendata.rdw.nl/resource/jhie-znh9.json","https://opendata.rdw.nl/resource/kmfi-hrps.json"
"G993SZ","Personenauto","VOLVO","V60 TWIN ENGINE","20241202","20231024","1763","stationwagen","5","WIT","Niet geregistreerd","5","2400","1880","2505","1980","750","1800","20171130","20191204","Geen verstrekking in Open Data","58040","Ja","210",,,,,,"5","4","0","0",,"464","187","M1",,,,"2505","G",,"e9*2007/46*0093*11","GWBN","GWBNH0??","2","0.01","278","Nee","Nee",,"Nee","4305","0","0.00","2024","Geen oordeel","05","Ja","2024-12-02T00:00:00.000","2023-10-24T00:00:00.000","2017-11-30T00:00:00.000","2019-12-04T00:00:00.000",,,,,,,,,,,"148",,,,,,,,,,"A",,,,,,,"https://opendata.rdw.nl/resource/3huj-srit.json","https://opendata.rdw.nl/resource/8ys7-d773.json","https://opendata.rdw.nl/resource/vezc-m2t6.json","https://opendata.rdw.nl/resource/jhie-znh9.json","https://opendata.rdw.nl/resource/kmfi-hrps.json"
"GF052Z","Personenauto","VOLVO","V60 TWIN ENGINE","20240521","20210526","463","stationwagen","5","ZWART","Niet geregistreerd","5","2400","1880","2505","1980","750","1800","20150508","20150508","Geen verstrekking in Open Data","71400","Ja",,,,,,,"5","4","0","0",,"464","0","M1",,,"r. onder voorzitting","2505","G",,"e9*2007/46*0093*08","GWDC","GWDCH0??","0","0.01","278","Nee","Nee",,"Nee","4305","0","0.00","2024","Logisch","00","Ja","2024-05-21T00:00:00.000","2021-05-26T00:00:00.000","2015-05-08T00:00:00.000","2015-05-08T00:00:00.000",,,,,,,,,,,,,,,,,,,,,"A",,,,,,,"https://opendata.rdw.nl/resource/3huj-srit.json","https://opendata.rdw.nl/resource/8ys7-d773.json","https://opendata.rdw.nl/resource/vezc-m2t6.json","https://opendata.rdw.nl/resource/jhie-znh9.json","https://opendata.rdw.nl/resource/kmfi-hrps.json"
"GF053Z","Personenauto","VOLVO","V60 TWIN ENGINE","20250509","20210401","463","stationwagen","5","BLAUW","Niet geregistreerd","5","2400","1880","2505","1980","750","1800","20150507","20150507","Geen verstrekking in Open Data","70700","Ja",,,,,,,"5","4","0","0",,"464","0","M1",,,"r. onder voorzitting","2505","G",,"e9*2007/46*0093*08","GWDC","GWDCH0??","0","0.01","278","Nee","Nee",,"Nee","4305","0","0.00","2024","Logisch","00","Ja","2025-05-09T00:00:00.000","2021-04-01T00:00:00.000","2015-05-07T00:00:00.000","2015-05-07T00:00:00.000",,,,,,,,,,,,,,,,,,,,,"A",,,,,,,"https://opendata.rdw.nl/resource/3huj-srit.json","https://opendata.rdw.nl/resource/8ys7-d773.json","https://opendata.rdw.nl/resource/vezc-m2t6.json","https://opendata.rdw.nl/resource/jhie-znh9.json","https://opendata.rdw.nl/resource/kmfi-hrps.json"
"GF056Z","Personenauto","VOLVO","V60 TWIN ENGINE","20250206","20200815","463","stationwagen","5","ZWART","Niet geregistreerd","5","2400","1880","2505","1980","750","1800","20150513","20150513","Geen verstrekking in Open Data","66575","Ja",,,,,,,"5","4","0","0",,"464","0","M1",,,"r. onder voorzitting","2505","G",,"e9*2007/46*0093*08","GWDC","GWDCH0??","0","0.01","278","Nee","Nee",,"Nee","4305","0","0.00","2024","Logisch","00","Ja","2025-02-06T00:00:00.000","2020-08-15T00:00:00.000","2015-05-13T00:00:00.000","2015-05-13T00:00:00.000",,,,,,,,,,,,,,,,,,,,,"A",,,,,,,"https://opendata.rdw.nl/resource/3huj-srit.json","https://opendata.rdw.nl/resource/8ys7-d773.json","https://opendata.rdw.nl/resource/vezc-m2t6.json","https://opendata.rdw.nl/resource/jhie-znh9.json","https://opendata.rdw.nl/resource/kmfi-hrps.json"
"GF368L","Personenauto","VOLVO","V60 TWIN ENGINE","20250217","20200217","463","stationwagen","5","ZWART","Niet geregistreerd","5","2400","1880","2505","1980","750","1800","20150505","20150505","Geen verstrekking in Open Data","69484","Ja",,,,,,,"5","4","0","0",,"464","0","M1",,,"r. onder voorzitting","2505","G",,"e9*2007/46*0093*08","GWDC","GWDCH0??","0","0.01","278","Nee","Ja",,"Nee","4305","0","0.00","2024","Logisch","00","Ja","2025-02-17T00:00:00.000","2020-02-17T00:00:00.000","2015-05-05T00:00:00.000","2015-05-05T00:00:00.000",,,,,,,,,,,,,,,,,,,,,"A",,,,,,,"https://opendata.rdw.nl/resource/3huj-srit.json","https://opendata.rdw.nl/resource/8ys7-d773.json","https://opendata.rdw.nl/resource/vezc-m2t6.json","https://opendata.rdw.nl/resource/jhie-znh9.json","https://opendata.rdw.nl/resource/kmfi-hrps.json"
"GF560S","Personenauto","VOLVO","V60 TWIN ENGINE","20250204","20150511","463","stationwagen","5","ZWART","Niet geregistreerd","5","2400","1880","2505","1980","750","1800","20150511","20150511","Geen verstrekking in Open Data","67215","Ja",,,,,,,"5","4","0","0",,"464","0","M1",,,"r. onder voorzitting","2505","G",,"e9*2007/46*0093*08","GWDC","GWDCH0??","0","0.01","278","Nee","Nee",,"Nee","4305","0","0.00","2023","Logisch","00","Ja","2025-02-04T00:00:00.000","2015-05-11T00:00:00.000","2015-05-11T00:00:00.000","2015-05-11T00:00:00.000",,,,,,,,,,,,,,,,,,,,,"A",,,,,,,"https://opendata.rdw.nl/resource/3huj-srit.json","https://opendata.rdw.nl/resource/8ys7-d773.json","https://opendata.rdw.nl/resource/vezc-m2t6.json","https://opendata.rdw.nl/resource/jhie-znh9.json","https://opendata.rdw.nl/resource/kmfi-hrps.json"
"GF690V","Personenauto","VOLVO","V60 TWIN ENGINE","20240622","20200911","463","stationwagen","5","GRIJS","Niet geregistreerd","5","2400","1880","2505","1980","750","1800","20150513","20150513","Geen verstrekking in Open Data","71785","Ja",,,,,,,"5","4","0","0",,"464","0","M1",,,"r. onder voorzitting","2505","G",,"e9*2007/46*0093*08","GWDC","GWDCH0??","0","0.01","278","Nee","Ja",,"Nee","4305","0","0.00","2023","Logisch","00","Ja","2024-06-22T00:00:00.000","2020-09-11T00:00:00.000","2015-05-13T00:00:00.000","2015-05-13T00:00:00.000",,,,,,,,,,,,,,,,,,,,,"A",,,,,,,"https://opendata.rdw.nl/resource/3huj-srit.json","https://opendata.rdw.nl/resource/8ys7-d773.json","https://opendata.rdw.nl/resource/vezc-m2t6.json","https://opendata.rdw.nl/resource/jhie-znh9.json","https://opendata.rdw.nl/resource/kmfi-hrps.json"
"GF692V","Personenauto","VOLVO","V60 TWIN ENGINE","20250115","20200103","463","stationwagen","5","GRIJS","Niet geregistreerd","5","2400","1880","2505","1980","750","1800","20150507","20150507","Geen verstrekking in Open Data","61949","Ja",,,,,,,"5","4","0","0",,"464","0","M1",,,"r. onder voorzitting","2505","G",,"e9*2007/46*0093*08","GWDC","GWDCH0??","0","0.01","278","Nee","Nee",,"Nee","4305","0","0.00","2024","Logisch","00","Ja","2025-01-15T00:00:00.000","2020-01-03T00:00:00.000","2015-05-07T00:00:00.000","2015-05-07T00:00:00.000",,,,,,,,,,,,,,,,,,,,,"A",,,,,,,"https://opendata.rdw.nl/resource/3huj-srit.json","https://opendata.rdw.nl/resource/8ys7-d773.json","https://opendata.rdw.nl/resource/vezc-m2t6.json","https://opendata.rdw.nl/resource/jhie-znh9.json","https://opendata.rdw.nl/resource/kmfi-hrps.json"
"GG017V","Personenauto","VOLVO","V60 TWIN ENGINE","20240522","20200630","463","stationwagen","5","ZWART","Niet geregistreerd","5","2400","1880","2505","1980","750","1800","20150522","20150522","Geen verstrekking in Open Data","67195","Ja",,,,,,,"5","4","0","0",,"464","0","M1",,,"r. onder voorzitting","2505","G",,"e9*2007/46*0093*08","GWDC","GWDCH0??","0","0.01","278","Nee","Nee",,"Nee","4305","0","0.00","2023","Logisch","00","Ja","2024-05-22T00:00:00.000","2020-06-30T00:00:00.000","2015-05-22T00:00:00.000","2015-05-22T00:00:00.000",,,,,,,,,,,,,,,,,,,,,"A",,,,,,,"https://opendata.rdw.nl/resource/3huj-srit.json","https://opendata.rdw.nl/resource/8ys7-d773.json","https://opendata.rdw.nl/resource/vezc-m2t6.json","https://opendata.rdw.nl/resource/jhie-znh9.json","https://opendata.rdw.nl/resource/kmfi-hrps.json"
"GG019V","Personenauto","VOLVO","V60 TWIN ENGINE","20240804","20231227","463","stationwagen","5","GRIJS","Niet geregistreerd","5","2400","1880","2505","1980","750","1800","20150522","20150522","Geen verstrekking in Open Data","75470","Ja",,,,,,,"5","4","0","0",,"464","0","M1",,,"r. onder voorzitting","2505","G",,"e9*2007/46*0093*08","GWDC","GWDCH0??","0","0.01","278","Nee","Nee",,"Nee","4305","0","0.00","2023","Logisch","00","Ja","2024-08-04T00:00:00.000","2023-12-27T00:00:00.000","2015-05-22T00:00:00.000","2015-05-22T00:00:00.000",,,,,,,,,,,,,,,,,,,,,"A",,,,,,,"https://opendata.rdw.nl/resource/3huj-srit.json","https://opendata.rdw.nl/resource/8ys7-d773.json","https://opendata.rdw.nl/resource/vezc-m2t6.json","https://opendata.rdw.nl/resource/jhie-znh9.json","https://opendata.rdw.nl/resource/kmfi-hrps.json"
"GG020V","Personenauto","VOLVO","V60 TWIN ENGINE","20240521","20200814","463","stationwagen","5","ZWART","Niet geregistreerd","5","2400","1880","2505","1980","750","1800","20150520","20150520","Geen verstrekking in Open Data","69090","Ja",,,,,,,"5","4","0","0",,"464","0","M1",,,"r. onder voorzitting","2505","G",,"e9*2007/46*0093*08","GWDC","GWDCH0??","0","0.01","278","Nee","Nee",,"Nee","4305","0","0.00","2023","Logisch","00","Ja","2024-05-21T00:00:00.000","2020-08-14T00:00:00.000","2015-05-20T00:00:00.000","2015-05-20T00:00:00.000",,,,,,,,,,,,,,,,,,,,,"A",,,,,,,"https://opendata.rdw.nl/resource/3huj-srit.json","https://opendata.rdw.nl/resource/8ys7-d773.json","https://opendata.rdw.nl/resource/vezc-m2t6.json","https://opendata.rdw.nl/resource/jhie-znh9.json","https://opendata.rdw.nl/resource/kmfi-hrps.json"
"GG021V","Personenauto","VOLVO","V60 TWIN ENGINE","20240413","20240115","463","stationwagen","5","BLAUW","Niet geregistreerd","5","2400","1880","2505","1980","750","1800","20150529","20150529","Geen verstrekking in Open Data","67725","Ja",,,,,,,"5","4","0","0",,"464","0","M1",,,"r. onder voorzitting","2505","G",,"e9*2007/46*0093*08","GWDC","GWDCH0??","0","0.01","278","Nee","Nee",,"Nee","4305","0","0.00","2023","Logisch","00","Ja","2024-04-13T00:00:00.000","2024-01-15T00:00:00.000","2015-05-29T00:00:00.000","2015-05-29T00:00:00.000",,,,,,,,,,,,,,,,,,,,,"A",,,,,,,"https://opendata.rdw.nl/resource/3huj-srit.json","https://opendata.rdw.nl/resource/8ys7-d773.json","https://opendata.rdw.nl/resource/vezc-m2t6.json","https://opendata.rdw.nl/resource/jhie-znh9.json","https://opendata.rdw.nl/resource/kmfi-hrps.json"
"GG022V","Personenauto","VOLVO","V60 TWIN ENGINE","20240831","20231025","463","stationwagen","5","GRIJS","Niet geregistreerd","5","2400","1880","2505","1980","750","1800","20150522","20150522","Geen verstrekking in Open Data","66730","Ja",,,,,,,"5","4",,,,"464",,"M1",,,"r. onder voorzitting","2505","G",,,,,,"0.01","278","Nee","Ja",,"Ja","4305",,,"2024","Logisch","00","Ja","2024-08-31T00:00:00.000","2023-10-25T00:00:00.000","2015-05-22T00:00:00.000","2015-05-22T00:00:00.000",,,,,,,,,,,,,,,,,,,,,"A","20231103","2023-11-03T00:00:00.000",,,,,"https://opendata.rdw.nl/resource/3huj-srit.json","https://opendata.rdw.nl/resource/8ys7-d773.json","https://opendata.rdw.nl/resource/vezc-m2t6.json","https://opendata.rdw.nl/resource/jhie-znh9.json","https://opendata.rdw.nl/resource/kmfi-hrps.json"
"GG024V","Personenauto","VOLVO","V60 TWIN ENGINE","20241124","20201121","463","stationwagen","5","GRIJS","Niet geregistreerd","5","2400","1880","2505","1980","750","1800","20150523","20150523","Geen verstrekking in Open Data","65650","Ja",,,,,,,"5","4","0","0",,"464","0","M1",,,"r. onder voorzitting","2505","G",,"e9*2007/46*0093*08","GWDC","GWDCH0??","0","0.01","278","Nee","Ja",,"Nee","4305","0","0.00","2023","Logisch","00","Ja","2024-11-24T00:00:00.000","2020-11-21T00:00:00.000","2015-05-23T00:00:00.000","2015-05-23T00:00:00.000",,,,,,,,,,,,,,,,,,,,,"A",,,,,,,"https://opendata.rdw.nl/resource/3huj-srit.json","https://opendata.rdw.nl/resource/8ys7-d773.json","https://opendata.rdw.nl/resource/vezc-m2t6.json","https://opendata.rdw.nl/resource/jhie-znh9.json","https://opendata.rdw.nl/resource/kmfi-hrps.json"
"GG119Z","Personenauto","VOLVO","V60 TWIN ENGINE","20250205","20200618","463","stationwagen","5","GRIJS","Niet geregistreerd","5","2400","1880","2505","1980","750","1800","20150522","20150522","Geen verstrekking in Open Data","65385","Ja",,,,,,,"5","4","0","0",,"464","0","M1",,,"r. onder voorzitting","2505","G",,"e9*2007/46*0093*08","GWDC","GWDCH0??","0","0.01","278","Nee","Nee",,"Nee","4305","0","0.00","2024","Logisch","00","Ja","2025-02-05T00:00:00.000","2020-06-18T00:00:00.000","2015-05-22T00:00:00.000","2015-05-22T00:00:00.000",,,,,,,,,,,,,,,,,,,,,"A",,,,,,,"https://opendata.rdw.nl/resource/3huj-srit.json","https://opendata.rdw.nl/resource/8ys7-d773.json","https://opendata.rdw.nl/resource/vezc-m2t6.json","https://opendata.rdw.nl/resource/jhie-znh9.json","https://opendata.rdw.nl/resource/kmfi-hrps.json"
"GG121Z","Personenauto","VOLVO","V60 TWIN ENGINE","20240524","20231016","463","stationwagen","5","GRIJS","Niet geregistreerd","5","2400","1880","2505","1980","750","1800","20150522","20150522","Geen verstrekking in Open Data","74610","Ja",,,,,,,"5","4","0","0",,"464","0","M1",,,"r. onder voorzitting","2505","G",,"e9*2007/46*0093*08","GWDC","GWDCH0??","0","0.01","278","Nee","Nee",,"Nee","4305","0","0.00","2023","Logisch","00","Ja","2024-05-24T00:00:00.000","2023-10-16T00:00:00.000","2015-05-22T00:00:00.000","2015-05-22T00:00:00.000",,,,,,,,,,,,,,,,,,,,,"A",,,,,,,"https://opendata.rdw.nl/resource/3huj-srit.json","https://opendata.rdw.nl/resource/8ys7-d773.json","https://opendata.rdw.nl/resource/vezc-m2t6.json","https://opendata.rdw.nl/resource/jhie-znh9.json","https://opendata.rdw.nl/resource/kmfi-hrps.json"
"GG123Z","Personenauto","VOLVO","V60 TWIN ENGINE","20240527","20190502","463","stationwagen","5","ZWART","Niet geregistreerd","5","2400","1880","2505","1980","750","1800","20150527","20150527","Geen verstrekking in Open Data","70285","Ja",,,,,,,"5","4","0","0",,"464","0","M1",,,"r. onder voorzitting","2505","G",,"e9*2007/46*0093*08","GWDC","GWDCH0??","0","0.01","278","Nee","Nee",,"Nee","4305","0","0.00","2023","Logisch","00","Ja","2024-05-27T00:00:00.000","2019-05-02T00:00:00.000","2015-05-27T00:00:00.000","2015-05-27T00:00:00.000",,,,,,,,,,,,,,,,,,,,,"A",,,,,,,"https://opendata.rdw.nl/resource/3huj-srit.json","https://opendata.rdw.nl/resource/8ys7-d773.json","https://opendata.rdw.nl/resource/vezc-m2t6.json","https://opendata.rdw.nl/resource/jhie-znh9.json","https://opendata.rdw.nl/resource/kmfi-hrps.json"
"GG124Z","Personenauto","VOLVO","V60 TWIN ENGINE","20240527","20210907","463","stationwagen","5","BLAUW","Niet geregistreerd","5","2400","1880","2505","1980","750","1800","20150527","20150527","Geen verstrekking in Open Data","62090","Ja",,,,,,,"5","4","0","0",,"464","0","M1",,,"r. onder voorzitting","2505","G",,"e9*2007/46*0093*08","GWDC","GWDCH0??","0","0.01","278","Nee","Ja",,"Nee","4305","0","0.00","2023","Logisch","00","Ja","2024-05-27T00:00:00.000","2021-09-07T00:00:00.000","2015-05-27T00:00:00.000","2015-05-27T00:00:00.000",,,,,,,,,,,,,,,,,,,,,"A",,,,,,,"https://opendata.rdw.nl/resource/3huj-srit.json","https://opendata.rdw.nl/resource/8ys7-d773.json","https://opendata.rdw.nl/resource/vezc-m2t6.json","https://opendata.rdw.nl/resource/jhie-znh9.json","https://opendata.rdw.nl/resource/kmfi-hrps.json"
"GG139B","Personenauto","VOLVO","V60 TWIN ENGINE","20241206","20221209","463","stationwagen","5","GRIJS","Niet geregistreerd","5","2400","1880","2505","1980","750","1800","20150512","20150512","Geen verstrekking in Open Data","61835","Ja",,,,,,,"5","4","0","0",,"464","0","M1",,,"r. onder voorzitting","2505","G",,"e9*2007/46*0093*08","GWDC","GWDCH0??","0","0.01","278","Nee","Nee",,"Nee","4305","0","0.00","2023","Logisch","00","Ja","2024-12-06T00:00:00.000","2022-12-09T00:00:00.000","2015-05-12T00:00:00.000","2015-05-12T00:00:00.000",,,,,,,,,,,,,,,,,,,,,"A",,,,,,,"https://opendata.rdw.nl/resource/3huj-srit.json","https://opendata.rdw.nl/resource/8ys7-d773.json","https://opendata.rdw.nl/resource/vezc-m2t6.json","https://opendata.rdw.nl/resource/jhie-znh9.json","https://opendata.rdw.nl/resource/kmfi-hrps.json"
"GG140B","Personenauto","VOLVO","V60 TWIN ENGINE","20240716","20200716","463","stationwagen","5","GRIJS","Niet geregistreerd","5","2400","1880","2505","1980","750","1800","20150512","20150512","Geen verstrekking in Open Data","68970","Ja",,,,,,,"5","4","0","0",,"464","0","M1",,,"r. onder voorzitting","2505","G",,"e9*2007/46*0093*08","GWDC","GWDCH0??","0","0.01","278","Nee","Ja",,"Nee","4305","0","0.00","2024","Logisch","00","Ja","2024-07-16T00:00:00.000","2020-07-16T00:00:00.000","2015-05-12T00:00:00.000","2015-05-12T00:00:00.000",,,,,,,,,,,,,,,,,,,,,"A",,,,,,,"https://opendata.rdw.nl/resource/3huj-srit.json","https://opendata.rdw.nl/resource/8ys7-d773.json","https://opendata.rdw.nl/resource/vezc-m2t6.json","https://opendata.rdw.nl/resource/jhie-znh9.json","https://opendata.rdw.nl/resource/kmfi-hrps.json"
"GG141B","Personenauto","VOLVO","V60 TWIN ENGINE","20240715","20230624","463","stationwagen","5","BLAUW","Niet geregistreerd","5","2400","1880","2505","1980","750","1800","20150508","20150508","Geen verstrekking in Open Data","69745","Ja",,,,,,,"5","4","0","0",,"464","0","M1",,,"r. onder voorzitting","2505","G",,"e9*2007/46*0093*08","GWDC","GWDCH0??","0","0.01","278","Nee","Nee",,"Nee","4305","0","0.00","2023","Logisch","00","Ja","2024-07-15T00:00:00.000","2023-06-24T00:00:00.000","2015-05-08T00:00:00.000","2015-05-08T00:00:00.000",,,,,,,,,,,,,,,,,,,,,"A",,,,,,,"https://opendata.rdw.nl/resource/3huj-srit.json","https://opendata.rdw.nl/resource/8ys7-d773.json","https://opendata.rdw.nl/resource/vezc-m2t6.json","https://opendata.rdw.nl/resource/jhie-znh9.json","https://opendata.rdw.nl/resource/kmfi-hrps.json"