"kenteken","voertuigsoort","merk","handelsbenaming","vervaldatum_apk","datum_tenaamstelling","bruto_bpm","inrichting","aantal_zitplaatsen","eerste_kleur","tweede_kleur","aantal_cilinders","cilinderinhoud","massa_ledig_voertuig","toegestane_maximum_massa_voertuig","massa_rijklaar","maximum_massa_trekken_ongeremd","maximum_trekken_massa_geremd","datum_eerste_toelating","datum_eerste_tenaamstelling_in_nederland","wacht_op_keuren","catalogusprijs","wam_verzekerd","maximale_constructiesnelheid","laadvermogen","oplegger_geremd","aanhangwagen_autonoom_geremd","aanhangwagen_middenas_geremd","aantal_staanplaatsen","aantal_deuren","aantal_wielen","afstand_hart_koppeling_tot_achterzijde_voertuig","afstand_voorzijde_voertuig_tot_hart_koppeling","afwijkende_maximum_snelheid","lengte","breedte","europese_voertuigcategorie","europese_voertuigcategorie_toevoeging","europese_uitvoeringcategorie_toevoeging","plaats_chassisnummer","technische_max_massa_voertuig","type","type_gasinstallatie","typegoedkeuringsnummer","variant","uitvoering","volgnummer_wijziging_eu_typegoedkeuring","vermogen_massarijklaar","wielbasis","export_indicator","openstaande_terugroepactie_indicator","vervaldatum_tachograaf","taxi_indicator","maximum_massa_samenstelling","aantal_rolstoelplaatsen","maximum_ondersteunende_snelheid","jaar_laatste_registratie_tellerstand","tellerstandoordeel","code_toelichting_tellerstandoordeel","tenaamstellen_mogelijk","vervaldatum_apk_dt","datum_tenaamstelling_dt","datum_eerste_toelating_dt","datum_eerste_tenaamstelling_in_nederland_dt","vervaldatum_tachograaf_dt","maximum_last_onder_de_vooras_sen_tezamen_koppeling","type_remsysteem_voertuig_code","rupsonderstelconfiguratiecode","wielbasis_voertuig_minimum","wielbasis_voertuig_maximum","lengte_voertuig_minimum","lengte_voertuig_maximum","breedte_voertuig_minimum","breedte_voertuig_maximum","hoogte_voertuig","hoogte_voertuig_minimum","hoogte_voertuig_maximum","massa_bedrijfsklaar_minimaal","massa_bedrijfsklaar_maximaal","technisch_toelaatbaar_massa_koppelpunt","maximum_massa_technisch_maximaal","maximum_massa_technisch_minimaal","subcategorie_nederland","verticale_belasting_koppelpunt_getrokken_voertuig","zuinigheidsclassificatie","registratie_datum_goedkeuring_afschrijvingsmoment_bpm","registratie_datum_goedkeuring_afschrijvingsmoment_bpm_dt","gem_lading_wrde","aerodyn_voorz","massa_alt_aandr","verl_cab_ind","api_gekentekende_voertuigen_assen","api_gekentekende_voertuigen_brandstof","api_gekentekende_voertuigen_carrosserie","api_gekentekende_voertuigen_carrosserie_specifiek","api_gekentekende_voertuigen_voertuigklasse"
"V123VP","Bedrijfsauto","VOLKSWAGEN","CARAVELLE","20241220","20191220","13643","speciale groep","1","N.v.t.","N.v.t.","4","1968","1975","3000","2075","750",,"20150625","20191220","Geen verstrekking in Open Data","56555","Ja",,"1025",,,"2500",,,"4",,,,,"190","N1",,,,"3000",,,,,,,"0.05","340","Nee","Nee",,"Nee","5300","1",,"2024","Geen oordeel","05","Ja","2024-12-20T00:00:00.000","2019-12-20T00:00:00.000","2015-06-25T00:00:00.000","2019-12-20T00:00:00.000",,"0",,,,,,,,,,,,,,,,,,,,,,,,,,"https://opendata.rdw.nl/resource/3huj-srit.json","https://opendata.rdw.nl/resource/8ys7-d773.json","https://opendata.rdw.nl/resource/vezc-m2t6.json","https://opendata.rdw.nl/resource/jhie-znh9.json","https://opendata.rdw.nl/resource/kmfi-hrps.json"
"V130ZN","Bedrijfsauto","VOLKSWAGEN","CARAVELLE","20240704","20230601","15664","speciale groep","3","N.v.t.","N.v.t.","4","1968","2481","3000","2581","750",,"20150522","20190706","Geen verstrekking in Open Data","65062","Ja",,"519",,,"2500",,,"4",,,,,"190","N1",,,,"3000",,,,,,,"0.05","300","Nee","Nee",,"Nee","5300","1",,"2024","Geen oordeel","05","Ja","2024-07-04T00:00:00.000","2023-06-01T00:00:00.000","2015-05-22T00:00:00.000","2019-07-06T00:00:00.000",,"0",,,,,,,,,,,,,,,,,,,,,,,,,,"https://opendata.rdw.nl/resource/3huj-srit.json","https://opendata.rdw.nl/resource/8ys7-d773.json","https://opendata.rdw.nl/resource/vezc-m2t6.json","https://opendata.rdw.nl/resource/jhie-znh9.json","https://opendata.rdw.nl/resource/kmfi-hrps.json"
"V439HD","Bedrijfsauto","VOLKSWAGEN","CARAVELLE","20240428","20171011","14721","speciale groep","5","N.v.t.","N.v.t.","4","1968","2362","3000","2462","750",,"20100602","20171011","Geen verstrekking in Open Data","61274","Ja",,"638",,"2300","2300",,,"4",,,,,"191","N1",,,"schutbord motorruimte","3000",,,,,,,"0.04","302","Nee","Nee",,"Nee","5300","1",,"2023","Geen oordeel","05","Ja","2024-04-28T00:00:00.000","2017-10-11T00:00:00.000","2010-06-02T00:00:00.000","2017-10-11T00:00:00.000",,"0",,,,,,,,,,,,,,,,,,,,,,,,,,"https://opendata.rdw.nl/resource/3huj-srit.json","https://opendata.rdw.nl/resource/8ys7-d773.json","https://opendata.rdw.nl/resource/vezc-m2t6.json","https://opendata.rdw.nl/resource/jhie-znh9.json","https://opendata.rdw.nl/resource/kmfi-hrps.json"
"V469JH","Bedrijfsauto","VOLKSWAGEN","CARAVELLE","20250406","20180406","12395","speciale groep","5","N.v.t.","N.v.t.","4","1968","2020","3000","2120","750",,"20140401","20180406","Geen verstrekking in Open Data","51303","Ja",,"980",,"2500","2500",,,"4",,,,,"190","N1",,,"by schutbord","3000","7HC",,,,,,"0.05","300","Nee","Nee",,"Nee","5300","1",,"2024","Geen oordeel","05","Ja","2025-04-06T00:00:00.000","2018-04-06T00:00:00.000","2014-04-01T00:00:00.000","2018-04-06T00:00:00.000",,,,,,,,,,,,,,,,,,,,,,,,,,,,"https://opendata.rdw.nl/resource/3huj-srit.json","https://opendata.rdw.nl/resource/8ys7-d773.json","https://opendata.rdw.nl/resource/vezc-m2t6.json","https://opendata.rdw.nl/resource/jhie-znh9.json","https://opendata.rdw.nl/resource/kmfi-hrps.json"
"V548NG","Bedrijfsauto","VOLKSWAGEN","CARAVELLE","20240912","20231026","9675","speciale groep","4","N.v.t.","N.v.t.","4","2461","2135","3025","2235",,,"20070413","20180908","Geen verstrekking in Open Data",,"Ja",,"890",,,,,,"4",,,,,"190","N1",,,"schutbord motorruimte","3025","7HC",,,,,,"0.04","300","Nee","Nee",,"Nee",,"1",,"2024","Geen oordeel","05","Ja","2024-09-12T00:00:00.000","2023-10-26T00:00:00.000","2007-04-13T00:00:00.000","2018-09-08T00:00:00.000",,"0",,,,,,,,,,,,,,,,,,,,,,,,,,"https://opendata.rdw.nl/resource/3huj-srit.json","https://opendata.rdw.nl/resource/8ys7-d773.json","https://opendata.rdw.nl/resource/vezc-m2t6.json","https://opendata.rdw.nl/resource/jhie-znh9.json","https://opendata.rdw.nl/resource/kmfi-hrps.json"
"V817JB","Bedrijfsauto","VOLKSWAGEN","CARAVELLE","20241222","20171222","11692","speciale groep","5","N.v.t.","N.v.t.","5","2461","2240","3000","2340",,,"20080319","20171222","Geen verstrekking in Open Data",,"Ja",,"760",,,,,,"4",,,,,"186","N1",,,"r. schutbord motorruimte","3000",,,,,,,"0.05","342","Nee","Nee",,"Nee",,"1",,"2023","Geen oordeel","05","Ja","2024-12-22T00:00:00.000","2017-12-22T00:00:00.000","2008-03-19T00:00:00.000","2017-12-22T00:00:00.000",,"0",,,,,,,,,,,,,,,,,,,,,,,,,,"https://opendata.rdw.nl/resource/3huj-srit.json","https://opendata.rdw.nl/resource/8ys7-d773.json","https://opendata.rdw.nl/resource/vezc-m2t6.json","https://opendata.rdw.nl/resource/jhie-znh9.json","https://opendata.rdw.nl/resource/kmfi-hrps.json"
"VDD09K","Bedrijfsauto","VOLKSWAGEN","CARAVELLE","20240712","20230714","16171","speciale groep","3","N.v.t.","N.v.t.","4","1968","2208","3000","2308","750",,"20150603","20191108","Geen verstrekking in Open Data","67196","Ja",,"792",,"2500","2500",,,"4",,,,,"190","N1",,,"by schutbord","3000","7HC",,,,,,"0.04","300","Nee","Nee",,"Nee","5200","1",,"2023","Geen oordeel","05","Ja","2024-07-12T00:00:00.000","2023-07-14T00:00:00.000","2015-06-03T00:00:00.000","2019-11-08T00:00:00.000",,"0",,,,,,,,,,,,,,,,,,,,,,,,,,"https://opendata.rdw.nl/resource/3huj-srit.json","https://opendata.rdw.nl/resource/8ys7-d773.json","https://opendata.rdw.nl/resource/vezc-m2t6.json","https://opendata.rdw.nl/resource/jhie-znh9.json","https://opendata.rdw.nl/resource/kmfi-hrps.json"
"VDJ93B","Bedrijfsauto","VOLKSWAGEN","CARAVELLE","20241121","20191129","1811","speciale groep","5","N.v.t.","N.v.t.","4","1968","2322","3000","2422","750",,"20101124","20191129","Geen verstrekking in Open Data","6667","Ja",,"678",,,"2300",,,"4",,,,,"194","N1",,,,"3000",,,,,,,"0.04","341","Nee","Nee",,"Nee","5300","2",,"2023","Geen oordeel","05","Ja","2024-11-21T00:00:00.000","2019-11-29T00:00:00.000","2010-11-24T00:00:00.000","2019-11-29T00:00:00.000",,"0",,,,,,,,,,,,,,,,,,,,,,,,,,"https://opendata.rdw.nl/resource/3huj-srit.json","https://opendata.rdw.nl/resource/8ys7-d773.json","https://opendata.rdw.nl/resource/vezc-m2t6.json","https://opendata.rdw.nl/resource/jhie-znh9.json","https://opendata.rdw.nl/resource/kmfi-hrps.json"
"VFF84K","Bedrijfsauto","VOLKSWAGEN","CARAVELLE 2.0 TDI","20250220","20200203","12265","speciale groep","4","N.v.t.","N.v.t.","4","1968","2385","3000","2485",,,"20101019","20200203","Geen verstrekking in Open Data","50118","Ja",,"615",,,,,"3","4",,,,,"188","N1",,,"r. schutbord by motorruimte","3000","7HC",,,,,,"0.04","341","Nee","Nee",,"Nee",,"1",,"2024","Geen oordeel","05","Ja","2025-02-20T00:00:00.000","2020-02-03T00:00:00.000","2010-10-19T00:00:00.000","2020-02-03T00:00:00.000",,"0",,,,,,,,,,,,,,,,,,,,,,,,,,"https://opendata.rdw.nl/resource/3huj-srit.json","https://opendata.rdw.nl/resource/8ys7-d773.json","https://opendata.rdw.nl/resource/vezc-m2t6.json","https://opendata.rdw.nl/resource/jhie-znh9.json","https://opendata.rdw.nl/resource/kmfi-hrps.json"
"VG789G","Bedrijfsauto","VOLKSWAGEN","CARAVELLE 2,5 TDI AUT.","20240826","20200829","14443","speciale groep","4","N.v.t.","N.v.t.","5","2461","2330","3000","2430","750",,"20060613","20131113","Geen verstrekking in Open Data",,"Ja",,"670",,"2260","2260",,"4","4",,,,,"191","N1",,,"schutbord","3000","7HC",,,,,,"0.04","300","Nee","Nee",,"Nee","5200","1",,"2023","Geen oordeel","05","Ja","2024-08-26T00:00:00.000","2020-08-29T00:00:00.000","2006-06-13T00:00:00.000","2013-11-13T00:00:00.000",,"0",,,,,,,,,,,,,,,,,,,,,,,,,,"https://opendata.rdw.nl/resource/3huj-srit.json","https://opendata.rdw.nl/resource/8ys7-d773.json","https://opendata.rdw.nl/resource/vezc-m2t6.json","https://opendata.rdw.nl/resource/jhie-znh9.json","https://opendata.rdw.nl/resource/kmfi-hrps.json"
"VH165X","Bedrijfsauto","VOLKSWAGEN","CARAVELLE,2.0 TDI KORT 140 HK DSG","20240929","20160628","16664","speciale groep","4","N.v.t.","N.v.t.","4","1968","2315","3000","2415",,,"20120819","20160628","Geen verstrekking in Open Data","68405","Ja",,"685",,"2300","2300",,,"4",,,,,"190","N1",,,"schutbord","3000","7HC",,,,,,"0.04","300","Nee","Nee",,"Nee","5300","1",,"2023","Geen oordeel","05","Ja","2024-09-29T00:00:00.000","2016-06-28T00:00:00.000","2012-08-19T00:00:00.000","2016-06-28T00:00:00.000",,"0",,,,,,,,,,,,,,,,,,,,,,,,,,"https://opendata.rdw.nl/resource/3huj-srit.json","https://opendata.rdw.nl/resource/8ys7-d773.json","https://opendata.rdw.nl/resource/vezc-m2t6.json","https://opendata.rdw.nl/resource/jhie-znh9.json","https://opendata.rdw.nl/resource/kmfi-hrps.json"
"VK344L","Bedrijfsauto","VOLKSWAGEN","CARAVELLE","20240922","20221005","13709","speciale groep","4","N.v.t.","N.v.t.","4","1968","2230","3000","2330","750",,"20130529","20150508","Geen verstrekking in Open Data","56809","Ja",,"770",,"2500","2500",,,"4",,,,,"190","N1",,,"by schutbord","3000","7HC",,,,,,"0.04","340","Nee","Nee",,"Nee","5300",,,"2023","Geen oordeel","05","Ja","2024-09-22T00:00:00.000","2022-10-05T00:00:00.000","2013-05-29T00:00:00.000","2015-05-08T00:00:00.000",,"0",,,,,,,,,,,,,,,,,,,,,,,,,,"https://opendata.rdw.nl/resource/3huj-srit.json","https://opendata.rdw.nl/resource/8ys7-d773.json","https://opendata.rdw.nl/resource/vezc-m2t6.json","https://opendata.rdw.nl/resource/jhie-znh9.json","https://opendata.rdw.nl/resource/kmfi-hrps.json"
"VK939L","Bedrijfsauto","VOLKSWAGEN","CARAVELLE","20240815","20240518","18195","speciale groep","6","N.v.t.","N.v.t.","4","1968","2134","3000","2234","750",,"20110317","20140929","Geen verstrekking in Open Data","74769","Ja",,"866",,"2500","2500",,,"4",,,,,"190","N1",,,"by schutbord","3000",,,,,,,"0.05","340","Nee","Nee",,"Nee","5300","1",,"2024","Geen oordeel","05","Ja","2024-08-15T00:00:00.000","2024-05-18T00:00:00.000","2011-03-17T00:00:00.000","2014-09-29T00:00:00.000",,,,,,,,,,,,,,,,,,,,,,,,,,,,"https://opendata.rdw.nl/resource/3huj-srit.json","https://opendata.rdw.nl/resource/8ys7-d773.json","https://opendata.rdw.nl/resource/vezc-m2t6.json","https://opendata.rdw.nl/resource/jhie-znh9.json","https://opendata.rdw.nl/resource/kmfi-hrps.json"
"VLS60F","Bedrijfsauto","VOLKSWAGEN","CARAVELLE","20240930","20210927","15343","speciale groep","5","N.v.t.","N.v.t.","4","1968","2220","3000","2320","750",,"20130408","20210927","Geen verstrekking in Open Data","63712","Ja",,"780",,,"2500",,"4","4",,,,,"191","N1",,,,"3000","7HC",,,,,,"0.04","340","Nee","Nee",,"Nee","5200","1",,"2024","Geen oordeel","05","Ja","2024-09-30T00:00:00.000","2021-09-27T00:00:00.000","2013-04-08T00:00:00.000","2021-09-27T00:00:00.000",,,,,,,,,,,,,,,,,,,,,,,,,,,,"https://opendata.rdw.nl/resource/3huj-srit.json","https://opendata.rdw.nl/resource/8ys7-d773.json","https://opendata.rdw.nl/resource/vezc-m2t6.json","https://opendata.rdw.nl/resource/jhie-znh9.json","https://opendata.rdw.nl/resource/kmfi-hrps.json"
"VN919S","Bedrijfsauto","VOLKSWAGEN","CARAVELLE","20250523","20170513","14599","speciale groep","5","N.v.t.","N.v.t.","4","1968","2132","3000","2232","750",,"20120622","20150417","Geen verstrekking in Open Data","59819","Ja",,"868",,"2500","2500",,,"4",,,,,"190","N1",,,"by schutbord","3000","7HC",,,,,,"0.05","340","Nee","Nee",,"Nee","5200","1",,"2024","Geen oordeel","05","Ja","2025-05-23T00:00:00.000","2017-05-13T00:00:00.000","2012-06-22T00:00:00.000","2015-04-17T00:00:00.000",,"0",,,,,,,,,,,,,,,,,,,,,,,,,,"https://opendata.rdw.nl/resource/3huj-srit.json","https://opendata.rdw.nl/resource/8ys7-d773.json","https://opendata.rdw.nl/resource/vezc-m2t6.json","https://opendata.rdw.nl/resource/jhie-znh9.json","https://opendata.rdw.nl/resource/kmfi-hrps.json"
"VP140H","Bedrijfsauto","VOLKSWAGEN","CARAVELLE","20250426","20220428","13281","speciale groep","5","N.v.t.","N.v.t.","4","1968","2339","3000","2439","750",,"20140709","20150723","Geen verstrekking in Open Data","55032","Ja",,"661",,"2500","2500",,,"4",,,,,"190","N1",,,"by schutbord","3000","7HC",,,,,,"0.04","340","Nee","Nee",,"Nee","5300","1",,"2024","Geen oordeel","05","Ja","2025-04-26T00:00:00.000","2022-04-28T00:00:00.000","2014-07-09T00:00:00.000","2015-07-23T00:00:00.000",,"0",,,,,,,,,,,,,,,,,,,,,,,,,,"https://opendata.rdw.nl/resource/3huj-srit.json","https://opendata.rdw.nl/resource/8ys7-d773.json","https://opendata.rdw.nl/resource/vezc-m2t6.json","https://opendata.rdw.nl/resource/jhie-znh9.json","https://opendata.rdw.nl/resource/kmfi-hrps.json"
"VPB30Z","Bedrijfsauto","VOLKSWAGEN","CARAVELLE","20250331","20220216","15366","speciale groep","2","N.v.t.","N.v.t.","4","1968","2342","3000","2442","750",,"20130829","20220216","Geen verstrekking in Open Data","63808","Ja","172","658",,,"2500",,"4","4",,,,,"190","N1",,,,"3000",,,,,,,"0.04","300","Nee","Nee",,"Nee","5300","1",,"2024","Geen oordeel","05","Ja","2025-03-31T00:00:00.000","2022-02-16T00:00:00.000","2013-08-29T00:00:00.000","2022-02-16T00:00:00.000",,,,,,,,,,,,,,,,,,,,,,"20220211","2022-02-11T00:00:00.000",,,,,"https://opendata.rdw.nl/resource/3huj-srit.json","https://opendata.rdw.nl/resource/8ys7-d773.json","https://opendata.rdw.nl/resource/vezc-m2t6.json","https://opendata.rdw.nl/resource/jhie-znh9.json","https://opendata.rdw.nl/resource/kmfi-hrps.json"
"VPH32D","Bedrijfsauto","VOLKSWAGEN","CARAVELLE","20250316","20220309","15377","speciale groep","3","N.v.t.","N.v.t.","4","1968","2415","3200","2515","750",,"20150529","20220309","Geen verstrekking in Open Data","63855","Ja",,"785",,,"2500",,"5","4",,,,,"190","N1",,,,"3200",,,,,,,"0.04","340","Nee","Nee",,"Nee","5300","1",,"2024","Geen oordeel","05","Ja","2025-03-16T00:00:00.000","2022-03-09T00:00:00.000","2015-05-29T00:00:00.000","2022-03-09T00:00:00.000",,,,,,,,,,,"193",,,,,,,,,,,"20220308","2022-03-08T00:00:00.000",,,,,"https://opendata.rdw.nl/resource/3huj-srit.json","https://opendata.rdw.nl/resource/8ys7-d773.json","https://opendata.rdw.nl/resource/vezc-m2t6.json","https://opendata.rdw.nl/resource/jhie-znh9.json","https://opendata.rdw.nl/resource/kmfi-hrps.json"
"VPJ59L","Bedrijfsauto","VOLKSWAGEN","CARAVELLE 2,5 TDI  AUT.","20240303","20231125","9203","speciale groep","1","N.v.t.","N.v.t.","5","2461","2451","3000","2551","750",,"20091203","20230424","Geen verstrekking in Open Data",,"Ja",,"549",,,"2200",,,"4",,,,,"190","N1",,,,"3000",,,,,,,"0.04","340","Nee","Nee",,"Nee","4800","1",,"2023","Geen oordeel","05","Ja","2024-03-03T00:00:00.000","2023-11-25T00:00:00.000","2009-12-03T00:00:00.000","2023-04-24T00:00:00.000",,,,,,,,,,,,,,,,,,,,,,"20230329","2023-03-29T00:00:00.000",,,,,"https://opendata.rdw.nl/resource/3huj-srit.json","https://opendata.rdw.nl/resource/8ys7-d773.json","https://opendata.rdw.nl/resource/vezc-m2t6.json","https://opendata.rdw.nl/resource/jhie-znh9.json","https://opendata.rdw.nl/resource/kmfi-hrps.json"
"VPJ94L","Bedrijfsauto","VOLKSWAGEN","CARAVELLE","20250202","20220323","11092","speciale groep","2","N.v.t.","N.v.t.","4","1968","2333","3000","2433","750",,"20141226","20220323","Geen verstrekking in Open Data","45817","Ja","172","667",,"2500","2500",,"4","4",,,,,"190","N1",,,"by schutbord","3000","7HC",,,,,,"0.04","300","Nee","Nee",,"Nee","5300","1",,"2024","Geen oordeel","05","Ja","2025-02-02T00:00:00.000","2022-03-23T00:00:00.000","2014-12-26T00:00:00.000","2022-03-23T00:00:00.000",,,,,,,,,,,,,,,,,,,,,,"20220610","2022-06-10T00:00:00.000",,,,,"https://opendata.rdw.nl/resource/3huj-srit.json","https://opendata.rdw.nl/resource/8ys7-d773.json","https://opendata.rdw.nl/resource/vezc-m2t6.json","https://opendata.rdw.nl/resource/jhie-znh9.json","https://opendata.rdw.nl/resource/kmfi-hrps.json"
"VR458G","Bedrijfsauto","VOLKSWAGEN","CARAVELLE","20241108","20191116","11826","speciale groep","6","N.v.t.","N.v.t.","4","1968","2206","3000","2306","750",,"20120515","20150924","Geen verstrekking in Open Data","48294","Ja",,"794",,"2500","2500",,,"4",,,,,"190","N1",,,"by schutbord","3000","7HC",,,,,,"0.04","340","Nee","Nee",,"Nee","5200","1",,"2023","Geen oordeel","05","Ja","2024-11-08T00:00:00.000","2019-11-16T00:00:00.000","2012-05-15T00:00:00.000","2015-09-24T00:00:00.000",,"0",,,,,,,,,,,,,,,,,,,,,,,,,,"https://opendata.rdw.nl/resource/3huj-srit.json","https://opendata.rdw.nl/resource/8ys7-d773.json","https://opendata.rdw.nl/resource/vezc-m2t6.json","https://opendata.rdw.nl/resource/jhie-znh9.json","https://opendata.rdw.nl/resource/kmfi-hrps.json"
"VS077B","Bedrijfsauto","VOLKSWAGEN","CARAVELLE","20240717","20200924","12744","speciale groep","5","N.v.t.","N.v.t.","4","1968","2228","3000","2328","750",,"20150508","20160817","Geen verstrekking in Open Data","52771","Ja",,"772",,,"2500",,,"4",,,,,"190","N1",,,"by schutbord","3000","7HC",,,,,,"0.04","340","Nee","Nee",,"Nee","5300","1",,"2023","Geen oordeel","05","Ja","2024-07-17T00:00:00.000","2020-09-24T00:00:00.000","2015-05-08T00:00:00.000","2016-08-17T00:00:00.000",,,,,,,,,,,,,,,,,,,,,,,,,,,,"https://opendata.rdw.nl/resource/3huj-srit.json","https://opendata.rdw.nl/resource/8ys7-d773.json","https://opendata.rdw.nl/resource/vezc-m2t6.json","https://opendata.rdw.nl/resource/jhie-znh9.json","https://opendata.rdw.nl/resource/kmfi-hrps.json"
"VS796K","Bedrijfsauto","VOLKSWAGEN","CARAVELLE","20241015","20161010","12308","speciale groep","4","N.v.t.","N.v.t.","4","1968","2050","3000","2150","750",,"20130619","20160628","Geen verstrekking in Open Data","50937","Ja",,"950",,"2500","2500",,,"4",,,,,"190","N1",,,"by schutbord","3000","7HC",,,,,,"0.05","340","Nee","Nee",,"Nee","5300","1",,"2023","Geen oordeel","05","Ja","2024-10-15T00:00:00.000","2016-10-10T00:00:00.000","2013-06-19T00:00:00.000","2016-06-28T00:00:00.000",,"0",,,,,,,,,,,,,,,,,,,,,,,,,,"https://opendata.rdw.nl/resource/3huj-srit.json","https://opendata.rdw.nl/resource/8ys7-d773.json","https://opendata.rdw.nl/resource/vezc-m2t6.json","https://opendata.rdw.nl/resource/jhie-znh9.json","https://opendata.rdw.nl/resource/kmfi-hrps.json"
"VT225D","Bedrijfsauto","VOLKSWAGEN","CARAVELLE","20240603","20160125","12108","speciale groep","4","N.v.t.","N.v.t.","4","1968","2217","3000","2317","750",,"20140603","20160125","Geen verstrekking in Open Data","50095","Ja",,"783",,"2500","2500",,,"4",,,,,"190","N1",,,"by schutbord","3000","7HC",,,,,,"0.04","300","Nee","Nee",,"Nee","5200","1",,"2023","Geen oordeel","05","Ja","2024-06-03T00:00:00.000","2016-01-25T00:00:00.000","2014-06-03T00:00:00.000","2016-01-25T00:00:00.000",,"0",,,,,,,,,,,,,,,,,,,,,,,,,,"https://opendata.rdw.nl/resource/3huj-srit.json","https://opendata.rdw.nl/resource/8ys7-d773.json","https://opendata.rdw.nl/resource/vezc-m2t6.json","https://opendata.rdw.nl/resource/jhie-znh9.json","https://opendata.rdw.nl/resource/kmfi-hrps.json"
"VT935Z","Bedrijfsauto","VOLKSWAGEN","CARAVELLE","20250514","20160317","15217","speciale groep","4","N.v.t.","N.v.t.","4","1968","2246","3000","2346","750",,"20140514","20160317","Geen verstrekking in Open Data","63181","Ja",,"754",,"2500","2500",,,"4",,,,,"190","N1",,,"by schutbord","3000","7HC",,,,,,"0.04","340","Nee","Nee",,"Nee","5200","1",,"2024","Geen oordeel","05","Ja","2025-05-14T00:00:00.000","2016-03-17T00:00:00.000","2014-05-14T00:00:00.000","2016-03-17T00:00:00.000",,"0",,,,,,,,,,,,,,,,,,,,,,,,,,"https://opendata.rdw.nl/resource/3huj-srit.json","https://opendata.rdw.nl/resource/8ys7-d773.json","https://opendata.rdw.nl/resource/vezc-m2t6.json","https://opendata.rdw.nl/resource/jhie-znh9.json","https://opendata.rdw.nl/resource/kmfi-hrps.json"
"VTG54K","Bedrijfsauto","VOLKSWAGEN","CARAVELLE","20250120","20230102","14495","speciale groep","4","N.v.t.","N.v.t.","4","1968","2162","3000","2262","750",,"20141027","20230102","Geen verstrekking in Open Data","60142","Ja","163","838",,,"2200",,,"4",,,,"529","190","N1",,,,"3000","7HC",,,,,,"0.04","340","Nee","Nee",,"Nee","4900","1",,"2024","Geen oordeel","05","Ja","2025-01-20T00:00:00.000","2023-01-02T00:00:00.000","2014-10-27T00:00:00.000","2023-01-02T00:00:00.000",,,,,,,,,,,"197",,,,,,,,,,,"20221219","2022-12-19T00:00:00.000",,,,,"https://opendata.rdw.nl/resource/3huj-srit.json","https://opendata.rdw.nl/resource/8ys7-d773.json","https://opendata.rdw.nl/resource/vezc-m2t6.json","https://opendata.rdw.nl/resource/jhie-znh9.json","https://opendata.rdw.nl/resource/kmfi-hrps.json"
"VV384R","Bedrijfsauto","VOLKSWAGEN","CARAVELLE","20240608","20210813","16408","speciale groep","5","N.v.t.","N.v.t.","4","1968","2125","3000","2225","750",,"20140603","20160425","Geen verstrekking in Open Data","68197","Ja",,"875","2500","2500","2500",,,"4",,,,,"190","N1",,,"by schutbord","3000","7HC",,,,,,"0.05","340","Nee","Nee",,"Nee","5300","1",,"2023","Geen oordeel","05","Ja","2024-06-08T00:00:00.000","2021-08-13T00:00:00.000","2014-06-03T00:00:00.000","2016-04-25T00:00:00.000",,"0",,,,,,,,,,,,,,,,,,,,,,,,,,"https://opendata.rdw.nl/resource/3huj-srit.json","https://opendata.rdw.nl/resource/8ys7-d773.json","https://opendata.rdw.nl/resource/vezc-m2t6.json","https://opendata.rdw.nl/resource/jhie-znh9.json","https://opendata.rdw.nl/resource/kmfi-hrps.json"
"VX917G","Bedrijfsauto","VOLKSWAGEN","CARAVELLE","20250421","20160923","10472","speciale groep","3","N.v.t.","N.v.t.","4","1968","2094","3000","2194","750",,"20150421","20160923","Geen verstrekking in Open Data","43209","Ja",,"906",,"2500","2500",,,"4",,,,,"190","N1",,,"by schutbord","3000","7HC",,,,,,"0.05","300","Nee","Nee",,"Nee","5300","1",,"2024","Geen oordeel","05","Ja","2025-04-21T00:00:00.000","2016-09-23T00:00:00.000","2015-04-21T00:00:00.000","2016-09-23T00:00:00.000",,"0",,,,,,,,,,,,,,,,,,,,,,,,,,"https://opendata.rdw.nl/resource/3huj-srit.json","https://opendata.rdw.nl/resource/8ys7-d773.json","https://opendata.rdw.nl/resource/vezc-m2t6.json","https://opendata.rdw.nl/resource/jhie-znh9.json","https://opendata.rdw.nl/resource/kmfi-hrps.json"