"kenteken","voertuigsoort","merk","handelsbenaming","vervaldatum_apk","datum_tenaamstelling","bruto_bpm","inrichting","aantal_zitplaatsen","eerste_kleur","tweede_kleur","aantal_cilinders","cilinderinhoud","massa_ledig_voertuig","toegestane_maximum_massa_voertuig","massa_rijklaar","maximum_massa_trekken_ongeremd","maximum_trekken_massa_geremd","datum_eerste_toelating","datum_eerste_tenaamstelling_in_nederland","wacht_op_keuren","catalogusprijs","wam_verzekerd","maximale_constructiesnelheid","laadvermogen","oplegger_geremd","aanhangwagen_autonoom_geremd","aanhangwagen_middenas_geremd","aantal_staanplaatsen","aantal_deuren","aantal_wielen","afstand_hart_koppeling_tot_achterzijde_voertuig","afstand_voorzijde_voertuig_tot_hart_koppeling","afwijkende_maximum_snelheid","lengte","breedte","europese_voertuigcategorie","europese_voertuigcategorie_toevoeging","europese_uitvoeringcategorie_toevoeging","plaats_chassisnummer","technische_max_massa_voertuig","type","type_gasinstallatie","typegoedkeuringsnummer","variant","uitvoering","volgnummer_wijziging_eu_typegoedkeuring","vermogen_massarijklaar","wielbasis","export_indicator","openstaande_terugroepactie_indicator","vervaldatum_tachograaf","taxi_indicator","maximum_massa_samenstelling","aantal_rolstoelplaatsen","maximum_ondersteunende_snelheid","jaar_laatste_registratie_tellerstand","tellerstandoordeel","code_toelichting_tellerstandoordeel","tenaamstellen_mogelijk","vervaldatum_apk_dt","datum_tenaamstelling_dt","datum_eerste_toelating_dt","datum_eerste_tenaamstelling_in_nederland_dt","vervaldatum_tachograaf_dt","maximum_last_onder_de_vooras_sen_tezamen_koppeling","type_remsysteem_voertuig_code","rupsonderstelconfiguratiecode","wielbasis_voertuig_minimum","wielbasis_voertuig_maximum","lengte_voertuig_minimum","lengte_voertuig_maximum","breedte_voertuig_minimum","breedte_voertuig_maximum","hoogte_voertuig","hoogte_voertuig_minimum","hoogte_voertuig_maximum","massa_bedrijfsklaar_minimaal","massa_bedrijfsklaar_maximaal","technisch_toelaatbaar_massa_koppelpunt","maximum_massa_technisch_maximaal","maximum_massa_technisch_minimaal","subcategorie_nederland","verticale_belasting_koppelpunt_getrokken_voertuig","zuinigheidsclassificatie","registratie_datum_goedkeuring_afschrijvingsmoment_bpm","registratie_datum_goedkeuring_afschrijvingsmoment_bpm_dt","gem_lading_wrde","aerodyn_voorz","massa_alt_aandr","verl_cab_ind","api_gekentekende_voertuigen_assen","api_gekentekende_voertuigen_brandstof","api_gekentekende_voertuigen_carrosserie","api_gekentekende_voertuigen_carrosserie_specifiek","api_gekentekende_voertuigen_voertuigklasse"
"VG079X","Bedrijfsauto","VOLKSWAGEN","SHARAN VAN","20250117","20140117","15711","open laadvloer","2","N.v.t.","N.v.t.","4","1968","1656","2370","1756","750",,"20140117","20140117","Geen verstrekking in Open Data","65260","Ja",,"714",,"2200","2200",,"0","4","0","0",,"0","190","N1",,,"r. schroefveerkoker","2370","7N",,"e4*NKS*0019*05","CFFBX0AC","FD6FD62E0117MJ5VR2VWO","0","0.06","292","Nee","Nee",,"Nee","4590","0",,"2023","Logisch","00","Ja","2025-01-17T00:00:00.000","2014-01-17T00:00:00.000","2014-01-17T00:00:00.000","2014-01-17T00:00:00.000",,"0",,,,,,,,,,,,,,,,,,,,,,,,,,"https://opendata.rdw.nl/resource/3huj-srit.json","https://opendata.rdw.nl/resource/8ys7-d773.json","https://opendata.rdw.nl/resource/vezc-m2t6.json","https://opendata.rdw.nl/resource/jhie-znh9.json","https://opendata.rdw.nl/resource/kmfi-hrps.json"
"VH052L","Bedrijfsauto","VOLKSWAGEN","SHARAN VAN","20250314","20170322","12174","open laadvloer","2","N.v.t.","N.v.t.","4","1968","1627","2340","1727","750",,"20140312","20140312","Geen verstrekking in Open Data","50373","Ja",,"713",,,"2200",,"0","4","0","0",,"0","190","N1",,,"r. schroefveerkoker","2340","7N",,"e4*NKS*0019*05","CFFBX0AC","FM6FM6BB0027MJ5VR2VWO","0","0.06","292","Nee","Nee",,"Nee","4560","0",,"2024","Logisch","00","Ja","2025-03-14T00:00:00.000","2017-03-22T00:00:00.000","2014-03-12T00:00:00.000","2014-03-12T00:00:00.000",,"0",,,,,,,,,,,,,,,,,,,,,,,,,,"https://opendata.rdw.nl/resource/3huj-srit.json","https://opendata.rdw.nl/resource/8ys7-d773.json","https://opendata.rdw.nl/resource/vezc-m2t6.json","https://opendata.rdw.nl/resource/jhie-znh9.json","https://opendata.rdw.nl/resource/kmfi-hrps.json"
"VH060V","Bedrijfsauto","VOLKSWAGEN","SHARAN VAN","20241005","20181205","13837","open laadvloer","2","N.v.t.","N.v.t.","4","1968","1656","2370","1756","750",,"20140417","20140417","Geen verstrekking in Open Data","57372","Ja",,"714",,,"2200",,"0","4","0","0",,"0","190","N1",,,"r. schroefveerkoker","2370","7N",,"e4*NKS*0019*05","CFFBX0AC","FD6FD62E0117MJ5VR2VWO","0","0.06","292","Nee","Nee",,"Nee","4590","0",,"2023","Logisch","00","Ja","2024-10-05T00:00:00.000","2018-12-05T00:00:00.000","2014-04-17T00:00:00.000","2014-04-17T00:00:00.000",,"0",,,,,,,,,,,,,,,,,,,,,,,,,,"https://opendata.rdw.nl/resource/3huj-srit.json","https://opendata.rdw.nl/resource/8ys7-d773.json","https://opendata.rdw.nl/resource/vezc-m2t6.json","https://opendata.rdw.nl/resource/jhie-znh9.json","https://opendata.rdw.nl/resource/kmfi-hrps.json"
"VH261P","Bedrijfsauto","VOLKSWAGEN","SHARAN VAN","20250330","20220713","13558","open laadvloer","2","N.v.t.","N.v.t.","4","1968","1656","2370","1756","750",,"20140324","20140324","Geen verstrekking in Open Data","56198","Ja",,"714",,,"2200",,"0","4","0","0",,"0","190","N1",,,"r. schroefveerkoker","2370","7N",,"e4*NKS*0019*05","CFFBX0AC","FD6FD62E0117MJ5VR2VWO","0","0.06","292","Nee","Nee",,"Nee","4590","0",,"2024","Logisch","00","Ja","2025-03-30T00:00:00.000","2022-07-13T00:00:00.000","2014-03-24T00:00:00.000","2014-03-24T00:00:00.000",,"0",,,,,,,,,,,,,,,,,,,,,,,,,,"https://opendata.rdw.nl/resource/3huj-srit.json","https://opendata.rdw.nl/resource/8ys7-d773.json","https://opendata.rdw.nl/resource/vezc-m2t6.json","https://opendata.rdw.nl/resource/jhie-znh9.json","https://opendata.rdw.nl/resource/kmfi-hrps.json"
"VJ710P","Bedrijfsauto","VOLKSWAGEN","SHARAN VAN","20240922","20200416","12378","open laadvloer","2","N.v.t.","N.v.t.","4","1968","1627","2340","1727","750",,"20140911","20140911","Geen verstrekking in Open Data","51346","Ja",,"713",,,"2200",,"0","4","0","0",,"0","190","N1",,,"r. schroefveerkoker","2340","7N",,"e4*NKS*0019*05","CFFBX0AC","FM6FM6BB0027MJ5VR2VWO","0","0.06","292","Nee","Nee",,"Nee","4560","0",,"2023","Logisch","00","Ja","2024-09-22T00:00:00.000","2020-04-16T00:00:00.000","2014-09-11T00:00:00.000","2014-09-11T00:00:00.000",,"0",,,,,,,,,,,,,,,,,,,,,,,,,,"https://opendata.rdw.nl/resource/3huj-srit.json","https://opendata.rdw.nl/resource/8ys7-d773.json","https://opendata.rdw.nl/resource/vezc-m2t6.json","https://opendata.rdw.nl/resource/jhie-znh9.json","https://opendata.rdw.nl/resource/kmfi-hrps.json"
"VK698S","Bedrijfsauto","VOLKSWAGEN","SHARAN VAN","20240914","20180915","13837","open laadvloer","2","N.v.t.","N.v.t.","4","1968","1656","2370","1756","750",,"20141028","20141028","Geen verstrekking in Open Data","58135","Ja",,"714",,,"2200",,"0","4","0","0",,"0","190","N1",,,"r. schroefveerkoker","2370","7N",,"e4*NKS*0019*06","CFFBX0AC","FD6FD62E0117MJ5VR2VWO","0","0.06","292","Nee","Nee",,"Nee","4590","0",,"2023","Logisch","00","Ja","2024-09-14T00:00:00.000","2018-09-15T00:00:00.000","2014-10-28T00:00:00.000","2014-10-28T00:00:00.000",,"0",,,,,,,,,,,,,,,,,,,,,,,,,,"https://opendata.rdw.nl/resource/3huj-srit.json","https://opendata.rdw.nl/resource/8ys7-d773.json","https://opendata.rdw.nl/resource/vezc-m2t6.json","https://opendata.rdw.nl/resource/jhie-znh9.json","https://opendata.rdw.nl/resource/kmfi-hrps.json"
"VL172L","Bedrijfsauto","VOLKSWAGEN","SHARAN VAN","20241031","20171104","12827","open laadvloer","2","N.v.t.","N.v.t.","4","1968","1675","2510","1775","750",,"20150220","20150220","Geen verstrekking in Open Data","53120","Ja",,"835",,,"2200",,"0","4","0","0",,"0","190","N1",,,"r. schroefveerkoker","2510","7N",,"e4*NKS*0019*07","CFFBX0AF","FM6FM6BB0027MJ7VR2VWO","0","0.06","292","Nee","Nee",,"Nee","4760","0",,"2024","Logisch","00","Ja","2024-10-31T00:00:00.000","2017-11-04T00:00:00.000","2015-02-20T00:00:00.000","2015-02-20T00:00:00.000",,"0",,,,,,,,,,,,,,,,,,,,,,,,,,"https://opendata.rdw.nl/resource/3huj-srit.json","https://opendata.rdw.nl/resource/8ys7-d773.json","https://opendata.rdw.nl/resource/vezc-m2t6.json","https://opendata.rdw.nl/resource/jhie-znh9.json","https://opendata.rdw.nl/resource/kmfi-hrps.json"
"VN193Z","Bedrijfsauto","VOLKSWAGEN","SHARAN VAN","20250520","20231101","12427","open laadvloer","2","N.v.t.","N.v.t.","4","1968","1675","2510","1775","750",,"20150520","20150520","Geen verstrekking in Open Data","51497","Ja",,"835",,,"2200",,"0","4","0","0",,"0","190","N1",,,"r. schroefveerkoker","2510","7N",,"e4*NKS*0019*07","CFFBX0AF","FM6FM6BB0027MJ7VR2VWO","0","0.06","292","Nee","Nee",,"Nee","4760","0",,"2024","Logisch","00","Ja","2025-05-20T00:00:00.000","2023-11-01T00:00:00.000","2015-05-20T00:00:00.000","2015-05-20T00:00:00.000",,"0",,,,,,,,,,,,,,,,,,,,,,,,,,"https://opendata.rdw.nl/resource/3huj-srit.json","https://opendata.rdw.nl/resource/8ys7-d773.json","https://opendata.rdw.nl/resource/vezc-m2t6.json","https://opendata.rdw.nl/resource/jhie-znh9.json","https://opendata.rdw.nl/resource/kmfi-hrps.json"
"VN421L","Bedrijfsauto","VOLKSWAGEN","SHARAN VAN","20240923","20220128","14146","open laadvloer","2","N.v.t.","N.v.t.","4","1968","1704","2540","1804","750",,"20150327","20150327","Geen verstrekking in Open Data","58674","Ja",,"836",,,"2200",,"0","4","0","0",,"0","190","N1",,,"r. schroefveerkoker","2540","7N",,"e4*NKS*0019*07","CFFBX0AF","FD6FD62E0117MJ7VR2VWO","0","0.06","292","Nee","Nee",,"Nee","4790","0",,"2023","Logisch","00","Ja","2024-09-23T00:00:00.000","2022-01-28T00:00:00.000","2015-03-27T00:00:00.000","2015-03-27T00:00:00.000",,"0",,,,,,,,,,,,,,,,,,,,,,,,,,"https://opendata.rdw.nl/resource/3huj-srit.json","https://opendata.rdw.nl/resource/8ys7-d773.json","https://opendata.rdw.nl/resource/vezc-m2t6.json","https://opendata.rdw.nl/resource/jhie-znh9.json","https://opendata.rdw.nl/resource/kmfi-hrps.json"
"VN513R","Bedrijfsauto","VOLKSWAGEN","SHARAN VAN","20250519","20200519","12981","open laadvloer","2","N.v.t.","N.v.t.","4","1968","1675","2510","1775","750",,"20150410","20150410","Geen verstrekking in Open Data","53770","Ja",,"835",,,"2200",,"0","4","0","0",,"0","190","N1",,,"r. schroefveerkoker","2510","7N",,"e4*NKS*0019*07","CFFBX0AF","FM6FM6BB0027MJ7VR2VWO","0","0.06","292","Nee","Nee",,"Nee","4760","0",,"2024","Logisch","00","Ja","2025-05-19T00:00:00.000","2020-05-19T00:00:00.000","2015-04-10T00:00:00.000","2015-04-10T00:00:00.000",,"0",,,,,,,,,,,,,,,,,,,,,,,,,,"https://opendata.rdw.nl/resource/3huj-srit.json","https://opendata.rdw.nl/resource/8ys7-d773.json","https://opendata.rdw.nl/resource/vezc-m2t6.json","https://opendata.rdw.nl/resource/jhie-znh9.json","https://opendata.rdw.nl/resource/kmfi-hrps.json"
"VP622H","Bedrijfsauto","VOLKSWAGEN","SHARAN VAN","20250604","20200904","13484","open laadvloer","2","N.v.t.","N.v.t.","4","1968","1704","2540","1804","750",,"20150604","20150604","Geen verstrekking in Open Data","56130","Ja",,"836",,,"2200",,"0","4","0","0",,"0","190","N1",,,"r. schroefveerkoker","2540","7N",,"e4*NKS*0019*07","CFFBX0AF","FD6FD62E0117MJ7VR2VWO","0","0.06","292","Nee","Nee",,"Nee","4790","0",,"2024","Logisch","00","Ja","2025-06-04T00:00:00.000","2020-09-04T00:00:00.000","2015-06-04T00:00:00.000","2015-06-04T00:00:00.000",,"0",,,,,,,,,,,,,,,,,,,,,,,,,,"https://opendata.rdw.nl/resource/3huj-srit.json","https://opendata.rdw.nl/resource/8ys7-d773.json","https://opendata.rdw.nl/resource/vezc-m2t6.json","https://opendata.rdw.nl/resource/jhie-znh9.json","https://opendata.rdw.nl/resource/kmfi-hrps.json"
