"kenteken","voertuigsoort","merk","handelsbenaming","vervaldatum_apk","datum_tenaamstelling","bruto_bpm","inrichting","aantal_zitplaatsen","eerste_kleur","tweede_kleur","aantal_cilinders","cilinderinhoud","massa_ledig_voertuig","toegestane_maximum_massa_voertuig","massa_rijklaar","maximum_massa_trekken_ongeremd","maximum_trekken_massa_geremd","datum_eerste_toelating","datum_eerste_tenaamstelling_in_nederland","wacht_op_keuren","catalogusprijs","wam_verzekerd","maximale_constructiesnelheid","laadvermogen","oplegger_geremd","aanhangwagen_autonoom_geremd","aanhangwagen_middenas_geremd","aantal_staanplaatsen","aantal_deuren","aantal_wielen","afstand_hart_koppeling_tot_achterzijde_voertuig","afstand_voorzijde_voertuig_tot_hart_koppeling","afwijkende_maximum_snelheid","lengte","breedte","europese_voertuigcategorie","europese_voertuigcategorie_toevoeging","europese_uitvoeringcategorie_toevoeging","plaats_chassisnummer","technische_max_massa_voertuig","type","type_gasinstallatie","typegoedkeuringsnummer","variant","uitvoering","volgnummer_wijziging_eu_typegoedkeuring","vermogen_massarijklaar","wielbasis","export_indicator","openstaande_terugroepactie_indicator","vervaldatum_tachograaf","taxi_indicator","maximum_massa_samenstelling","aantal_rolstoelplaatsen","maximum_ondersteunende_snelheid","jaar_laatste_registratie_tellerstand","tellerstandoordeel","code_toelichting_tellerstandoordeel","tenaamstellen_mogelijk","vervaldatum_apk_dt","datum_tenaamstelling_dt","datum_eerste_toelating_dt","datum_eerste_tenaamstelling_in_nederland_dt","vervaldatum_tachograaf_dt","maximum_last_onder_de_vooras_sen_tezamen_koppeling","type_remsysteem_voertuig_code","rupsonderstelconfiguratiecode","wielbasis_voertuig_minimum","wielbasis_voertuig_maximum","lengte_voertuig_minimum","lengte_voertuig_maximum","breedte_voertuig_minimum","breedte_voertuig_maximum","hoogte_voertuig","hoogte_voertuig_minimum","hoogte_voertuig_maximum","massa_bedrijfsklaar_minimaal","massa_bedrijfsklaar_maximaal","technisch_toelaatbaar_massa_koppelpunt","maximum_massa_technisch_maximaal","maximum_massa_technisch_minimaal","subcategorie_nederland","verticale_belasting_koppelpunt_getrokken_voertuig","zuinigheidsclassificatie","registratie_datum_goedkeuring_afschrijvingsmoment_bpm","registratie_datum_goedkeuring_afschrijvingsmoment_bpm_dt","gem_lading_wrde","aerodyn_voorz","massa_alt_aandr","verl_cab_ind","api_gekentekende_voertuigen_assen","api_gekentekende_voertuigen_brandstof","api_gekentekende_voertuigen_carrosserie","api_gekentekende_voertuigen_carrosserie_specifiek","api_gekentekende_voertuigen_voertuigklasse"
"11NVK2","Personenauto","TOYOTA","TOYOTA YARIS VERSO","20240929","20221001","3945","MPV","5","BLAUW","Niet geregistreerd","4","1497","975","1530","1075","400","900","20010928","20110205","Geen verstrekking in Open Data",,"Ja",,,,,,,"5","4",,,,,,"M1",,,"schutbord motorruimte","1530",,,,,,,"0.07","250","Nee","Nee",,"Nee","2430",,,"2023","Geen oordeel","05","Ja","2024-09-29T00:00:00.000","2022-10-01T00:00:00.000","2001-09-28T00:00:00.000","2011-02-05T00:00:00.000",,"0",,,,,,,,,,,,,,,,,,,,,,,,,,"https://opendata.rdw.nl/resource/3huj-srit.json","https://opendata.rdw.nl/resource/8ys7-d773.json","https://opendata.rdw.nl/resource/vezc-m2t6.json","https://opendata.rdw.nl/resource/jhie-znh9.json","https://opendata.rdw.nl/resource/kmfi-hrps.json"
"1XFK34","Personenauto","TOYOTA","TOYOTA YARIS VERSO","20240817","20140704","3208","MPV","5","ROOD","Niet geregistreerd","4","1299","996","1530","1096","400","900","20040617","20140704","Geen verstrekking in Open Data",,"Ja",,,,,,,"5","4",,,,,,"M1",,,"schutbord motorruimte","1530",,"G3 gasinstallatie",,,,,"0.06","256","Nee","Nee",,"Nee",,,,"2023","Geen oordeel","05","Ja","2024-08-17T00:00:00.000","2014-07-04T00:00:00.000","2004-06-17T00:00:00.000","2014-07-04T00:00:00.000",,"0",,,,,,,,,,,,,,,,,,,,,,,,,,"https://opendata.rdw.nl/resource/3huj-srit.json","https://opendata.rdw.nl/resource/8ys7-d773.json","https://opendata.rdw.nl/resource/vezc-m2t6.json","https://opendata.rdw.nl/resource/jhie-znh9.json","https://opendata.rdw.nl/resource/kmfi-hrps.json"
"1ZKF16","Personenauto","TOYOTA","TOYOTA YARIS VERSO","20250218","20151002","3979","MPV","5","BLAUW","Niet geregistreerd","4","1497","980","1530","1080","400","900","20040401","20141229","Geen verstrekking in Open Data",,"Ja",,,,,,,"5","4",,,,,,"M1",,,"schutbord","1530",,,,,,,"0.07","245","Nee","Nee",,"Nee",,,,"2024","Geen oordeel","05","Ja","2025-02-18T00:00:00.000","2015-10-02T00:00:00.000","2004-04-01T00:00:00.000","2014-12-29T00:00:00.000",,"0",,,,,,,,,,,,,,,,,,,,,,,,,,"https://opendata.rdw.nl/resource/3huj-srit.json","https://opendata.rdw.nl/resource/8ys7-d773.json","https://opendata.rdw.nl/resource/vezc-m2t6.json","https://opendata.rdw.nl/resource/jhie-znh9.json","https://opendata.rdw.nl/resource/kmfi-hrps.json"
"2ZVJ37","Personenauto","TOYOTA","TOYOTA YARIS VERSO","20250405","20150401","4272","MPV","5","GRIJS","Niet geregistreerd","4","1299","980","1530","1080","400","900","20051010","20150401","Geen verstrekking in Open Data",,"Ja",,,,,,,"4","4",,,,,,"M1",,,"schutbord motorruimte","1530",,,,,,,"0.06","250","Nee","Nee",,"Nee",,,,"2024","Geen oordeel","05","Ja","2025-04-05T00:00:00.000","2015-04-01T00:00:00.000","2005-10-10T00:00:00.000","2015-04-01T00:00:00.000",,,,,,,,,,,,,,,,,,,,,,,,,,,,"https://opendata.rdw.nl/resource/3huj-srit.json","https://opendata.rdw.nl/resource/8ys7-d773.json","https://opendata.rdw.nl/resource/vezc-m2t6.json","https://opendata.rdw.nl/resource/jhie-znh9.json","https://opendata.rdw.nl/resource/kmfi-hrps.json"
"35ZBX5","Personenauto","TOYOTA","YARIS VERSO","20250218","20231227","4236","MPV","5","GRIJS","Niet geregistreerd","4","1299","980","1530","1080","400","900","20030523","20121002","Geen verstrekking in Open Data",,"Ja",,,,,,,"4","4",,,,,,"M1",,,"schutbord motorruimte","1530",,,,,,,"0.06","250","Nee","Nee",,"Nee",,,,"2024","Geen oordeel","05","Ja","2025-02-18T00:00:00.000","2023-12-27T00:00:00.000","2003-05-23T00:00:00.000","2012-10-02T00:00:00.000",,"0",,,,,,,,,,,,,,,,,,,,,,,,,,"https://opendata.rdw.nl/resource/3huj-srit.json","https://opendata.rdw.nl/resource/8ys7-d773.json","https://opendata.rdw.nl/resource/vezc-m2t6.json","https://opendata.rdw.nl/resource/jhie-znh9.json","https://opendata.rdw.nl/resource/kmfi-hrps.json"
"5ZLK00","Personenauto","TOYOTA","YARIS VERSO","20250304","20150305","4248","MPV","5","GRIJS","Niet geregistreerd","4","1299","980","1530","1080","400","900","20040105","20150305","Geen verstrekking in Open Data",,"Ja",,,,,,,"4","4",,,,,,"M1",,,"schutbord motorruimte","1530",,,,,,,"0.06","249","Nee","Nee",,"Nee",,,,"2024","Geen oordeel","05","Ja","2025-03-04T00:00:00.000","2015-03-05T00:00:00.000","2004-01-05T00:00:00.000","2015-03-05T00:00:00.000",,"0",,,,,,,,,,,,,,,,,,,,,,,,,,"https://opendata.rdw.nl/resource/3huj-srit.json","https://opendata.rdw.nl/resource/8ys7-d773.json","https://opendata.rdw.nl/resource/vezc-m2t6.json","https://opendata.rdw.nl/resource/jhie-znh9.json","https://opendata.rdw.nl/resource/kmfi-hrps.json"
"9TTN41","Personenauto","TOYOTA","TOYOTA YARIS VERSO","20250512","20140507","3209","MPV","5","GRIJS","Niet geregistreerd","4","1299","955","1500","1055","400","900","20000215","20140507","Geen verstrekking in Open Data",,"Ja",,,,,,,"4","4",,,,,,"M1",,,"schutbord motorruimte","1500",,,,,,,"0.06","250","Nee","Nee",,"Nee","2400",,,"2024","Geen oordeel","05","Ja","2025-05-12T00:00:00.000","2014-05-07T00:00:00.000","2000-02-15T00:00:00.000","2014-05-07T00:00:00.000",,"0",,,,,,,,,,,,,,,,,,,,,,,,,,"https://opendata.rdw.nl/resource/3huj-srit.json","https://opendata.rdw.nl/resource/8ys7-d773.json","https://opendata.rdw.nl/resource/vezc-m2t6.json","https://opendata.rdw.nl/resource/jhie-znh9.json","https://opendata.rdw.nl/resource/kmfi-hrps.json"
"H492JZ","Personenauto","TOYOTA","TOYOTA YARIS VERSO","20250303","20200320","3486","MPV","5","GRIJS","Niet geregistreerd","4","1299","970","1530","1070","400","900","20050215","20200320","Geen verstrekking in Open Data",,"Ja","165",,,,,,"4","4",,,,,,"M1",,,,"1530",,,,,,,"0.06","250","Nee","Nee",,"Nee","2430",,,"2024","Geen oordeel","05","Ja","2025-03-03T00:00:00.000","2020-03-20T00:00:00.000","2005-02-15T00:00:00.000","2020-03-20T00:00:00.000",,,,,,,,,,,,,,,,,,,,,,,,,,,,"https://opendata.rdw.nl/resource/3huj-srit.json","https://opendata.rdw.nl/resource/8ys7-d773.json","https://opendata.rdw.nl/resource/vezc-m2t6.json","https://opendata.rdw.nl/resource/jhie-znh9.json","https://opendata.rdw.nl/resource/kmfi-hrps.json"
"H864KG","Personenauto","TOYOTA","TOYOTA YARIS VERSO","20250509","20200831","4019","MPV","5","GEEL","Niet geregistreerd","4","1497","980","1530","1080",,,"20040802","20200831","Geen verstrekking in Open Data",,"Ja","175",,,,,,"4","4",,,,,,"M1",,,,"1530","P2",,,,,,"0.07","252","Nee","Nee",,"Nee",,,,"2024","Geen oordeel","05","Ja","2025-05-09T00:00:00.000","2020-08-31T00:00:00.000","2004-08-02T00:00:00.000","2020-08-31T00:00:00.000",,,,,,,,,,,,,,,,,,,,,,,,,,,,"https://opendata.rdw.nl/resource/3huj-srit.json","https://opendata.rdw.nl/resource/8ys7-d773.json","https://opendata.rdw.nl/resource/vezc-m2t6.json","https://opendata.rdw.nl/resource/jhie-znh9.json","https://opendata.rdw.nl/resource/kmfi-hrps.json"
"HF862G","Personenauto","TOYOTA","YARIS VERSO","20240822","20220822","3522","MPV","5","GEEL","Niet geregistreerd","4","1299","1017","1530","1117","400","900","20020221","20151112","Geen verstrekking in Open Data",,"Ja",,,,,,,"4","4",,,,,,"M1",,,"schutbord motorruimte","1530",,"G3 gasinstallatie",,,,,"0.06","250","Nee","Nee",,"Nee",,,,"2023","Geen oordeel","05","Ja","2024-08-22T00:00:00.000","2022-08-22T00:00:00.000","2002-02-21T00:00:00.000","2015-11-12T00:00:00.000",,,,,,,,,,,,,,,,,,,,,,,,,,,,"https://opendata.rdw.nl/resource/3huj-srit.json","https://opendata.rdw.nl/resource/8ys7-d773.json","https://opendata.rdw.nl/resource/vezc-m2t6.json","https://opendata.rdw.nl/resource/jhie-znh9.json","https://opendata.rdw.nl/resource/kmfi-hrps.json"
"J674GD","Personenauto","TOYOTA","TOYOTA YARIS VERSO","20240602","20230602","3516","MPV","5","ROOD","Niet geregistreerd","4","1299","970","1530","1070","400","900","20050128","20210603","Geen verstrekking in Open Data",,"Ja","165",,,,,,"5","4",,,,,,"M1",,,,"1530","P2",,,,,,"0.06","250","Nee","Nee",,"Nee",,,,"2023","Geen oordeel","05","Ja","2024-06-02T00:00:00.000","2023-06-02T00:00:00.000","2005-01-28T00:00:00.000","2021-06-03T00:00:00.000",,,,,,,,,,,,,,,,,,,,,,,,,,,,"https://opendata.rdw.nl/resource/3huj-srit.json","https://opendata.rdw.nl/resource/8ys7-d773.json","https://opendata.rdw.nl/resource/vezc-m2t6.json","https://opendata.rdw.nl/resource/jhie-znh9.json","https://opendata.rdw.nl/resource/kmfi-hrps.json"
"JD516F","Personenauto","TOYOTA","TOYOTA YARIS VERSO","20250301","20160209","6208","MPV","5","GRIJS","Niet geregistreerd","4","1364","1020","1530","1120","400","900","20031216","20160209","Geen verstrekking in Open Data",,"Ja",,,,,,,"4","4",,,,,,"M1",,,"schutbord","1530",,,,,,,"0.05","250","Nee","Nee",,"Nee","2430",,,"2024","Geen oordeel","05","Ja","2025-03-01T00:00:00.000","2016-02-09T00:00:00.000","2003-12-16T00:00:00.000","2016-02-09T00:00:00.000",,,,,,,,,,,,,,,,,,,,,,,,,,,,"https://opendata.rdw.nl/resource/3huj-srit.json","https://opendata.rdw.nl/resource/8ys7-d773.json","https://opendata.rdw.nl/resource/vezc-m2t6.json","https://opendata.rdw.nl/resource/jhie-znh9.json","https://opendata.rdw.nl/resource/kmfi-hrps.json"
"JF808Z","Personenauto","TOYOTA","TOYOTA YARIS VERSO","20240614","20230615","3285","MPV","5","GRIJS","Niet geregistreerd","4","1299","970","1530","1070","400","900","20050520","20160303","Geen verstrekking in Open Data",,"Ja",,,,,,,"4","4",,,,,,"M1",,,"schutbord motorruimte","1530","P2",,,,,,"0.06","250","Nee","Nee",,"Nee","2430",,,"2023","Geen oordeel","05","Ja","2024-06-14T00:00:00.000","2023-06-15T00:00:00.000","2005-05-20T00:00:00.000","2016-03-03T00:00:00.000",,,,,,,,,,,,,,,,,,,,,,,,,,,,"https://opendata.rdw.nl/resource/3huj-srit.json","https://opendata.rdw.nl/resource/8ys7-d773.json","https://opendata.rdw.nl/resource/vezc-m2t6.json","https://opendata.rdw.nl/resource/jhie-znh9.json","https://opendata.rdw.nl/resource/kmfi-hrps.json"
"K142XB","Personenauto","TOYOTA","TOYOTA YARIS VERSO","20240611","20221205","3587","MPV","5","GRIJS","Niet geregistreerd","4","1299","970","1530","1070","400","900","20060407","20210612","Geen verstrekking in Open Data",,"Ja","165",,,,,,"4","4",,,,,,"M1",,,,"1530","P2",,,,,,"0.06","250","Nee","Nee",,"Nee","2430",,,"2023","Geen oordeel","05","Ja","2024-06-11T00:00:00.000","2022-12-05T00:00:00.000","2006-04-07T00:00:00.000","2021-06-12T00:00:00.000",,,,,,,,,,,,,,,,,,,,,,,,,,,,"https://opendata.rdw.nl/resource/3huj-srit.json","https://opendata.rdw.nl/resource/8ys7-d773.json","https://opendata.rdw.nl/resource/vezc-m2t6.json","https://opendata.rdw.nl/resource/jhie-znh9.json","https://opendata.rdw.nl/resource/kmfi-hrps.json"
"KH061B","Personenauto","TOYOTA","TOYOTA YARIS VERSO","20250313","20230314","3984","MPV","5","GRIJS","Niet geregistreerd","4","1299","980","1530","1080","400","900","20040618","20160830","Geen verstrekking in Open Data",,"Ja",,,,,,,"4","4",,,,,,"M1",,,"r. schutbord by motorruimte","1530",,,,,,,"0.06","250","Nee","Nee",,"Nee","2430",,,"2024","Geen oordeel","05","Ja","2025-03-13T00:00:00.000","2023-03-14T00:00:00.000","2004-06-18T00:00:00.000","2016-08-30T00:00:00.000",,,,,,,,,,,,,,,,,,,,,,,,,,,,"https://opendata.rdw.nl/resource/3huj-srit.json","https://opendata.rdw.nl/resource/8ys7-d773.json","https://opendata.rdw.nl/resource/vezc-m2t6.json","https://opendata.rdw.nl/resource/jhie-znh9.json","https://opendata.rdw.nl/resource/kmfi-hrps.json"
"KJ127T","Personenauto","TOYOTA","TOYOTA YARIS VERSO","20241101","20220429","3869","MPV","5","GRIJS","Niet geregistreerd","4","1299","980","1530","1080","400","900","20030319","20160927","Geen verstrekking in Open Data",,"Ja",,,,,,,"4","4",,,,,,"M1",,,"schutbord motorruimte","1530","P21",,,,,,"0.06","250","Nee","Nee",,"Nee","2430",,,"2023","Geen oordeel","05","Ja","2024-11-01T00:00:00.000","2022-04-29T00:00:00.000","2003-03-19T00:00:00.000","2016-09-27T00:00:00.000",,,,,,,,,,,,,,,,,,,,,,,,,,,,"https://opendata.rdw.nl/resource/3huj-srit.json","https://opendata.rdw.nl/resource/8ys7-d773.json","https://opendata.rdw.nl/resource/vezc-m2t6.json","https://opendata.rdw.nl/resource/jhie-znh9.json","https://opendata.rdw.nl/resource/kmfi-hrps.json"
"KP308B","Personenauto","TOYOTA","TOYOTA YARIS VERSO","20241204","20200629","4199","MPV","5","GROEN","Niet geregistreerd","4","1299","970","1530","1070","400","900","20040923","20161028","Geen verstrekking in Open Data",,"Ja",,,,,,,"5","4",,,,,,"M1",,,"schutbord by motorruimte","1530","P2",,,,,,"0.06","250","Nee","Nee",,"Nee",,,,"2023","Geen oordeel","05","Ja","2024-12-04T00:00:00.000","2020-06-29T00:00:00.000","2004-09-23T00:00:00.000","2016-10-28T00:00:00.000",,,,,,,,,,,,,,,,,,,,,,,,,,,,"https://opendata.rdw.nl/resource/3huj-srit.json","https://opendata.rdw.nl/resource/8ys7-d773.json","https://opendata.rdw.nl/resource/vezc-m2t6.json","https://opendata.rdw.nl/resource/jhie-znh9.json","https://opendata.rdw.nl/resource/kmfi-hrps.json"
"L827DV","Personenauto","TOYOTA","YARIS VERSO 1.3 VVT","20250505","20210505","4178","MPV","5","GRIJS","Niet geregistreerd","4","1299","980","1530","1080","400","900","20060913","20210505","Geen verstrekking in Open Data",,"Ja","155",,,,,,"4","4",,,,,,"M1",,,,"1530","P2",,,,,,"0.06","250","Nee","Nee",,"Nee","2430",,,"2024","Geen oordeel","05","Ja","2025-05-05T00:00:00.000","2021-05-05T00:00:00.000","2006-09-13T00:00:00.000","2021-05-05T00:00:00.000",,,,,,,,,,,,,,,,,,,,,,,,,,,,"https://opendata.rdw.nl/resource/3huj-srit.json","https://opendata.rdw.nl/resource/8ys7-d773.json","https://opendata.rdw.nl/resource/vezc-m2t6.json","https://opendata.rdw.nl/resource/jhie-znh9.json","https://opendata.rdw.nl/resource/kmfi-hrps.json"
"NJ276V","Personenauto","TOYOTA","TOYOTA YARIS VERSO","20250404","20170316","3285","MPV","5","GRIJS","Niet geregistreerd","4","1299","980","1530","1080","400","900","20050228","20170316","Geen verstrekking in Open Data",,"Ja",,,,,,,"4","4",,,,,,"M1",,,"r. schutbord","1530","P2",,,,,,"0.06","250","Nee","Nee",,"Nee","2430",,,"2024","Geen oordeel","05","Ja","2025-04-04T00:00:00.000","2017-03-16T00:00:00.000","2005-02-28T00:00:00.000","2017-03-16T00:00:00.000",,,,,,,,,,,,,,,,,,,,,,,,,,,,"https://opendata.rdw.nl/resource/3huj-srit.json","https://opendata.rdw.nl/resource/8ys7-d773.json","https://opendata.rdw.nl/resource/vezc-m2t6.json","https://opendata.rdw.nl/resource/jhie-znh9.json","https://opendata.rdw.nl/resource/kmfi-hrps.json"
"NV478B","Personenauto","TOYOTA","TOYOTA YARIS VERSO","20240829","20190824","2686","MPV","5","ZWART","Niet geregistreerd","4","1299","970","1530","1070","400","900","20050708","20170825","Geen verstrekking in Open Data",,"Ja",,,,,,,"5","4",,,,,,"M1",,,"schutbord","1530","P2",,,,,,"0.06","250","Nee","Nee",,"Nee","2430",,,"2023","Geen oordeel","05","Ja","2024-08-29T00:00:00.000","2019-08-24T00:00:00.000","2005-07-08T00:00:00.000","2017-08-25T00:00:00.000",,,,,,,,,,,,,,,,,,,,,,,,,,,,"https://opendata.rdw.nl/resource/3huj-srit.json","https://opendata.rdw.nl/resource/8ys7-d773.json","https://opendata.rdw.nl/resource/vezc-m2t6.json","https://opendata.rdw.nl/resource/jhie-znh9.json","https://opendata.rdw.nl/resource/kmfi-hrps.json"
"NX217V","Personenauto","TOYOTA","TOYOTA YARIS VERSO","20250227","20240112","3476","MPV","5","ZWART","Niet geregistreerd","4","1299","970","1530","1070","400","900","20041209","20180226","Geen verstrekking in Open Data",,"Ja",,,,,,,"4","4",,,,,,"M1",,,"r. schutbord motorruimte","1530","P2",,,,,,"0.06","250","Nee","Nee",,"Nee","2430",,,"2024","Geen oordeel","05","Ja","2025-02-27T00:00:00.000","2024-01-12T00:00:00.000","2004-12-09T00:00:00.000","2018-02-26T00:00:00.000",,,,,,,,,,,,,,,,,,,,,,,,,,,,"https://opendata.rdw.nl/resource/3huj-srit.json","https://opendata.rdw.nl/resource/8ys7-d773.json","https://opendata.rdw.nl/resource/vezc-m2t6.json","https://opendata.rdw.nl/resource/jhie-znh9.json","https://opendata.rdw.nl/resource/kmfi-hrps.json"
"P013NX","Personenauto","TOYOTA","TOYOTA YARIS VERSO","20250430","20220428","3356","MPV","5","GRIJS","Niet geregistreerd","4","1299","970","1530","1070","400","900","20050421","20220428","Geen verstrekking in Open Data",,"Ja","165",,,,,,"5","4",,,,,,"M1",,,,"1530","P2",,,,,,"0.06","250","Nee","Nee",,"Nee","2430",,,"2024","Geen oordeel","05","Ja","2025-04-30T00:00:00.000","2022-04-28T00:00:00.000","2005-04-21T00:00:00.000","2022-04-28T00:00:00.000",,,,,,,,,,,,,,,,,,,,,,"20220425","2022-04-25T00:00:00.000",,,,,"https://opendata.rdw.nl/resource/3huj-srit.json","https://opendata.rdw.nl/resource/8ys7-d773.json","https://opendata.rdw.nl/resource/vezc-m2t6.json","https://opendata.rdw.nl/resource/jhie-znh9.json","https://opendata.rdw.nl/resource/kmfi-hrps.json"
"P240PK","Personenauto","TOYOTA","TOYOTA YARIS VERSO","20240921","20220924","3847","MPV","5","GRIJS","Niet geregistreerd","4","1299","980","1530","1080","400","900","20050317","20220924","Geen verstrekking in Open Data",,"Ja","155",,,,,,"5","4",,,,,,"M1",,,,"1530","P2",,,,,,"0.06","250","Nee","Nee",,"Nee",,,,"2023","Geen oordeel","05","Ja","2024-09-21T00:00:00.000","2022-09-24T00:00:00.000","2005-03-17T00:00:00.000","2022-09-24T00:00:00.000",,,,,,,,,,,,,,,,,,,,,,"20220502","2022-05-02T00:00:00.000",,,,,"https://opendata.rdw.nl/resource/3huj-srit.json","https://opendata.rdw.nl/resource/8ys7-d773.json","https://opendata.rdw.nl/resource/vezc-m2t6.json","https://opendata.rdw.nl/resource/jhie-znh9.json","https://opendata.rdw.nl/resource/kmfi-hrps.json"
"PD902P","Personenauto","TOYOTA","TOYOTA YARIS VERSO","20250308","20170708","780","MPV","5","ZWART","Niet geregistreerd","4","1299","970","1530","1070","400","900","20050629","20170708","Geen verstrekking in Open Data","19064","Ja",,,,,,,"4","4",,,,,,"M1",,,"r. schutbord by motorruimte","1530",,,,,,,"0.06","251","Nee","Nee",,"Nee","2430",,,"2024","Geen oordeel","05","Ja","2025-03-08T00:00:00.000","2017-07-08T00:00:00.000","2005-06-29T00:00:00.000","2017-07-08T00:00:00.000",,,,,,,,,,,,,,,,,,,,,,,,,,,,"https://opendata.rdw.nl/resource/3huj-srit.json","https://opendata.rdw.nl/resource/8ys7-d773.json","https://opendata.rdw.nl/resource/vezc-m2t6.json","https://opendata.rdw.nl/resource/jhie-znh9.json","https://opendata.rdw.nl/resource/kmfi-hrps.json"
"PF380X","Personenauto","TOYOTA","TOYOTA YARIS VERSO","20231223","20171006","2953","MPV","5","GRIJS","Niet geregistreerd","4","1299","965","1530","1065","400","900","20000525","20171006","Geen verstrekking in Open Data",,"Ja",,,,,,,"4","4",,,,,,"M1",,,"by schutbord","1530","P2",,,,,,"0.06","248","Nee","Nee",,"Nee","2430",,,"2024","Geen oordeel","05","Ja","2023-12-23T00:00:00.000","2017-10-06T00:00:00.000","2000-05-25T00:00:00.000","2017-10-06T00:00:00.000",,,,,,,,,,,,,,,,,,,,,,,,,,,,"https://opendata.rdw.nl/resource/3huj-srit.json","https://opendata.rdw.nl/resource/8ys7-d773.json","https://opendata.rdw.nl/resource/vezc-m2t6.json","https://opendata.rdw.nl/resource/jhie-znh9.json","https://opendata.rdw.nl/resource/kmfi-hrps.json"
"RF190L","Personenauto","TOYOTA","YARIS VERSO","20240929","20240131","3898","MPV","5","BLAUW","Niet geregistreerd","4","1299","990","1493","1090","400","900","20040915","20040915","Geen verstrekking in Open Data",,"Ja",,,,,,,"4","4",,,,,,"M1",,,"midden tegen schutbord onder motorkap","1493",,,,,,,"0.06","250","Nee","Nee",,"Nee","2393",,,"2023","Geen oordeel","05","Ja","2024-09-29T00:00:00.000","2024-01-31T00:00:00.000","2004-09-15T00:00:00.000","2004-09-15T00:00:00.000",,,,,,,,,,,,,,,,,,,,,,,,,,,,"https://opendata.rdw.nl/resource/3huj-srit.json","https://opendata.rdw.nl/resource/8ys7-d773.json","https://opendata.rdw.nl/resource/vezc-m2t6.json","https://opendata.rdw.nl/resource/jhie-znh9.json","https://opendata.rdw.nl/resource/kmfi-hrps.json"
"RK960V","Personenauto","TOYOTA","TOYOTA YARIS VERSO","20250117","20180406","3914","MPV","5","GRIJS","Niet geregistreerd","4","1299","970","1530","1070","400","900","20050524","20180406","Geen verstrekking in Open Data",,"Ja",,,,,,,"4","4",,,,,,"M1",,,,"1530","P2",,,,,,"0.06","250","Nee","Nee",,"Nee",,,,"2024","Geen oordeel","05","Ja","2025-01-17T00:00:00.000","2018-04-06T00:00:00.000","2005-05-24T00:00:00.000","2018-04-06T00:00:00.000",,,,,,,,,,,,,,,,,,,,,,,,,,,,"https://opendata.rdw.nl/resource/3huj-srit.json","https://opendata.rdw.nl/resource/8ys7-d773.json","https://opendata.rdw.nl/resource/vezc-m2t6.json","https://opendata.rdw.nl/resource/jhie-znh9.json","https://opendata.rdw.nl/resource/kmfi-hrps.json"
"RS400P","Personenauto","TOYOTA","TOYOTA YARIS VERSO","20250122","20180122","3470","MPV","5","ZWART","Niet geregistreerd","4","1299","1011","1530","1111","400","900","20010511","20180122","Geen verstrekking in Open Data",,"Ja",,,,,,,"4","4",,,,,,"M1",,,"r. schutbord motorruimte","1530","P2","G3 gasinstallatie",,,,,"0.06","250","Nee","Nee",,"Nee",,,,"2024","Geen oordeel","05","Ja","2025-01-22T00:00:00.000","2018-01-22T00:00:00.000","2001-05-11T00:00:00.000","2018-01-22T00:00:00.000",,,,,,,,,,,,,,,,,,,,,,,,,,,,"https://opendata.rdw.nl/resource/3huj-srit.json","https://opendata.rdw.nl/resource/8ys7-d773.json","https://opendata.rdw.nl/resource/vezc-m2t6.json","https://opendata.rdw.nl/resource/jhie-znh9.json","https://opendata.rdw.nl/resource/kmfi-hrps.json"