"kenteken","voertuigsoort","merk","handelsbenaming","vervaldatum_apk","datum_tenaamstelling","bruto_bpm","inrichting","aantal_zitplaatsen","eerste_kleur","tweede_kleur","aantal_cilinders","cilinderinhoud","massa_ledig_voertuig","toegestane_maximum_massa_voertuig","massa_rijklaar","maximum_massa_trekken_ongeremd","maximum_trekken_massa_geremd","datum_eerste_toelating","datum_eerste_tenaamstelling_in_nederland","wacht_op_keuren","catalogusprijs","wam_verzekerd","maximale_constructiesnelheid","laadvermogen","oplegger_geremd","aanhangwagen_autonoom_geremd","aanhangwagen_middenas_geremd","aantal_staanplaatsen","aantal_deuren","aantal_wielen","afstand_hart_koppeling_tot_achterzijde_voertuig","afstand_voorzijde_voertuig_tot_hart_koppeling","afwijkende_maximum_snelheid","lengte","breedte","europese_voertuigcategorie","europese_voertuigcategorie_toevoeging","europese_uitvoeringcategorie_toevoeging","plaats_chassisnummer","technische_max_massa_voertuig","type","type_gasinstallatie","typegoedkeuringsnummer","variant","uitvoering","volgnummer_wijziging_eu_typegoedkeuring","vermogen_massarijklaar","wielbasis","export_indicator","openstaande_terugroepactie_indicator","vervaldatum_tachograaf","taxi_indicator","maximum_massa_samenstelling","aantal_rolstoelplaatsen","maximum_ondersteunende_snelheid","jaar_laatste_registratie_tellerstand","tellerstandoordeel","code_toelichting_tellerstandoordeel","tenaamstellen_mogelijk","vervaldatum_apk_dt","datum_tenaamstelling_dt","datum_eerste_toelating_dt","datum_eerste_tenaamstelling_in_nederland_dt","vervaldatum_tachograaf_dt","maximum_last_onder_de_vooras_sen_tezamen_koppeling","type_remsysteem_voertuig_code","rupsonderstelconfiguratiecode","wielbasis_voertuig_minimum","wielbasis_voertuig_maximum","lengte_voertuig_minimum","lengte_voertuig_maximum","breedte_voertuig_minimum","breedte_voertuig_maximum","hoogte_voertuig","hoogte_voertuig_minimum","hoogte_voertuig_maximum","massa_bedrijfsklaar_minimaal","massa_bedrijfsklaar_maximaal","technisch_toelaatbaar_massa_koppelpunt","maximum_massa_technisch_maximaal","maximum_massa_technisch_minimaal","subcategorie_nederland","verticale_belasting_koppelpunt_getrokken_voertuig","zuinigheidsclassificatie","registratie_datum_goedkeuring_afschrijvingsmoment_bpm","registratie_datum_goedkeuring_afschrijvingsmoment_bpm_dt","gem_lading_wrde","aerodyn_voorz","massa_alt_aandr","verl_cab_ind","api_gekentekende_voertuigen_assen","api_gekentekende_voertuigen_brandstof","api_gekentekende_voertuigen_carrosserie","api_gekentekende_voertuigen_carrosserie_specifiek","api_gekentekende_voertuigen_voertuigklasse"
"1TRL84","Personenauto","SUZUKI","SPLASH","20250424","20230617","1915","hatchback","5","ROOD","Niet geregistreerd","4","1242","965","1485","1065","200","200","20090212","20150119","Geen verstrekking in Open Data",,"Ja",,,,,,,"4","4",,,,,,"M1",,,"op r. schroefveerkoker onder motorkap","1485",,,,,,,"0.06","236","Nee","Nee",,"Nee",,,,"2024","Onlogisch","04","Ja","2025-04-24T00:00:00.000","2023-06-17T00:00:00.000","2009-02-12T00:00:00.000","2015-01-19T00:00:00.000",,"0",,,,,,,,,,,,,,,,,,,,,,,,,,"https://opendata.rdw.nl/resource/3huj-srit.json","https://opendata.rdw.nl/resource/8ys7-d773.json","https://opendata.rdw.nl/resource/vezc-m2t6.json","https://opendata.rdw.nl/resource/jhie-znh9.json","https://opendata.rdw.nl/resource/kmfi-hrps.json"
"1XSZ27","Personenauto","SUZUKI","SPLASH 1,0","20241005","20221006","332","hatchback","5","GRIJS","Niet geregistreerd","3","996","950","1485","1050",,,"20100913","20150718","Geen verstrekking in Open Data","9297","Ja",,,,,,,"4","4",,,,,,"M1",,,"r. by schutbord","1485",,,,,,,"0.05","236","Nee","Nee",,"Nee",,,,"2023","Geen oordeel","05","Ja","2024-10-05T00:00:00.000","2022-10-06T00:00:00.000","2010-09-13T00:00:00.000","2015-07-18T00:00:00.000",,"0",,,,,,,,,,,,,,,,,,,,,,,,,,"https://opendata.rdw.nl/resource/3huj-srit.json","https://opendata.rdw.nl/resource/8ys7-d773.json","https://opendata.rdw.nl/resource/vezc-m2t6.json","https://opendata.rdw.nl/resource/jhie-znh9.json","https://opendata.rdw.nl/resource/kmfi-hrps.json"
"3SNZ27","Personenauto","SUZUKI","SPLASH","20250109","20240301","1624","hatchback","5","GRIJS","Niet geregistreerd","3","996","875","1485","975",,,"20090623","20131108","Geen verstrekking in Open Data",,"Nee",,,,,,,"4","4",,,,,,"M1",,,"r. schutbord motorruimte","1485","EX",,,,,,"0.05","238","Nee","Nee",,"Nee",,,,"2024","Geen oordeel","05","Ja","2025-01-09T00:00:00.000","2024-03-01T00:00:00.000","2009-06-23T00:00:00.000","2013-11-08T00:00:00.000",,"0",,,,,,,,,,,,,,,,,,,,,,,,,,"https://opendata.rdw.nl/resource/3huj-srit.json","https://opendata.rdw.nl/resource/8ys7-d773.json","https://opendata.rdw.nl/resource/vezc-m2t6.json","https://opendata.rdw.nl/resource/jhie-znh9.json","https://opendata.rdw.nl/resource/kmfi-hrps.json"
"5XVK82","Personenauto","SUZUKI","SPLASH","20240927","20150903","534","hatchback","5","BLAUW","Niet geregistreerd","3","996","950","1485","1050",,,"20090519","20150903","Geen verstrekking in Open Data",,"Ja",,,,,,,"4","4",,,,,,"M1",,,"r. schutbord motorruimte","1485",,,,,,,"0.05","236","Nee","Nee",,"Nee",,,,"2023","Geen oordeel","05","Ja","2024-09-27T00:00:00.000","2015-09-03T00:00:00.000","2009-05-19T00:00:00.000","2015-09-03T00:00:00.000",,"0",,,,,,,,,,,,,,,,,,,,,,,,,,"https://opendata.rdw.nl/resource/3huj-srit.json","https://opendata.rdw.nl/resource/8ys7-d773.json","https://opendata.rdw.nl/resource/vezc-m2t6.json","https://opendata.rdw.nl/resource/jhie-znh9.json","https://opendata.rdw.nl/resource/kmfi-hrps.json"
"99HLP5","Personenauto","SUZUKI","SPLASH","20250103","20230724","2384","hatchback","5","GROEN","Niet geregistreerd","4","1242","965","1485","1065","200","200","20090108","20090108","Geen verstrekking in Open Data",,"Ja",,,,,,,"4","4","0","0",,"0","0","M1",,,"op r. schroefveerkoker onder motorkap","1485","EX",,"e4*2001/116*0130*00","B32S","MT","0","0.06","236","Nee","Nee",,"Nee","1685","0","0.00","2023","Geen oordeel","05","Ja","2025-01-03T00:00:00.000","2023-07-24T00:00:00.000","2009-01-08T00:00:00.000","2009-01-08T00:00:00.000",,,,,,,,,,,,,,,,,,,,,"B","20230523","2023-05-23T00:00:00.000",,,,,"https://opendata.rdw.nl/resource/3huj-srit.json","https://opendata.rdw.nl/resource/8ys7-d773.json","https://opendata.rdw.nl/resource/vezc-m2t6.json","https://opendata.rdw.nl/resource/jhie-znh9.json","https://opendata.rdw.nl/resource/kmfi-hrps.json"
"9XRD61","Personenauto","SUZUKI","SPLASH","20241128","20231029","2114","hatchback","5","GRIJS","Niet geregistreerd","4","1242","965","1485","1065","200","200","20090225","20141121","Geen verstrekking in Open Data",,"Ja",,,,,,,"4","4",,,,,,"M1",,,"by r. schroefveerkoker","1485",,,,,,,"0.06","237","Nee","Nee",,"Nee","1685",,,"2023","Geen oordeel","05","Ja","2024-11-28T00:00:00.000","2023-10-29T00:00:00.000","2009-02-25T00:00:00.000","2014-11-21T00:00:00.000",,"0",,,,,,,,,,,,,,,,,,,,,,,,,,"https://opendata.rdw.nl/resource/3huj-srit.json","https://opendata.rdw.nl/resource/8ys7-d773.json","https://opendata.rdw.nl/resource/vezc-m2t6.json","https://opendata.rdw.nl/resource/jhie-znh9.json","https://opendata.rdw.nl/resource/kmfi-hrps.json"
"GT751Z","Personenauto","SUZUKI","SPLASH","20240826","20200824","1127","hatchback","5","GRIJS","Niet geregistreerd","4","1242","965","1485","1065",,,"20110621","20150825","Geen verstrekking in Open Data","13040","Ja",,,,,,,"4","4",,,,,,"M1",,,"motorruimte r. schroefveerkoker","1485",,,,,,,"0.06","236","Nee","Nee",,"Nee",,,,"2023","Geen oordeel","05","Ja","2024-08-26T00:00:00.000","2020-08-24T00:00:00.000","2011-06-21T00:00:00.000","2015-08-25T00:00:00.000",,,,,,,,,,,,,,,,,,,,,,,,,,,,"https://opendata.rdw.nl/resource/3huj-srit.json","https://opendata.rdw.nl/resource/8ys7-d773.json","https://opendata.rdw.nl/resource/vezc-m2t6.json","https://opendata.rdw.nl/resource/jhie-znh9.json","https://opendata.rdw.nl/resource/kmfi-hrps.json"
"H075JH","Personenauto","SUZUKI","SPLASH","20241126","20240107","1499","hatchback","5","GROEN","Niet geregistreerd","3","996","950","1485","1050",,,"20090421","20200714","Geen verstrekking in Open Data",,"Ja","160",,,,,,"4","4",,,,,,"M1",,,,"1485","EX",,,,,,"0.05","237","Nee","Nee",,"Nee",,,,"2023","Geen oordeel","05","Ja","2024-11-26T00:00:00.000","2024-01-07T00:00:00.000","2009-04-21T00:00:00.000","2020-07-14T00:00:00.000",,,,,,,,,,,,,,,,,,,,,,,,,,,,"https://opendata.rdw.nl/resource/3huj-srit.json","https://opendata.rdw.nl/resource/8ys7-d773.json","https://opendata.rdw.nl/resource/vezc-m2t6.json","https://opendata.rdw.nl/resource/jhie-znh9.json","https://opendata.rdw.nl/resource/kmfi-hrps.json"
"HG737J","Personenauto","SUZUKI","SPLASH","20241108","20221109","2114","hatchback","5","ORANJE","Niet geregistreerd","4","1242","965","1485","1065","200","200","20090408","20151028","Geen verstrekking in Open Data",,"Ja",,,,,,,"4","4",,,,,,"M1",,,"r. schroefveerkoker","1485",,,,,,,"0.06","237","Nee","Nee",,"Nee","1685",,,"2023","Geen oordeel","05","Ja","2024-11-08T00:00:00.000","2022-11-09T00:00:00.000","2009-04-08T00:00:00.000","2015-10-28T00:00:00.000",,,,,,,,,,,,,,,,,,,,,,,,,,,,"https://opendata.rdw.nl/resource/3huj-srit.json","https://opendata.rdw.nl/resource/8ys7-d773.json","https://opendata.rdw.nl/resource/vezc-m2t6.json","https://opendata.rdw.nl/resource/jhie-znh9.json","https://opendata.rdw.nl/resource/kmfi-hrps.json"
"HG844P","Personenauto","SUZUKI","SPLASH","20250215","20151023",,"hatchback","5","GRIJS","Niet geregistreerd","4","996","950","1485","1050",,,"20120116","20151023","Geen verstrekking in Open Data","8699","Ja",,,,,,,"4","4",,,,,,"M1",,,"r. motorruimte","1485",,,,,,,"0.05","235","Nee","Nee",,"Nee",,,,"2024","Geen oordeel","05","Ja","2025-02-15T00:00:00.000","2015-10-23T00:00:00.000","2012-01-16T00:00:00.000","2015-10-23T00:00:00.000",,,,,,,,,,,,,,,,,,,,,,,,,,,,"https://opendata.rdw.nl/resource/3huj-srit.json","https://opendata.rdw.nl/resource/8ys7-d773.json","https://opendata.rdw.nl/resource/vezc-m2t6.json","https://opendata.rdw.nl/resource/jhie-znh9.json","https://opendata.rdw.nl/resource/kmfi-hrps.json"
"HN352Z","Personenauto","SUZUKI","SPLASH","20241208","20210401","1127","hatchback","5","BLAUW","Niet geregistreerd","4","1242","965","1485","1065",,,"20110614","20151208","Geen verstrekking in Open Data","13040","Ja",,,,,,,"4","4",,,,,,"M1",,,"v. schutbord","1485",,,,,,,"0.06","236","Nee","Nee",,"Nee",,,,"2023","Geen oordeel","05","Ja","2024-12-08T00:00:00.000","2021-04-01T00:00:00.000","2011-06-14T00:00:00.000","2015-12-08T00:00:00.000",,,,,,,,,,,,,,,,,,,,,,,,,,,,"https://opendata.rdw.nl/resource/3huj-srit.json","https://opendata.rdw.nl/resource/8ys7-d773.json","https://opendata.rdw.nl/resource/vezc-m2t6.json","https://opendata.rdw.nl/resource/jhie-znh9.json","https://opendata.rdw.nl/resource/kmfi-hrps.json"
"JD710S","Personenauto","SUZUKI","SPLASH","20250219","20160217","2320","hatchback","5","GROEN","Niet geregistreerd","4","1242","890","1485","990",,"200","20080711","20160217","Geen verstrekking in Open Data",,"Ja",,,,,,,"4","4",,,,,,"M1",,,"r. op schutbord onder motorkap","1485",,,,,,,"0.06","236","Nee","Nee",,"Nee","1685",,,"2024","Geen oordeel","05","Ja","2025-02-19T00:00:00.000","2016-02-17T00:00:00.000","2008-07-11T00:00:00.000","2016-02-17T00:00:00.000",,,,,,,,,,,,,,,,,,,,,,,,,,,,"https://opendata.rdw.nl/resource/3huj-srit.json","https://opendata.rdw.nl/resource/8ys7-d773.json","https://opendata.rdw.nl/resource/vezc-m2t6.json","https://opendata.rdw.nl/resource/jhie-znh9.json","https://opendata.rdw.nl/resource/kmfi-hrps.json"
"K535ZR","Personenauto","SUZUKI","SPLASH","20250406","20210531","1144","hatchback","5","BLAUW","Niet geregistreerd","3","996","950","1485","1050",,,"20090429","20210531","Geen verstrekking in Open Data",,"Ja","160",,,,,,"4","4",,,,,,"M1",,,,"1485",,,,,,,"0.05","236","Nee","Nee",,"Nee",,,,"2024","Geen oordeel","05","Ja","2025-04-06T00:00:00.000","2021-05-31T00:00:00.000","2009-04-29T00:00:00.000","2021-05-31T00:00:00.000",,,,,,,,,,,,,,,,,,,,,,,,,,,,"https://opendata.rdw.nl/resource/3huj-srit.json","https://opendata.rdw.nl/resource/8ys7-d773.json","https://opendata.rdw.nl/resource/vezc-m2t6.json","https://opendata.rdw.nl/resource/jhie-znh9.json","https://opendata.rdw.nl/resource/kmfi-hrps.json"
"KD416P","Personenauto","SUZUKI","SPLASH 1,0","20250323","20230325","75","hatchback","5","GRIJS","Niet geregistreerd","3","996","950","1485","1050",,,"20120419","20160817","Geen verstrekking in Open Data","12669","Ja",,,,,,,"4","4",,,,,,"M1",,,"r. motorruimte","1485","EX",,,,,,"0.05","236","Nee","Nee",,"Nee",,,,"2024","Geen oordeel","05","Ja","2025-03-23T00:00:00.000","2023-03-25T00:00:00.000","2012-04-19T00:00:00.000","2016-08-17T00:00:00.000",,,,,,,,,,,,,,,,,,,,,,,,,,,,"https://opendata.rdw.nl/resource/3huj-srit.json","https://opendata.rdw.nl/resource/8ys7-d773.json","https://opendata.rdw.nl/resource/vezc-m2t6.json","https://opendata.rdw.nl/resource/jhie-znh9.json","https://opendata.rdw.nl/resource/kmfi-hrps.json"
"KG282F","Personenauto","SUZUKI","SPLASH 1.2","20240722","20200723","2973","hatchback","5","ROOD","Niet geregistreerd","4","1242","1015","1485","1115","200","200","20120404","20161013","Geen verstrekking in Open Data","16494","Ja",,,,,,,"4","4",,,,,,"M1",,,"r. voorwielscherm","1485","EX",,,,,,"0.06","236","Nee","Nee",,"Nee","1685",,,"2023","Geen oordeel","05","Ja","2024-07-22T00:00:00.000","2020-07-23T00:00:00.000","2012-04-04T00:00:00.000","2016-10-13T00:00:00.000",,,,,,,,,,,,,,,,,,,,,,,,,,,,"https://opendata.rdw.nl/resource/3huj-srit.json","https://opendata.rdw.nl/resource/8ys7-d773.json","https://opendata.rdw.nl/resource/vezc-m2t6.json","https://opendata.rdw.nl/resource/jhie-znh9.json","https://opendata.rdw.nl/resource/kmfi-hrps.json"
"KH979H","Personenauto","SUZUKI","SPLASH","20240710","20230616","831","hatchback","5","GRIJS","Niet geregistreerd","3","996","950","1485","1050",,,"20090806","20161122","Geen verstrekking in Open Data",,"Ja",,,,,,,"4","4",,,,,,"M1",,,"r. schroefveerkoker motorruimte","1485",,,,,,,"0.05","236","Nee","Nee",,"Nee",,,,"2023","Geen oordeel","05","Ja","2024-07-10T00:00:00.000","2023-06-16T00:00:00.000","2009-08-06T00:00:00.000","2016-11-22T00:00:00.000",,,,,,,,,,,,,,,,,,,,,,,,,,,,"https://opendata.rdw.nl/resource/3huj-srit.json","https://opendata.rdw.nl/resource/8ys7-d773.json","https://opendata.rdw.nl/resource/vezc-m2t6.json","https://opendata.rdw.nl/resource/jhie-znh9.json","https://opendata.rdw.nl/resource/kmfi-hrps.json"
"KS759F","Personenauto","SUZUKI","SPLASH","20250411","20190417","1511","hatchback","5","GRIJS","Niet geregistreerd","3","996","950","1485","1050",,,"20090409","20170616","Geen verstrekking in Open Data",,"Ja",,,,,,,"4","4",,,,,,"M1",,,"schutbord r. motorruimte","1485","EX",,,,,,"0.05","236","Nee","Nee",,"Nee",,,,"2024","Geen oordeel","05","Ja","2025-04-11T00:00:00.000","2019-04-17T00:00:00.000","2009-04-09T00:00:00.000","2017-06-16T00:00:00.000",,,,,,,,,,,,,,,,,,,,,,,,,,,,"https://opendata.rdw.nl/resource/3huj-srit.json","https://opendata.rdw.nl/resource/8ys7-d773.json","https://opendata.rdw.nl/resource/vezc-m2t6.json","https://opendata.rdw.nl/resource/jhie-znh9.json","https://opendata.rdw.nl/resource/kmfi-hrps.json"
"NH436G","Personenauto","SUZUKI","SPLASH","20250126","20170128","2114","hatchback","5","BLAUW","Niet geregistreerd","4","1242","965","1600","1065","200","200","20090320","20170128","Geen verstrekking in Open Data",,"Ja",,,,,,,"4","4",,,,,,"M1",,,"v. motorruimte by schutbord","1600","EX",,,,,,"0.06","237","Nee","Nee",,"Nee",,,,"2024","Geen oordeel","05","Ja","2025-01-26T00:00:00.000","2017-01-28T00:00:00.000","2009-03-20T00:00:00.000","2017-01-28T00:00:00.000",,,,,,,,,,,,,,,,,,,,,,,,,,,,"https://opendata.rdw.nl/resource/3huj-srit.json","https://opendata.rdw.nl/resource/8ys7-d773.json","https://opendata.rdw.nl/resource/vezc-m2t6.json","https://opendata.rdw.nl/resource/jhie-znh9.json","https://opendata.rdw.nl/resource/kmfi-hrps.json"
"NK656L","Personenauto","SUZUKI","SPLASH 1.2","20241208","20171211","3911","hatchback","5","GRIJS","Niet geregistreerd","4","1242","965","1485","1065",,"200","20120328","20171211","Geen verstrekking in Open Data","15402","Ja",,,,,,,"4","4",,,,,,"M1",,,"r. schutbord motorruimte","1485","EX",,,,,,"0.06","237","Nee","Nee",,"Nee","1685",,,"2023","Geen oordeel","05","Ja","2024-12-08T00:00:00.000","2017-12-11T00:00:00.000","2012-03-28T00:00:00.000","2017-12-11T00:00:00.000",,,,,,,,,,,,,,,,,,,,,,,,,,,,"https://opendata.rdw.nl/resource/3huj-srit.json","https://opendata.rdw.nl/resource/8ys7-d773.json","https://opendata.rdw.nl/resource/vezc-m2t6.json","https://opendata.rdw.nl/resource/jhie-znh9.json","https://opendata.rdw.nl/resource/kmfi-hrps.json"
"NX192N","Personenauto","SUZUKI","SPLASH","20240508","20240219","1618","hatchback","5","BLAUW","Niet geregistreerd","4","1242","965","1485","1065",,,"20090409","20170508","Geen verstrekking in Open Data",,"Ja",,,,,,,"4","4",,,,,,"M1",,,"op r. schroefveerkoker onder motorkap","1485","EX",,,,,,"0.06","236","Nee","Nee",,"Nee",,,,"2024","Geen oordeel","05","Ja","2024-05-08T00:00:00.000","2024-02-19T00:00:00.000","2009-04-09T00:00:00.000","2017-05-08T00:00:00.000",,,,,,,,,,,,,,,,,,,,,,,,,,,,"https://opendata.rdw.nl/resource/3huj-srit.json","https://opendata.rdw.nl/resource/8ys7-d773.json","https://opendata.rdw.nl/resource/vezc-m2t6.json","https://opendata.rdw.nl/resource/jhie-znh9.json","https://opendata.rdw.nl/resource/kmfi-hrps.json"
"PB977V","Personenauto","SUZUKI","SPLASH","20240630","20210529","2690","hatchback","5","GRIJS","Niet geregistreerd","4","1242","1052","1485","1152",,,"20090724","20170529","Geen verstrekking in Open Data",,"Ja",,,,,,,"4","4",,,,,,"M1",,,"r. motorruimte by schroefveerkoker","1485",,,,,,,"0.05","236","Nee","Nee",,"Nee","1685",,,"2023","Geen oordeel","05","Ja","2024-06-30T00:00:00.000","2021-05-29T00:00:00.000","2009-07-24T00:00:00.000","2017-05-29T00:00:00.000",,,,,,,,,,,,,,,,,,,,,,,,,,,,"https://opendata.rdw.nl/resource/3huj-srit.json","https://opendata.rdw.nl/resource/8ys7-d773.json","https://opendata.rdw.nl/resource/vezc-m2t6.json","https://opendata.rdw.nl/resource/jhie-znh9.json","https://opendata.rdw.nl/resource/kmfi-hrps.json"
"RB304N","Personenauto","SUZUKI","SUZUKI SPLASH 1.2","20240604","20190719","993","hatchback","5","GRIJS","Niet geregistreerd","4","1242","1015","1485","1115",,,"20110826","20171021","Geen verstrekking in Open Data","13599","Ja",,,,,,,"4","4",,,,,,"M1",,,"schutbord by motorruimte","1485",,,,,,,"0.06","235","Nee","Nee",,"Nee","1685",,,"2023","Geen oordeel","05","Ja","2024-06-04T00:00:00.000","2019-07-19T00:00:00.000","2011-08-26T00:00:00.000","2017-10-21T00:00:00.000",,,,,,,,,,,,,,,,,,,,,,,,,,,,"https://opendata.rdw.nl/resource/3huj-srit.json","https://opendata.rdw.nl/resource/8ys7-d773.json","https://opendata.rdw.nl/resource/vezc-m2t6.json","https://opendata.rdw.nl/resource/jhie-znh9.json","https://opendata.rdw.nl/resource/kmfi-hrps.json"
"S828GH","Personenauto","SUZUKI","SPLASH","20240630","20230328","1247","hatchback","5","ORANJE","Niet geregistreerd","3","996","950","1485","1050",,,"20090515","20230107","Geen verstrekking in Open Data",,"Ja",,,,,,,"5","4",,,,,,"M1",,,,"1485","EX",,,,,,"0.05","236","Nee","Nee",,"Nee",,,,"2023","Geen oordeel","05","Ja","2024-06-30T00:00:00.000","2023-03-28T00:00:00.000","2009-05-15T00:00:00.000","2023-01-07T00:00:00.000",,,,,,,,,,,,,,,,,,,,,,"20230105","2023-01-05T00:00:00.000",,,,,"https://opendata.rdw.nl/resource/3huj-srit.json","https://opendata.rdw.nl/resource/8ys7-d773.json","https://opendata.rdw.nl/resource/vezc-m2t6.json","https://opendata.rdw.nl/resource/jhie-znh9.json","https://opendata.rdw.nl/resource/kmfi-hrps.json"
"X977XR","Personenauto","SUZUKI","SPLASH","20250201","20240218","2673","hatchback","5","GRIJS","Niet geregistreerd","4","1242","965","1485","1065","200","200","20080630","20240218","Geen verstrekking in Open Data",,"Ja","175",,,,,,"4","4",,,,,,"M1",,,,"1485",,,,,,,"0.06","235","Nee","Nee",,"Nee","1685",,,"2024","Geen oordeel","05","Ja","2025-02-01T00:00:00.000","2024-02-18T00:00:00.000","2008-06-30T00:00:00.000","2024-02-18T00:00:00.000",,,,,,,,,,,,,,,,,,,,,,"20240201","2024-02-01T00:00:00.000",,,,,"https://opendata.rdw.nl/resource/3huj-srit.json","https://opendata.rdw.nl/resource/8ys7-d773.json","https://opendata.rdw.nl/resource/vezc-m2t6.json","https://opendata.rdw.nl/resource/jhie-znh9.json","https://opendata.rdw.nl/resource/kmfi-hrps.json"
