"kenteken","voertuigsoort","merk","handelsbenaming","vervaldatum_apk","datum_tenaamstelling","bruto_bpm","inrichting","aantal_zitplaatsen","eerste_kleur","tweede_kleur","aantal_cilinders","cilinderinhoud","massa_ledig_voertuig","toegestane_maximum_massa_voertuig","massa_rijklaar","maximum_massa_trekken_ongeremd","maximum_trekken_massa_geremd","datum_eerste_toelating","datum_eerste_tenaamstelling_in_nederland","wacht_op_keuren","catalogusprijs","wam_verzekerd","maximale_constructiesnelheid","laadvermogen","oplegger_geremd","aanhangwagen_autonoom_geremd","aanhangwagen_middenas_geremd","aantal_staanplaatsen","aantal_deuren","aantal_wielen","afstand_hart_koppeling_tot_achterzijde_voertuig","afstand_voorzijde_voertuig_tot_hart_koppeling","afwijkende_maximum_snelheid","lengte","breedte","europese_voertuigcategorie","europese_voertuigcategorie_toevoeging","europese_uitvoeringcategorie_toevoeging","plaats_chassisnummer","technische_max_massa_voertuig","type","type_gasinstallatie","typegoedkeuringsnummer","variant","uitvoering","volgnummer_wijziging_eu_typegoedkeuring","vermogen_massarijklaar","wielbasis","export_indicator","openstaande_terugroepactie_indicator","vervaldatum_tachograaf","taxi_indicator","maximum_massa_samenstelling","aantal_rolstoelplaatsen","maximum_ondersteunende_snelheid","jaar_laatste_registratie_tellerstand","tellerstandoordeel","code_toelichting_tellerstandoordeel","tenaamstellen_mogelijk","vervaldatum_apk_dt","datum_tenaamstelling_dt","datum_eerste_toelating_dt","datum_eerste_tenaamstelling_in_nederland_dt","vervaldatum_tachograaf_dt","maximum_last_onder_de_vooras_sen_tezamen_koppeling","type_remsysteem_voertuig_code","rupsonderstelconfiguratiecode","wielbasis_voertuig_minimum","wielbasis_voertuig_maximum","lengte_voertuig_minimum","lengte_voertuig_maximum","breedte_voertuig_minimum","breedte_voertuig_maximum","hoogte_voertuig","hoogte_voertuig_minimum","hoogte_voertuig_maximum","massa_bedrijfsklaar_minimaal","massa_bedrijfsklaar_maximaal","technisch_toelaatbaar_massa_koppelpunt","maximum_massa_technisch_maximaal","maximum_massa_technisch_minimaal","subcategorie_nederland","verticale_belasting_koppelpunt_getrokken_voertuig","zuinigheidsclassificatie","registratie_datum_goedkeuring_afschrijvingsmoment_bpm","registratie_datum_goedkeuring_afschrijvingsmoment_bpm_dt","gem_lading_wrde","aerodyn_voorz","massa_alt_aandr","verl_cab_ind","api_gekentekende_voertuigen_assen","api_gekentekende_voertuigen_brandstof","api_gekentekende_voertuigen_carrosserie","api_gekentekende_voertuigen_carrosserie_specifiek","api_gekentekende_voertuigen_voertuigklasse"
"00GJK2","Personenauto","SAAB","SAAB 9-3","20240706","20120620","24726","stationwagen","5","ZWART","Niet geregistreerd","6","2792","1675","2280","1775",,,"20080704","20080704","Geen verstrekking in Open Data","108386","Ja",,,,,,,"4","4","0","0",,"467","0","M1",,,"r. op schutbord onder motorkap","2280","YS3F",,"e4*2001/116*0065*19","F5R/TX","A6A 01","0","0.12","268","Nee","Nee",,"Nee","0","0",,"2023","Logisch","00","Ja","2024-07-06T00:00:00.000","2012-06-20T00:00:00.000","2008-07-04T00:00:00.000","2008-07-04T00:00:00.000",,,,,,,,,,,,,,,,,,,,,"G",,,,,,,"https://opendata.rdw.nl/resource/3huj-srit.json","https://opendata.rdw.nl/resource/8ys7-d773.json","https://opendata.rdw.nl/resource/vezc-m2t6.json","https://opendata.rdw.nl/resource/jhie-znh9.json","https://opendata.rdw.nl/resource/kmfi-hrps.json"
"00GJX6","Personenauto","SAAB","SAAB 9-3","20240722","20100120","8484","stationwagen","5","ZWART","Niet geregistreerd","4","1998","1435","2030","1535","750","1600","20080801","20080801","Geen verstrekking in Open Data","36408","Ja",,,,,,,"5","4","0","0",,"467","0","M1",,,"r. op schutbord onder motorkap","2030",,,"e4*2001/116*0065*16","F5F","M5 02","0","0.07","268","Nee","Nee",,"Nee","3630","0","0.00","2023","Logisch","00","Ja","2024-07-22T00:00:00.000","2010-01-20T00:00:00.000","2008-08-01T00:00:00.000","2008-08-01T00:00:00.000",,,,,,,,,,,,,,,,,,,,,"C",,,,,,,"https://opendata.rdw.nl/resource/3huj-srit.json","https://opendata.rdw.nl/resource/8ys7-d773.json","https://opendata.rdw.nl/resource/vezc-m2t6.json","https://opendata.rdw.nl/resource/jhie-znh9.json","https://opendata.rdw.nl/resource/kmfi-hrps.json"
"00HVP4","Personenauto","SAAB","SAAB 9-3","20250112","20140127","7814","stationwagen","5","ZWART","Niet geregistreerd","4","1998","1475","2060","1575","750","1600","20071108","20090313","Geen verstrekking in Open Data",,"Ja",,,,,,,"4","4","0","0",,"467","0","M1",,,"r. op schutbord onder motorkap","2060",,,"e4*2001/116*0065*17","F5S/BP","A5 01","0","0.08","268","Nee","Nee",,"Nee","3660","0",,"2024","Geen oordeel","05","Ja","2025-01-12T00:00:00.000","2014-01-27T00:00:00.000","2007-11-08T00:00:00.000","2009-03-13T00:00:00.000",,,,,,,,,,,,,,,,,,,,,"E",,,,,,,"https://opendata.rdw.nl/resource/3huj-srit.json","https://opendata.rdw.nl/resource/8ys7-d773.json","https://opendata.rdw.nl/resource/vezc-m2t6.json","https://opendata.rdw.nl/resource/jhie-znh9.json","https://opendata.rdw.nl/resource/kmfi-hrps.json"
"00JLD1","Personenauto","SAAB","SAAB 9-3","20250319","20231011","13866","stationwagen","5","BLAUW","Niet geregistreerd","6","2792","1570","2140","1670","750","1600","20050922","20090625","Geen verstrekking in Open Data",,"Ja",,,,,,,"4","4","0","0",,"465","0","M1",,,"r. op schutbord onder motorkap","2140",,,"e4*2001/116*0065*10","F5U","A6 01","0","0.11","268","Nee","Nee",,"Nee","3740","0",,"2024","Geen oordeel","05","Ja","2025-03-19T00:00:00.000","2023-10-11T00:00:00.000","2005-09-22T00:00:00.000","2009-06-25T00:00:00.000",,"0",,,,,,,,,,,,,,,,,,,"G",,,,,,,"https://opendata.rdw.nl/resource/3huj-srit.json","https://opendata.rdw.nl/resource/8ys7-d773.json","https://opendata.rdw.nl/resource/vezc-m2t6.json","https://opendata.rdw.nl/resource/jhie-znh9.json","https://opendata.rdw.nl/resource/kmfi-hrps.json"
"00LTN4","Personenauto","SAAB","SAAB 9-3","20240629","20220204","10119","stationwagen","5","GRIJS","Niet geregistreerd","4","1910","1510","2100","1610","750","1600","20100701","20100701","Geen verstrekking in Open Data","43595","Ja",,,,,,,"5","4","0","0",,"467","0","M1",,,"r. op schutbord onder motorkap","2100","YS3F",,"e4*2001/116*0065*26","F5WFC","M6 01","0","0.07","268","Nee","Nee",,"Nee","3700","0",,"2023","Logisch","00","Ja","2024-06-29T00:00:00.000","2022-02-04T00:00:00.000","2010-07-01T00:00:00.000","2010-07-01T00:00:00.000",,,,,,,,,,,,,,,,,,,,,"C",,,,,,,"https://opendata.rdw.nl/resource/3huj-srit.json","https://opendata.rdw.nl/resource/8ys7-d773.json","https://opendata.rdw.nl/resource/vezc-m2t6.json","https://opendata.rdw.nl/resource/jhie-znh9.json","https://opendata.rdw.nl/resource/kmfi-hrps.json"
"00NDS2","Personenauto","SAAB","SAAB 9-3","20240607","20191210","10557","stationwagen","5","ZWART","Niet geregistreerd","4","1910","1510","2100","1610","750","1600","20100823","20100823","Geen verstrekking in Open Data","45935","Ja",,,,,,,"5","4","0","0",,"467","0","M1",,,"r. op schutbord onder motorkap","2100","YS3F",,"e4*2001/116*0065*26","F5WFC","M6 01","0","0.07","268","Nee","Nee",,"Nee","3700","0",,"2023","Logisch","00","Ja","2024-06-07T00:00:00.000","2019-12-10T00:00:00.000","2010-08-23T00:00:00.000","2010-08-23T00:00:00.000",,,,,,,,,,,,,,,,,,,,,"C",,,,,,,"https://opendata.rdw.nl/resource/3huj-srit.json","https://opendata.rdw.nl/resource/8ys7-d773.json","https://opendata.rdw.nl/resource/vezc-m2t6.json","https://opendata.rdw.nl/resource/jhie-znh9.json","https://opendata.rdw.nl/resource/kmfi-hrps.json"
"00SRZ2","Personenauto","SAAB","SAAB 9-3","20250313","20180315","5974","stationwagen","5","GRIJS","Niet geregistreerd","4","1998","1498","2040","1598","750","1600","20100520","20111125","Geen verstrekking in Open Data","38680","Ja",,,,,,,"5","4","0","0",,"467","0","M1",,,"schutbord","2040","YS3F","G3 gasinstallatie","e4*2001/116*0065*26","F5FBP","M6 02","0","0.07","268","Nee","Nee",,"Nee","3640","0",,"2024","Geen oordeel","05","Ja","2025-03-13T00:00:00.000","2018-03-15T00:00:00.000","2010-05-20T00:00:00.000","2011-11-25T00:00:00.000",,"0",,,,,,,,,,,,,,,,,,,"C",,,,,,,"https://opendata.rdw.nl/resource/3huj-srit.json","https://opendata.rdw.nl/resource/8ys7-d773.json","https://opendata.rdw.nl/resource/vezc-m2t6.json","https://opendata.rdw.nl/resource/jhie-znh9.json","https://opendata.rdw.nl/resource/kmfi-hrps.json"
"00XHR7","Personenauto","SAAB","SAAB 9-3","20240609","20120608","7160","stationwagen","5","GRIJS","Niet geregistreerd","4","1910","1500","2120","1600","750","1600","20120608","20120608","Geen verstrekking in Open Data","36347","Ja",,,,,,,"5","4","0","0",,"467","0","M1",,,"r. op schutbord onder motorkap","2120","YS3F",,"e4*2001/116*0065*27","F5AAE","M6F01","0","0.06","268","Nee","Nee",,"Nee","3720","0",,"2024","Logisch","00","Ja","2024-06-09T00:00:00.000","2012-06-08T00:00:00.000","2012-06-08T00:00:00.000","2012-06-08T00:00:00.000",,,,,,,,,,,,,,,,,,,,,"B",,,,,,,"https://opendata.rdw.nl/resource/3huj-srit.json","https://opendata.rdw.nl/resource/8ys7-d773.json","https://opendata.rdw.nl/resource/vezc-m2t6.json","https://opendata.rdw.nl/resource/jhie-znh9.json","https://opendata.rdw.nl/resource/kmfi-hrps.json"
"00XHR9","Personenauto","SAAB","SAAB 9-3","20240710","20161209","14030","stationwagen","5","ZWART","Niet geregistreerd","4","1998","1470","2070","1570","750","1600","20120629","20120629","Geen verstrekking in Open Data","39345","Ja",,,,,,,"5","4","0","0",,"467","0","M1",,,"r. op schutbord onder motorkap","2070","YS3F",,"e4*2001/116*0065*27","F5SAA","A5F01","0","0.08","268","Nee","Nee",,"Nee","3670","0",,"2023","Logisch","00","Ja","2024-07-10T00:00:00.000","2016-12-09T00:00:00.000","2012-06-29T00:00:00.000","2012-06-29T00:00:00.000",,,,,,,,,,,,,,,,,,,,,"E",,,,,,,"https://opendata.rdw.nl/resource/3huj-srit.json","https://opendata.rdw.nl/resource/8ys7-d773.json","https://opendata.rdw.nl/resource/vezc-m2t6.json","https://opendata.rdw.nl/resource/jhie-znh9.json","https://opendata.rdw.nl/resource/kmfi-hrps.json"
"01GJK2","Personenauto","SAAB","SAAB 9-3","20241018","20080701","22691","stationwagen","5","ZWART","Niet geregistreerd","6","2792","1660","2260","1760",,,"20080701","20080701","Geen verstrekking in Open Data","95674","Nee",,,,,,,"4","4","0","0",,"467","0","M1",,,"r. op schutbord onder motorkap","2260","YS3F",,"e4*2001/116*0065*19","F5R/TX","M6A 01","0","0.12","268","Nee","Nee",,"Nee","0","0",,"2023","Logisch","00","Ja","2024-10-18T00:00:00.000","2008-07-01T00:00:00.000","2008-07-01T00:00:00.000","2008-07-01T00:00:00.000",,,,,,,,,,,,,,,,,,,,,"G",,,,,,,"https://opendata.rdw.nl/resource/3huj-srit.json","https://opendata.rdw.nl/resource/8ys7-d773.json","https://opendata.rdw.nl/resource/vezc-m2t6.json","https://opendata.rdw.nl/resource/jhie-znh9.json","https://opendata.rdw.nl/resource/kmfi-hrps.json"
"01GJX6","Personenauto","SAAB","SAAB 9-3","20240705","20080715","9549","stationwagen","5","ZWART","Niet geregistreerd","4","1998","1470","2060","1570","750","1600","20080715","20080715","Geen verstrekking in Open Data","38218","Ja",,,,,,,"4","4","0","0",,"467","0","M1",,,"r. op schutbord onder motorkap","2060","YS3F",,"e4*2001/116*0065*19","F5F","A5 02","0","0.07","268","Nee","Nee",,"Nee","3660","0",,"2023","Logisch","00","Ja","2024-07-05T00:00:00.000","2008-07-15T00:00:00.000","2008-07-15T00:00:00.000","2008-07-15T00:00:00.000",,,,,,,,,,,,,,,,,,,,,"E",,,,,,,"https://opendata.rdw.nl/resource/3huj-srit.json","https://opendata.rdw.nl/resource/8ys7-d773.json","https://opendata.rdw.nl/resource/vezc-m2t6.json","https://opendata.rdw.nl/resource/jhie-znh9.json","https://opendata.rdw.nl/resource/kmfi-hrps.json"
"01GKT4","Personenauto","SAAB","SAAB 9-3","20241121","20080710","7280","stationwagen","5","GRIJS","Niet geregistreerd","4","1796","1375","1970","1475","735","1400","20080710","20080710","Geen verstrekking in Open Data","31816","Ja",,,,,,,"4","4","0","0",,"467","0","M1",,,"r. op schutbord onder motorkap","1970","YS3F",,"e4*2001/116*0065*19","F5B","M5 01","0","0.06","268","Nee","Nee",,"Nee","3370","0",,"2023","Logisch","00","Ja","2024-11-21T00:00:00.000","2008-07-10T00:00:00.000","2008-07-10T00:00:00.000","2008-07-10T00:00:00.000",,,,,,,,,,,,,,,,,,,,,"C",,,,,,,"https://opendata.rdw.nl/resource/3huj-srit.json","https://opendata.rdw.nl/resource/8ys7-d773.json","https://opendata.rdw.nl/resource/vezc-m2t6.json","https://opendata.rdw.nl/resource/jhie-znh9.json","https://opendata.rdw.nl/resource/kmfi-hrps.json"
"01GNV7","Personenauto","SAAB","SAAB 9-3","20250321","20220707","9706","stationwagen","5","GRIJS","Niet geregistreerd","4","1998","1470","2060","1570","750","1600","20080808","20080808","Geen verstrekking in Open Data","38816","Ja",,,,,,,"4","4","0","0",,"467","0","M1",,,"r. op schutbord onder motorkap","2060","YS3F",,"e4*2001/116*0065*19","F5F","A5 02","0","0.07","268","Nee","Nee",,"Nee","3660","0",,"2024","Geen oordeel","07","Ja","2025-03-21T00:00:00.000","2022-07-07T00:00:00.000","2008-08-08T00:00:00.000","2008-08-08T00:00:00.000",,,,,,,,,,,,,,,,,,,,,"E",,,,,,,"https://opendata.rdw.nl/resource/3huj-srit.json","https://opendata.rdw.nl/resource/8ys7-d773.json","https://opendata.rdw.nl/resource/vezc-m2t6.json","https://opendata.rdw.nl/resource/jhie-znh9.json","https://opendata.rdw.nl/resource/kmfi-hrps.json"
"01GVT7","Personenauto","SAAB","SAAB 9-3","20240926","20180406","8356","stationwagen","5","BLAUW","Niet geregistreerd","4","1998","1435","2030","1535","750","1600","20080920","20080920","Geen verstrekking in Open Data","35919","Ja",,,,,,,"4","4","0","0",,"467","0","M1",,,"r. op schutbord onder motorkap","2030","YS3F",,"e4*2001/116*0065*19","F5F","M5 02","0","0.07","268","Nee","Nee",,"Nee","3630","0",,"2023","Logisch","00","Ja","2024-09-26T00:00:00.000","2018-04-06T00:00:00.000","2008-09-20T00:00:00.000","2008-09-20T00:00:00.000",,,,,,,,,,,,,,,,,,,,,"C",,,,,,,"https://opendata.rdw.nl/resource/3huj-srit.json","https://opendata.rdw.nl/resource/8ys7-d773.json","https://opendata.rdw.nl/resource/vezc-m2t6.json","https://opendata.rdw.nl/resource/jhie-znh9.json","https://opendata.rdw.nl/resource/kmfi-hrps.json"
"01HKJ6","Personenauto","SAAB","SAAB 9-3","20241115","20201102","24661","stationwagen","5","ZWART","Niet geregistreerd","6","2792","1675","2280","1775",,,"20090227","20090227","Geen verstrekking in Open Data","124617","Ja",,,,,,,"4","4","0","0",,"467","0","M1",,,"r. op schutbord onder motorkap","2280","YS3F",,"e4*2001/116*0065*19","F5R/TX","A6A 01","0","0.12","268","Nee","Nee",,"Nee","0","0",,"2023","Logisch","00","Ja","2024-11-15T00:00:00.000","2020-11-02T00:00:00.000","2009-02-27T00:00:00.000","2009-02-27T00:00:00.000",,,,,,,,,,,,,,,,,,,,,"G",,,,,,,"https://opendata.rdw.nl/resource/3huj-srit.json","https://opendata.rdw.nl/resource/8ys7-d773.json","https://opendata.rdw.nl/resource/vezc-m2t6.json","https://opendata.rdw.nl/resource/jhie-znh9.json","https://opendata.rdw.nl/resource/kmfi-hrps.json"
"01JSV9","Personenauto","SAAB","SAAB 9-3","20250417","20090821","9210","stationwagen","5","GRIJS","Niet geregistreerd","4","1910","1510","2100","1610","750","1600","20080328","20090821","Geen verstrekking in Open Data",,"Ja",,,,,,,"4","4","0","0",,"467","0","M1",,,"r. op schutbord onder motorkap","2100","YS3F",,"e4*2001/116*0065*18","F5W","M6 02","0","0.07","268","Nee","Nee",,"Nee","3700","0",,"2024","Geen oordeel","05","Ja","2025-04-17T00:00:00.000","2009-08-21T00:00:00.000","2008-03-28T00:00:00.000","2009-08-21T00:00:00.000",,,,,,,,,,,,,,,,,,,,,"C",,,,,,,"https://opendata.rdw.nl/resource/3huj-srit.json","https://opendata.rdw.nl/resource/8ys7-d773.json","https://opendata.rdw.nl/resource/vezc-m2t6.json","https://opendata.rdw.nl/resource/jhie-znh9.json","https://opendata.rdw.nl/resource/kmfi-hrps.json"
"01JVL9","Personenauto","SAAB","SAAB 9-3","20241217","20141217","16051","stationwagen","5","ZWART","Niet geregistreerd","6","2792","1570","2140","1670","750","1600","20080124","20090903","Geen verstrekking in Open Data",,"Ja",,,,,,,"4","4","0","0",,"467","0","M1",,,"r. op schutbord onder motorkap","2140",,,"e4*2001/116*0065*17","F5U","A6 02","0","0.11","268","Nee","Nee",,"Nee","3740","0",,"2023","Geen oordeel","05","Ja","2024-12-17T00:00:00.000","2014-12-17T00:00:00.000","2008-01-24T00:00:00.000","2009-09-03T00:00:00.000",,,,,,,,,,,,,,,,,,,,,"G",,,,,,,"https://opendata.rdw.nl/resource/3huj-srit.json","https://opendata.rdw.nl/resource/8ys7-d773.json","https://opendata.rdw.nl/resource/vezc-m2t6.json","https://opendata.rdw.nl/resource/jhie-znh9.json","https://opendata.rdw.nl/resource/kmfi-hrps.json"
"01KBS7","Personenauto","SAAB","SAAB 9-3","20250415","20141010","7563","stationwagen","5","ZWART","Niet geregistreerd","4","1998","1490","2030","1590","750","1600","20091012","20091012","Geen verstrekking in Open Data",,"Ja",,,,,,,"5","4","0","0",,"467","0","M1",,,"r. op schutbord onder motorkap","2030",,"G3 gasinstallatie","e4*2001/116*0065*16","F5F","M5 02","0","0.07","268","Nee","Nee",,"Nee","3630","0","0.00","2024","Logisch","00","Ja","2025-04-15T00:00:00.000","2014-10-10T00:00:00.000","2009-10-12T00:00:00.000","2009-10-12T00:00:00.000",,"0",,,,,,,,,,,,,,,,,,,"C",,,,,,,"https://opendata.rdw.nl/resource/3huj-srit.json","https://opendata.rdw.nl/resource/8ys7-d773.json","https://opendata.rdw.nl/resource/vezc-m2t6.json","https://opendata.rdw.nl/resource/jhie-znh9.json","https://opendata.rdw.nl/resource/kmfi-hrps.json"
"01SBVP","Personenauto","SAAB","SAAB 9-3","20250105","20160624","7730","stationwagen","5","ZWART","Niet geregistreerd","4","1796","1375","1970","1475","735","1400","20051115","20051115","Geen verstrekking in Open Data",,"Ja",,,,,,,"4","4","0","0",,"465","0","M1",,,"r. op schutbord onder motorkap","1970",,,"e4*2001/116*0065*10","F5B","M5 01","0","0.06","268","Nee","Nee",,"Nee","3370","0",,"2023","Logisch","00","Ja","2025-01-05T00:00:00.000","2016-06-24T00:00:00.000","2005-11-15T00:00:00.000","2005-11-15T00:00:00.000",,,,,,,,,,,,,,,,,,,,,"C",,,,,,,"https://opendata.rdw.nl/resource/3huj-srit.json","https://opendata.rdw.nl/resource/8ys7-d773.json","https://opendata.rdw.nl/resource/vezc-m2t6.json","https://opendata.rdw.nl/resource/jhie-znh9.json","https://opendata.rdw.nl/resource/kmfi-hrps.json"
"01SHLV","Personenauto","SAAB","SAAB 9-3","20250106","20230120","11775","stationwagen","5","GRIJS","Niet geregistreerd","4","1998","1470","2060","1570","750","1600","20060106","20060106","Geen verstrekking in Open Data","46840","Ja",,,,,,,"4","4","0","0",,"465","0","M1",,,"r. op schutbord onder motorkap","2060",,,"e4*2001/116*0065*10","F5F","A5 01","0","0.07","268","Nee","Nee",,"Nee","3660","0",,"2024","Logisch","00","Ja","2025-01-06T00:00:00.000","2023-01-20T00:00:00.000","2006-01-06T00:00:00.000","2006-01-06T00:00:00.000",,,,,,,,,,,,,,,,,,,,,"E",,,,,,,"https://opendata.rdw.nl/resource/3huj-srit.json","https://opendata.rdw.nl/resource/8ys7-d773.json","https://opendata.rdw.nl/resource/vezc-m2t6.json","https://opendata.rdw.nl/resource/jhie-znh9.json","https://opendata.rdw.nl/resource/kmfi-hrps.json"
"01SNLF","Personenauto","SAAB","SAAB 9-3","20240706","20110805","11647","stationwagen","5","GRIJS","Niet geregistreerd","4","1910","1495","2090","1595","750","1500","20060309","20060309","Geen verstrekking in Open Data","43039","Ja",,,,,,,"4","4","0","0",,"465","0","M1",,,"r. op schutbord onder motorkap","2090",,,"e4*2001/116*0065*10","F5V","M6 01","0","0.06","268","Nee","Nee",,"Nee","3590","0",,"2023","Logisch","00","Ja","2024-07-06T00:00:00.000","2011-08-05T00:00:00.000","2006-03-09T00:00:00.000","2006-03-09T00:00:00.000",,,,,,,,,,,,,,,,,,,,,"C",,,,,,,"https://opendata.rdw.nl/resource/3huj-srit.json","https://opendata.rdw.nl/resource/8ys7-d773.json","https://opendata.rdw.nl/resource/vezc-m2t6.json","https://opendata.rdw.nl/resource/jhie-znh9.json","https://opendata.rdw.nl/resource/kmfi-hrps.json"
"01SZLK","Personenauto","SAAB","SAAB 9-3","20250103","20130614","7400","stationwagen","5","ZWART","Niet geregistreerd","4","1796","1375","1970","1475","735","1400","20060703","20060703","Geen verstrekking in Open Data","30938","Ja",,,,,,,"4","4","0","0",,"465","0","M1",,,"r. op schutbord onder motorkap","1970",,,"e4*2001/116*0065*11","F5B","M5 01","0","0.06","268","Nee","Nee",,"Nee","3370","0",,"2024","Logisch","00","Ja","2025-01-03T00:00:00.000","2013-06-14T00:00:00.000","2006-07-03T00:00:00.000","2006-07-03T00:00:00.000",,,,,,,,,,,,,,,,,,,,,"C",,,,,,,"https://opendata.rdw.nl/resource/3huj-srit.json","https://opendata.rdw.nl/resource/8ys7-d773.json","https://opendata.rdw.nl/resource/vezc-m2t6.json","https://opendata.rdw.nl/resource/jhie-znh9.json","https://opendata.rdw.nl/resource/kmfi-hrps.json"
"01TGFN","Personenauto","SAAB","SAAB 9-3","20250613","20240123","7414","stationwagen","5","ZWART","Niet geregistreerd","4","1796","1375","1970","1475","735","1400","20060823","20060823","Geen verstrekking in Open Data","30989","Ja",,,,,,,"4","4","0","0",,"465","0","M1",,,"r. op schutbord onder motorkap","1970",,,"e4*2001/116*0065*10","F5B","M5 01","0","0.06","268","Nee","Nee",,"Nee","3370","0",,"2024","Logisch","00","Ja","2025-06-13T00:00:00.000","2024-01-23T00:00:00.000","2006-08-23T00:00:00.000","2006-08-23T00:00:00.000",,,,,,,,,,,,,,,,,,,,,"C",,,,,,,"https://opendata.rdw.nl/resource/3huj-srit.json","https://opendata.rdw.nl/resource/8ys7-d773.json","https://opendata.rdw.nl/resource/vezc-m2t6.json","https://opendata.rdw.nl/resource/jhie-znh9.json","https://opendata.rdw.nl/resource/kmfi-hrps.json"
"01TGK2","Personenauto","SAAB","SAAB 9-3","20210315","20210310","7044","stationwagen","5","GRIJS","Niet geregistreerd","4","1910","1500","2120","1600","750","1600","20120120","20120120","Geen verstrekking in Open Data","38011","Ja",,,,,,,"5","4","0","0",,"469","0","M1",,,"schutbord","2120","YS3F",,"e4*2001/116*0065*31","F5AAE","M6F02","0","0.06","268","Nee","Nee",,"Nee","3720","0","0.00","2021","Logisch","00","Ja","2021-03-15T00:00:00.000","2021-03-10T00:00:00.000","2012-01-20T00:00:00.000","2012-01-20T00:00:00.000",,,,,,,,,,,,,,,,,,,,,"B",,,,,,,"https://opendata.rdw.nl/resource/3huj-srit.json","https://opendata.rdw.nl/resource/8ys7-d773.json","https://opendata.rdw.nl/resource/vezc-m2t6.json","https://opendata.rdw.nl/resource/jhie-znh9.json","https://opendata.rdw.nl/resource/kmfi-hrps.json"
"01TSFN","Personenauto","SAAB","SAAB 9-3","20241213","20211216","12219","stationwagen","5","ZWART","Niet geregistreerd","4","1910","1535","2120","1635","750","1600","20070112","20070112","Geen verstrekking in Open Data","44041","Ja",,,,,,,"4","4","0","0",,"465","0","M1",,,"r. op schutbord onder motorkap","2120",,,"e4*2001/116*0065*12","F5W","A6 02","0","0.07","268","Nee","Nee",,"Nee","3720","0",,"2023","Logisch","00","Ja","2024-12-13T00:00:00.000","2021-12-16T00:00:00.000","2007-01-12T00:00:00.000","2007-01-12T00:00:00.000",,,,,,,,,,,,,,,,,,,,,"F",,,,,,,"https://opendata.rdw.nl/resource/3huj-srit.json","https://opendata.rdw.nl/resource/8ys7-d773.json","https://opendata.rdw.nl/resource/vezc-m2t6.json","https://opendata.rdw.nl/resource/jhie-znh9.json","https://opendata.rdw.nl/resource/kmfi-hrps.json"
"01TVTR","Personenauto","SAAB","SAAB 9-3","20250218","20120209","8234","stationwagen","5","BLAUW","Niet geregistreerd","4","1796","1375","1970","1475","735","1400","20070302","20070302","Geen verstrekking in Open Data","33613","Ja",,,,,,,"4","4","0","0",,"465","0","M1",,,"r. op schutbord onder motorkap","1970",,,"e4*2001/116*0065*13","F5B","M5 01","0","0.06","268","Nee","Nee",,"Nee","3370","0",,"2024","Logisch","00","Ja","2025-02-18T00:00:00.000","2012-02-09T00:00:00.000","2007-03-02T00:00:00.000","2007-03-02T00:00:00.000",,,,,,,,,,,,,,,,,,,,,"D",,,,,,,"https://opendata.rdw.nl/resource/3huj-srit.json","https://opendata.rdw.nl/resource/8ys7-d773.json","https://opendata.rdw.nl/resource/vezc-m2t6.json","https://opendata.rdw.nl/resource/jhie-znh9.json","https://opendata.rdw.nl/resource/kmfi-hrps.json"