"kenteken","voertuigsoort","merk","handelsbenaming","vervaldatum_apk","datum_tenaamstelling","bruto_bpm","inrichting","aantal_zitplaatsen","eerste_kleur","tweede_kleur","aantal_cilinders","cilinderinhoud","massa_ledig_voertuig","toegestane_maximum_massa_voertuig","massa_rijklaar","maximum_massa_trekken_ongeremd","maximum_trekken_massa_geremd","datum_eerste_toelating","datum_eerste_tenaamstelling_in_nederland","wacht_op_keuren","catalogusprijs","wam_verzekerd","maximale_constructiesnelheid","laadvermogen","oplegger_geremd","aanhangwagen_autonoom_geremd","aanhangwagen_middenas_geremd","aantal_staanplaatsen","aantal_deuren","aantal_wielen","afstand_hart_koppeling_tot_achterzijde_voertuig","afstand_voorzijde_voertuig_tot_hart_koppeling","afwijkende_maximum_snelheid","lengte","breedte","europese_voertuigcategorie","europese_voertuigcategorie_toevoeging","europese_uitvoeringcategorie_toevoeging","plaats_chassisnummer","technische_max_massa_voertuig","type","type_gasinstallatie","typegoedkeuringsnummer","variant","uitvoering","volgnummer_wijziging_eu_typegoedkeuring","vermogen_massarijklaar","wielbasis","export_indicator","openstaande_terugroepactie_indicator","vervaldatum_tachograaf","taxi_indicator","maximum_massa_samenstelling","aantal_rolstoelplaatsen","maximum_ondersteunende_snelheid","jaar_laatste_registratie_tellerstand","tellerstandoordeel","code_toelichting_tellerstandoordeel","tenaamstellen_mogelijk","vervaldatum_apk_dt","datum_tenaamstelling_dt","datum_eerste_toelating_dt","datum_eerste_tenaamstelling_in_nederland_dt","vervaldatum_tachograaf_dt","maximum_last_onder_de_vooras_sen_tezamen_koppeling","type_remsysteem_voertuig_code","rupsonderstelconfiguratiecode","wielbasis_voertuig_minimum","wielbasis_voertuig_maximum","lengte_voertuig_minimum","lengte_voertuig_maximum","breedte_voertuig_minimum","breedte_voertuig_maximum","hoogte_voertuig","hoogte_voertuig_minimum","hoogte_voertuig_maximum","massa_bedrijfsklaar_minimaal","massa_bedrijfsklaar_maximaal","technisch_toelaatbaar_massa_koppelpunt","maximum_massa_technisch_maximaal","maximum_massa_technisch_minimaal","subcategorie_nederland","verticale_belasting_koppelpunt_getrokken_voertuig","zuinigheidsclassificatie","registratie_datum_goedkeuring_afschrijvingsmoment_bpm","registratie_datum_goedkeuring_afschrijvingsmoment_bpm_dt","gem_lading_wrde","aerodyn_voorz","massa_alt_aandr","verl_cab_ind","api_gekentekende_voertuigen_assen","api_gekentekende_voertuigen_brandstof","api_gekentekende_voertuigen_carrosserie","api_gekentekende_voertuigen_carrosserie_specifiek","api_gekentekende_voertuigen_voertuigklasse"
"00JGH4","Personenauto","SAAB","SAAB 9-5","20241206","20120711","14401","sedan","5","GRIJS","Niet geregistreerd","4","1985","1505","2090","1605","750","1800","20090514","20090514","Geen verstrekking in Open Data",,"Ja",,,,,,,"4","4","0","0",,"484","0","M1",,,"midden tegen schutbord onder motorkap","2090","YS3E",,"e4*2001/116*0096*06","E4C","A5 02","0","0.07","270","Nee","Nee",,"Nee","3890","0",,"2023","Logisch","00","Ja","2024-12-06T00:00:00.000","2012-07-11T00:00:00.000","2009-05-14T00:00:00.000","2009-05-14T00:00:00.000",,,,,,,,,,,,,,,,,,,,,"F",,,,,,,"https://opendata.rdw.nl/resource/3huj-srit.json","https://opendata.rdw.nl/resource/8ys7-d773.json","https://opendata.rdw.nl/resource/vezc-m2t6.json","https://opendata.rdw.nl/resource/jhie-znh9.json","https://opendata.rdw.nl/resource/kmfi-hrps.json"
"00RDL7","Personenauto","SAAB","SAAB 9-5","20250509","20231229","18414","sedan","5","GRIJS","Niet geregistreerd","4","1998","1650","2280","1750","750","1800","20110503","20110503","Geen verstrekking in Open Data","64207","Ja",,,,,,,"4","4","0","0",,"501","0","M1",,,"r. schutbord","2280","YS3G",,"e4*2007/46*0137*02","G4Z","A6F01","0","0.09","284","Nee","Nee",,"Nee","4080","0","0.00","2024","Logisch","00","Ja","2025-05-09T00:00:00.000","2023-12-29T00:00:00.000","2011-05-03T00:00:00.000","2011-05-03T00:00:00.000",,,,,,,,,,,,,,,,,,,,,"D",,,,,,,"https://opendata.rdw.nl/resource/3huj-srit.json","https://opendata.rdw.nl/resource/8ys7-d773.json","https://opendata.rdw.nl/resource/vezc-m2t6.json","https://opendata.rdw.nl/resource/jhie-znh9.json","https://opendata.rdw.nl/resource/kmfi-hrps.json"
"00SKD2","Personenauto","SAAB","SAAB 9-5","20241002","20180522","8501","sedan","5","BLAUW","Niet geregistreerd","4","1910","1535","2130","1635","750","1800","20060712","20111006","Geen verstrekking in Open Data",,"Ja",,,,,,,"4","4","0","0",,"484","0","M1",,,"r. tegen schutbord onder motorkap","2130",,,"e4*2001/116*0096*01","E4W","A5 01","0","0.07","270","Nee","Nee",,"Nee","3930","0",,"2023","Geen oordeel","05","Ja","2024-10-02T00:00:00.000","2018-05-22T00:00:00.000","2006-07-12T00:00:00.000","2011-10-06T00:00:00.000",,,,,,,,,,,,,,,,,,,,,"E",,,,,,,"https://opendata.rdw.nl/resource/3huj-srit.json","https://opendata.rdw.nl/resource/8ys7-d773.json","https://opendata.rdw.nl/resource/vezc-m2t6.json","https://opendata.rdw.nl/resource/jhie-znh9.json","https://opendata.rdw.nl/resource/kmfi-hrps.json"
"01FJRN","Personenauto","SAAB","SAAB 9-5","20230827","20180430","14009","sedan","5","ZWART","Niet geregistreerd","6","2962","1545","2110","1645","750","1800","20000411","20000411","Geen verstrekking in Open Data",,"Nee",,,,,,,"4","4","0","0",,"481","0","M1",,,"midden tegen schutbord onder motorkap","2110",,,"e11*96/27*0073*07","E4Z","A06","1","0.09","270","Nee","Nee",,"Nee","3910","0",,"2022","Logisch","00","Ja","2023-08-27T00:00:00.000","2018-04-30T00:00:00.000","2000-04-11T00:00:00.000","2000-04-11T00:00:00.000",,,,,,,,,,,,,,,,,,,,,,,,,,,,"https://opendata.rdw.nl/resource/3huj-srit.json","https://opendata.rdw.nl/resource/8ys7-d773.json","https://opendata.rdw.nl/resource/vezc-m2t6.json","https://opendata.rdw.nl/resource/jhie-znh9.json","https://opendata.rdw.nl/resource/kmfi-hrps.json"
"01GHTD","Personenauto","SAAB","SAAB 9-5","20240331","20200824","11740","sedan","5","ZWART","Niet geregistreerd","4","2290","1520","2090","1620","750","1800","20001115","20001115","Geen verstrekking in Open Data",,"Nee",,,,,,,"4","4","0","0",,"481","0","M1",,,"midden tegen schutbord onder motorkap","2090",,,"e11*96/27*0073*08","E4E","A07","1","0.08","270","Nee","Nee",,"Nee","3890","0","0.00","2023","Geen oordeel","05","Ja","2024-03-31T00:00:00.000","2020-08-24T00:00:00.000","2000-11-15T00:00:00.000","2000-11-15T00:00:00.000",,,,,,,,,,,,,,,,,,,,,,,,,,,,"https://opendata.rdw.nl/resource/3huj-srit.json","https://opendata.rdw.nl/resource/8ys7-d773.json","https://opendata.rdw.nl/resource/vezc-m2t6.json","https://opendata.rdw.nl/resource/jhie-znh9.json","https://opendata.rdw.nl/resource/kmfi-hrps.json"
"01HPZD","Personenauto","SAAB","SAAB 9-5","20240120","20240322","12055","sedan","5","GRIJS","Niet geregistreerd","4","2290","1530","2090","1630","750","1800","20011011","20011011","Geen verstrekking in Open Data",,"Nee",,,,,,,"4","4","0","0",,"483","0","M1",,,"midden tegen schutbord onder motorkap","2090",,,"e11*96/27*0073*10","E4E","A08","0","0.08","270","Nee","Nee",,"Nee","3890","0",,"2023","Logisch","00","Ja","2024-01-20T00:00:00.000","2024-03-22T00:00:00.000","2001-10-11T00:00:00.000","2001-10-11T00:00:00.000",,,,,,,,,,,,,,,,,,,,,"D",,,,,,,"https://opendata.rdw.nl/resource/3huj-srit.json","https://opendata.rdw.nl/resource/8ys7-d773.json","https://opendata.rdw.nl/resource/vezc-m2t6.json","https://opendata.rdw.nl/resource/jhie-znh9.json","https://opendata.rdw.nl/resource/kmfi-hrps.json"
"01LFJZ","Personenauto","SAAB","SAAB 9-5","20241215","20240314","10837","sedan","5","ZWART","Niet geregistreerd","4","1985","1530","2090","1630","750","1800","20021202","20021202","Geen verstrekking in Open Data",,"Ja",,,,,,,"4","4","0","0",,"483","0","M1",,,"midden tegen schutbord onder motorkap","2090",,,"e11*96/27*0073*13","E4C","A09","0","0.07","270","Nee","Nee",,"Nee","3890","0",,"2023","Logisch","00","Ja","2024-12-15T00:00:00.000","2024-03-14T00:00:00.000","2002-12-02T00:00:00.000","2002-12-02T00:00:00.000",,,,,,,,,,,,,,,,,,,,,"E",,,,,,,"https://opendata.rdw.nl/resource/3huj-srit.json","https://opendata.rdw.nl/resource/8ys7-d773.json","https://opendata.rdw.nl/resource/vezc-m2t6.json","https://opendata.rdw.nl/resource/jhie-znh9.json","https://opendata.rdw.nl/resource/kmfi-hrps.json"
"01LGJR","Personenauto","SAAB","SAAB 9-5","20240906","20220818","14940","sedan","5","BLAUW","Niet geregistreerd","6","2962","1560","2120","1660","750","1800","20030102","20030102","Geen verstrekking in Open Data",,"Ja",,,,,,,"4","4","0","0",,"483","0","M1",,,"midden tegen schutbord onder motorkap","2120",,,"e11*96/27*0073*15","E4Z","A08","0","0.09","270","Nee","Nee",,"Nee","3920","0",,"2023","Logisch","00","Ja","2024-09-06T00:00:00.000","2022-08-18T00:00:00.000","2003-01-02T00:00:00.000","2003-01-02T00:00:00.000",,,,,,,,,,,,,,,,,,,,,"F",,,,,,,"https://opendata.rdw.nl/resource/3huj-srit.json","https://opendata.rdw.nl/resource/8ys7-d773.json","https://opendata.rdw.nl/resource/vezc-m2t6.json","https://opendata.rdw.nl/resource/jhie-znh9.json","https://opendata.rdw.nl/resource/kmfi-hrps.json"
"01LHHN","Personenauto","SAAB","SAAB 9-5","20240712","20220825","8650","sedan","5","ZWART","Niet geregistreerd","4","1985","1495","2060","1595","750","1800","20030402","20030402","Geen verstrekking in Open Data",,"Ja",,,,,,,"4","4","0","0",,"483","0","M1",,,"midden tegen schutbord onder motorkap","2060",,,"e11*96/27*0073*13","E4C","M08","0","0.07","270","Nee","Nee",,"Nee","3860","0",,"2024","Logisch","00","Ja","2024-07-12T00:00:00.000","2022-08-25T00:00:00.000","2003-04-02T00:00:00.000","2003-04-02T00:00:00.000",,,,,,,,,,,,,,,,,,,,,"D",,,,,,,"https://opendata.rdw.nl/resource/3huj-srit.json","https://opendata.rdw.nl/resource/8ys7-d773.json","https://opendata.rdw.nl/resource/vezc-m2t6.json","https://opendata.rdw.nl/resource/jhie-znh9.json","https://opendata.rdw.nl/resource/kmfi-hrps.json"
"01LNVZ","Personenauto","SAAB","SAAB 9-5","20240309","20240210","11899","sedan","5","GRIJS","Niet geregistreerd","4","2290","1530","2090","1630","750","1800","20030320","20030320","Geen verstrekking in Open Data",,"Ja",,,,,,,"4","4","0","0",,"483","0","M1",,,"midden tegen schutbord onder motorkap","2090",,,"e11*96/27*0073*15","E4E","A08","0","0.08","270","Nee","Nee",,"Nee","3890","0",,"2024","Logisch","00","Ja","2024-03-09T00:00:00.000","2024-02-10T00:00:00.000","2003-03-20T00:00:00.000","2003-03-20T00:00:00.000",,,,,,,,,,,,,,,,,,,,,"E",,,,,,,"https://opendata.rdw.nl/resource/3huj-srit.json","https://opendata.rdw.nl/resource/8ys7-d773.json","https://opendata.rdw.nl/resource/vezc-m2t6.json","https://opendata.rdw.nl/resource/jhie-znh9.json","https://opendata.rdw.nl/resource/kmfi-hrps.json"
"01LTV8","Personenauto","SAAB","SAAB 9-5","20241026","20240403","13190","sedan","5","GRIJS","Niet geregistreerd","4","1956","1650","2280","1750","750","1700","20100629","20100629","Geen verstrekking in Open Data","57600","Nee",,,,,,,"4","4","0","0",,"501","0","M1",,,"r. schutbord","2280","YS3G",,"e4*2007/46*0137*01","G4L","A6F01","0","0.07","284","Nee","Nee",,"Nee","4080","0","0.00","2023","Geen oordeel","05","Ja","2024-10-26T00:00:00.000","2024-04-03T00:00:00.000","2010-06-29T00:00:00.000","2010-06-29T00:00:00.000",,,,,,,,,,,,,,,,,,,,,"C",,,,,,,"https://opendata.rdw.nl/resource/3huj-srit.json","https://opendata.rdw.nl/resource/8ys7-d773.json","https://opendata.rdw.nl/resource/vezc-m2t6.json","https://opendata.rdw.nl/resource/jhie-znh9.json","https://opendata.rdw.nl/resource/kmfi-hrps.json"
"01LXVD","Personenauto","SAAB","SAAB 9-5","20240723","20120828","14693","sedan","5","BLAUW","Niet geregistreerd","6","2962","1560","2120","1660","750","1800","20030626","20030626","Geen verstrekking in Open Data",,"Ja",,,,,,,"4","4","0","0",,"483","0","M1",,,"midden tegen schutbord onder motorkap","2120",,,"e11*96/27*0073*17","E4Z","A08","0","0.09","270","Nee","Nee",,"Nee","3920","0",,"2023","Logisch","00","Ja","2024-07-23T00:00:00.000","2012-08-28T00:00:00.000","2003-06-26T00:00:00.000","2003-06-26T00:00:00.000",,,,,,,,,,,,,,,,,,,,,"F",,,,,,,"https://opendata.rdw.nl/resource/3huj-srit.json","https://opendata.rdw.nl/resource/8ys7-d773.json","https://opendata.rdw.nl/resource/vezc-m2t6.json","https://opendata.rdw.nl/resource/jhie-znh9.json","https://opendata.rdw.nl/resource/kmfi-hrps.json"
"01NJFN","Personenauto","SAAB","SAAB 9-5","20231113","20231024","10853","sedan","5","ZWART","Niet geregistreerd","4","1985","1495","2070","1595","750","1800","20031007","20031007","Geen verstrekking in Open Data",,"Nee",,,,,,,"4","4","0","0",,"483","0","M1",,,"midden tegen schutbord onder motorkap","2070",,,"e11*96/27*0073*18","E4C","M09","0","0.07","270","Nee","Nee",,"Nee","3870","0",,"2023","Logisch","00","Ja","2023-11-13T00:00:00.000","2023-10-24T00:00:00.000","2003-10-07T00:00:00.000","2003-10-07T00:00:00.000",,,,,,,,,,,,,,,,,,,,,"D",,,,,,,"https://opendata.rdw.nl/resource/3huj-srit.json","https://opendata.rdw.nl/resource/8ys7-d773.json","https://opendata.rdw.nl/resource/vezc-m2t6.json","https://opendata.rdw.nl/resource/jhie-znh9.json","https://opendata.rdw.nl/resource/kmfi-hrps.json"
"01NZLH","Personenauto","SAAB","SAAB 9-5","20240710","20230718","9118","sedan","5","GROEN","Niet geregistreerd","4","1985","1495","2060","1595","750","1800","20040519","20040519","Geen verstrekking in Open Data",,"Ja",,,,,,,"4","4","0","0",,"483","0","M1",,,"midden tegen schutbord onder motorkap","2060",,,"e11*96/27*0073*17","E4C","M08","0","0.07","270","Nee","Nee",,"Nee","3860","0",,"2023","Logisch","00","Ja","2024-07-10T00:00:00.000","2023-07-18T00:00:00.000","2004-05-19T00:00:00.000","2004-05-19T00:00:00.000",,,,,,,,,,,,,,,,,,,,,"D",,,,,,,"https://opendata.rdw.nl/resource/3huj-srit.json","https://opendata.rdw.nl/resource/8ys7-d773.json","https://opendata.rdw.nl/resource/vezc-m2t6.json","https://opendata.rdw.nl/resource/jhie-znh9.json","https://opendata.rdw.nl/resource/kmfi-hrps.json"
"01PGG4","Personenauto","SAAB","SAAB 9-5","20250219","20221201","14211","sedan","5","GRIJS","Niet geregistreerd","4","2290","1495","2050","1595","750","1800","20070110","20110115","Geen verstrekking in Open Data",,"Ja",,,,,,,"4","4","0","0",,"484","0","M1",,,"r. tegen schutbord onder motorkap","2050",,,"e4*2001/116*0096*02","E4G","M5 03","0","0.12","270","Nee","Nee",,"Nee","3850","0",,"2024","Geen oordeel","05","Ja","2025-02-19T00:00:00.000","2022-12-01T00:00:00.000","2007-01-10T00:00:00.000","2011-01-15T00:00:00.000",,,,,,,,,,,,,,,,,,,,,"D",,,,,,,"https://opendata.rdw.nl/resource/3huj-srit.json","https://opendata.rdw.nl/resource/8ys7-d773.json","https://opendata.rdw.nl/resource/vezc-m2t6.json","https://opendata.rdw.nl/resource/jhie-znh9.json","https://opendata.rdw.nl/resource/kmfi-hrps.json"
"01PKX3","Personenauto","SAAB","SAAB 9-5","20250303","20161222","26182","sedan","5","ZWART","Niet geregistreerd","6","2792","1845","2440","1945","750","2000","20110218","20110218","Geen verstrekking in Open Data","87745","Ja",,,,,,,"4","4","0","0",,"501","0","M1",,,"r. schutbord","2440","YS3G",,"e4*2007/46*0137*05","G4JAA","A6A01","0","0.11","284","Nee","Nee",,"Nee","4440","0","0.00","2024","Logisch","00","Ja","2025-03-03T00:00:00.000","2016-12-22T00:00:00.000","2011-02-18T00:00:00.000","2011-02-18T00:00:00.000",,,,,,,,,,,,,,,,,,,,,"E",,,,,,,"https://opendata.rdw.nl/resource/3huj-srit.json","https://opendata.rdw.nl/resource/8ys7-d773.json","https://opendata.rdw.nl/resource/vezc-m2t6.json","https://opendata.rdw.nl/resource/jhie-znh9.json","https://opendata.rdw.nl/resource/kmfi-hrps.json"
"01PTXN","Personenauto","SAAB","SAAB 9-5","20221022","20220914","14625","sedan","5","GRIJS","Niet geregistreerd","4","2290","1510","2090","1610","750","1800","20050103","20050103","Geen verstrekking in Open Data","59484","Ja",,,,,,,"4","4","0","0",,"483","0","M1",,,"midden tegen schutbord onder motorkap","2090",,,"e11*96/27*0073*20","E4A","A02","0","0.10","270","Nee","Nee",,"Nee","3890","0",,"2022","Logisch","00","Ja","2022-10-22T00:00:00.000","2022-09-14T00:00:00.000","2005-01-03T00:00:00.000","2005-01-03T00:00:00.000",,,,,,,,,,,,,,,,,,,,,"E",,,,,,,"https://opendata.rdw.nl/resource/3huj-srit.json","https://opendata.rdw.nl/resource/8ys7-d773.json","https://opendata.rdw.nl/resource/vezc-m2t6.json","https://opendata.rdw.nl/resource/jhie-znh9.json","https://opendata.rdw.nl/resource/kmfi-hrps.json"
"01PZK3","Personenauto","SAAB","SAAB 9-5","20250416","20110416","16094","sedan","5","ZWART","Niet geregistreerd","4","1998","1650","2280","1750","750","1800","20110416","20110416","Geen verstrekking in Open Data","58755","Ja",,,,,,,"4","4","0","0",,"501","0","M1",,,"r. schutbord","2280","YS3G",,"e4*2007/46*0137*05","G4ZAA","A6F01","0","0.09","284","Nee","Nee",,"Nee","4080","0","0.00","2024","Logisch","00","Ja","2025-04-16T00:00:00.000","2011-04-16T00:00:00.000","2011-04-16T00:00:00.000","2011-04-16T00:00:00.000",,,,,,,,,,,,,,,,,,,,,"D",,,,,,,"https://opendata.rdw.nl/resource/3huj-srit.json","https://opendata.rdw.nl/resource/8ys7-d773.json","https://opendata.rdw.nl/resource/vezc-m2t6.json","https://opendata.rdw.nl/resource/jhie-znh9.json","https://opendata.rdw.nl/resource/kmfi-hrps.json"
"01RDL7","Personenauto","SAAB","SAAB 9-5","20230303","20230908","1696","sedan","5","GRIJS","Niet geregistreerd","4","1956","1625","2180","1725","750","1700","20110503","20110503","Geen verstrekking in Open Data","50520","Ja",,,,,,,"4","4","0","0",,"501","0","M1",,,"r. schutbord","2180","YS3G",,"e4*2007/46*0137*05","G4LAA","M6F01","0","0.07","284","Nee","Nee",,"Nee","3880","0","0.00","2023","Niet geregistreerd","NG","Ja","2023-03-03T00:00:00.000","2023-09-08T00:00:00.000","2011-05-03T00:00:00.000","2011-05-03T00:00:00.000",,,,,,,,,,,,,,,,,,,,,"A",,,,,,,"https://opendata.rdw.nl/resource/3huj-srit.json","https://opendata.rdw.nl/resource/8ys7-d773.json","https://opendata.rdw.nl/resource/vezc-m2t6.json","https://opendata.rdw.nl/resource/jhie-znh9.json","https://opendata.rdw.nl/resource/kmfi-hrps.json"
"01RJVP","Personenauto","SAAB","SAAB 9-5","20240607","20100630","15573","sedan","5","ZWART","Niet geregistreerd","4","2290","1530","2090","1630","750","1800","20050429","20050429","Geen verstrekking in Open Data",,"Ja",,,,,,,"4","4","0","0",,"483","0","M1",,,"midden tegen schutbord onder motorkap","2090",,,"e11*96/27*0073*21","E4G/TK","A03","0","0.11","270","Nee","Nee",,"Nee","3890","0",,"2023","Logisch","00","Ja","2024-06-07T00:00:00.000","2010-06-30T00:00:00.000","2005-04-29T00:00:00.000","2005-04-29T00:00:00.000",,,,,,,,,,,,,,,,,,,,,"E",,,,,,,"https://opendata.rdw.nl/resource/3huj-srit.json","https://opendata.rdw.nl/resource/8ys7-d773.json","https://opendata.rdw.nl/resource/vezc-m2t6.json","https://opendata.rdw.nl/resource/jhie-znh9.json","https://opendata.rdw.nl/resource/kmfi-hrps.json"
"01RXHD","Personenauto","SAAB","SAAB 9-5","20250424","20230424","12930","sedan","5","BLAUW","Niet geregistreerd","4","2290","1505","2090","1605","750","1800","20051017","20051017","Geen verstrekking in Open Data",,"Ja",,,,,,,"4","4","0","0",,"483","0","M1",,,"midden tegen schutbord onder motorkap","2090",,,"e11*96/27*0073*21","E4E","A10","0","0.08","270","Nee","Nee",,"Nee","3890","0",,"2024","Onlogisch","04","Ja","2025-04-24T00:00:00.000","2023-04-24T00:00:00.000","2005-10-17T00:00:00.000","2005-10-17T00:00:00.000",,,,,,,,,,,,,,,,,,,,,"E",,,,,,,"https://opendata.rdw.nl/resource/3huj-srit.json","https://opendata.rdw.nl/resource/8ys7-d773.json","https://opendata.rdw.nl/resource/vezc-m2t6.json","https://opendata.rdw.nl/resource/jhie-znh9.json","https://opendata.rdw.nl/resource/kmfi-hrps.json"
"01SGTP","Personenauto","SAAB","SAAB 9-5","20240720","20231214","12435","sedan","5","BLAUW","Niet geregistreerd","4","2290","1470","2050","1570","750","1800","20060102","20060102","Geen verstrekking in Open Data","49235","Ja",,,,,,,"4","4","0","0",,"484","0","M1",,,"r. tegen schutbord onder motorkap","2050",,,"e4*2001/116*0096*00","E4E","M5 01","0","0.09","270","Nee","Nee",,"Nee","3850","0",,"2023","Logisch","00","Ja","2024-07-20T00:00:00.000","2023-12-14T00:00:00.000","2006-01-02T00:00:00.000","2006-01-02T00:00:00.000",,,,,,,,,,,,,,,,,,,,,"D",,,,,,,"https://opendata.rdw.nl/resource/3huj-srit.json","https://opendata.rdw.nl/resource/8ys7-d773.json","https://opendata.rdw.nl/resource/vezc-m2t6.json","https://opendata.rdw.nl/resource/jhie-znh9.json","https://opendata.rdw.nl/resource/kmfi-hrps.json"
"01SKHG","Personenauto","SAAB","SAAB 9-5","20250315","20240315","13096","sedan","5","ZWART","Niet geregistreerd","4","1985","1505","2090","1605","750","1800","20060201","20060201","Geen verstrekking in Open Data","51636","Ja",,,,,,,"4","4","0","0",,"484","0","M1",,,"r. tegen schutbord onder motorkap","2090",,,"e4*2001/116*0096*00","E4C","A5 01","0","0.07","270","Nee","Nee",,"Nee","3890","0",,"2024","Logisch","00","Ja","2025-03-15T00:00:00.000","2024-03-15T00:00:00.000","2006-02-01T00:00:00.000","2006-02-01T00:00:00.000",,,,,,,,,,,,,,,,,,,,,"E",,,,,,,"https://opendata.rdw.nl/resource/3huj-srit.json","https://opendata.rdw.nl/resource/8ys7-d773.json","https://opendata.rdw.nl/resource/vezc-m2t6.json","https://opendata.rdw.nl/resource/jhie-znh9.json","https://opendata.rdw.nl/resource/kmfi-hrps.json"
"01SXXV","Personenauto","SAAB","SAAB 9-5","20240617","20200221","13675","sedan","5","GRIJS","Niet geregistreerd","4","2290","1505","2090","1605","750","1800","20060612","20060612","Geen verstrekking in Open Data","53737","Ja",,,,,,,"4","4","0","0",,"484","0","M1",,,"r. tegen schutbord onder motorkap","2090",,,"e4*2001/116*0096*01","E4E","A5 01","0","0.08","270","Nee","Nee",,"Nee","3890","0",,"2023","Logisch","00","Ja","2024-06-17T00:00:00.000","2020-02-21T00:00:00.000","2006-06-12T00:00:00.000","2006-06-12T00:00:00.000",,,,,,,,,,,,,,,,,,,,,"E",,,,,,,"https://opendata.rdw.nl/resource/3huj-srit.json","https://opendata.rdw.nl/resource/8ys7-d773.json","https://opendata.rdw.nl/resource/vezc-m2t6.json","https://opendata.rdw.nl/resource/jhie-znh9.json","https://opendata.rdw.nl/resource/kmfi-hrps.json"
"01TTLR","Personenauto","SAAB","SAAB 9-5","20230518","20230304","14230","sedan","5","ZWART","Niet geregistreerd","4","2290","1510","2090","1610","750","1800","20070131","20070131","Geen verstrekking in Open Data","54691","Ja",,,,,,,"4","4","0","0",,"484","0","M1",,,"r. tegen schutbord onder motorkap","2090",,,"e4*2001/116*0096*02","E4A","A5 02","0","0.10","270","Nee","Nee",,"Nee","3890","0",,"2023","Logisch","00","Ja","2023-05-18T00:00:00.000","2023-03-04T00:00:00.000","2007-01-31T00:00:00.000","2007-01-31T00:00:00.000",,,,,,,,,,,,,,,,,,,,,"F",,,,,,,"https://opendata.rdw.nl/resource/3huj-srit.json","https://opendata.rdw.nl/resource/8ys7-d773.json","https://opendata.rdw.nl/resource/vezc-m2t6.json","https://opendata.rdw.nl/resource/jhie-znh9.json","https://opendata.rdw.nl/resource/kmfi-hrps.json"
"02FPSJ","Personenauto","SAAB","SAAB 9-5","20240916","20150407","10436","sedan","5","BLAUW","Niet geregistreerd","4","1985","1515","2080","1615","750","1800","20000523","20000523","Geen verstrekking in Open Data",,"Ja",,,,,,,"4","4","0","0",,"481","0","M1",,,"midden tegen schutbord onder motorkap","2080",,,"e11*96/27*0073*07","E4C","A06","1","0.07","270","Nee","Nee",,"Nee","3880","0",,"2023","Logisch","00","Ja","2024-09-16T00:00:00.000","2015-04-07T00:00:00.000","2000-05-23T00:00:00.000","2000-05-23T00:00:00.000",,,,,,,,,,,,,,,,,,,,,,,,,,,,"https://opendata.rdw.nl/resource/3huj-srit.json","https://opendata.rdw.nl/resource/8ys7-d773.json","https://opendata.rdw.nl/resource/vezc-m2t6.json","https://opendata.rdw.nl/resource/jhie-znh9.json","https://opendata.rdw.nl/resource/kmfi-hrps.json"