"kenteken","voertuigsoort","merk","handelsbenaming","vervaldatum_apk","datum_tenaamstelling","bruto_bpm","inrichting","aantal_zitplaatsen","eerste_kleur","tweede_kleur","aantal_cilinders","cilinderinhoud","massa_ledig_voertuig","toegestane_maximum_massa_voertuig","massa_rijklaar","maximum_massa_trekken_ongeremd","maximum_trekken_massa_geremd","datum_eerste_toelating","datum_eerste_tenaamstelling_in_nederland","wacht_op_keuren","catalogusprijs","wam_verzekerd","maximale_constructiesnelheid","laadvermogen","oplegger_geremd","aanhangwagen_autonoom_geremd","aanhangwagen_middenas_geremd","aantal_staanplaatsen","aantal_deuren","aantal_wielen","afstand_hart_koppeling_tot_achterzijde_voertuig","afstand_voorzijde_voertuig_tot_hart_koppeling","afwijkende_maximum_snelheid","lengte","breedte","europese_voertuigcategorie","europese_voertuigcategorie_toevoeging","europese_uitvoeringcategorie_toevoeging","plaats_chassisnummer","technische_max_massa_voertuig","type","type_gasinstallatie","typegoedkeuringsnummer","variant","uitvoering","volgnummer_wijziging_eu_typegoedkeuring","vermogen_massarijklaar","wielbasis","export_indicator","openstaande_terugroepactie_indicator","vervaldatum_tachograaf","taxi_indicator","maximum_massa_samenstelling","aantal_rolstoelplaatsen","maximum_ondersteunende_snelheid","jaar_laatste_registratie_tellerstand","tellerstandoordeel","code_toelichting_tellerstandoordeel","tenaamstellen_mogelijk","vervaldatum_apk_dt","datum_tenaamstelling_dt","datum_eerste_toelating_dt","datum_eerste_tenaamstelling_in_nederland_dt","vervaldatum_tachograaf_dt","maximum_last_onder_de_vooras_sen_tezamen_koppeling","type_remsysteem_voertuig_code","rupsonderstelconfiguratiecode","wielbasis_voertuig_minimum","wielbasis_voertuig_maximum","lengte_voertuig_minimum","lengte_voertuig_maximum","breedte_voertuig_minimum","breedte_voertuig_maximum","hoogte_voertuig","hoogte_voertuig_minimum","hoogte_voertuig_maximum","massa_bedrijfsklaar_minimaal","massa_bedrijfsklaar_maximaal","technisch_toelaatbaar_massa_koppelpunt","maximum_massa_technisch_maximaal","maximum_massa_technisch_minimaal","subcategorie_nederland","verticale_belasting_koppelpunt_getrokken_voertuig","zuinigheidsclassificatie","registratie_datum_goedkeuring_afschrijvingsmoment_bpm","registratie_datum_goedkeuring_afschrijvingsmoment_bpm_dt","gem_lading_wrde","aerodyn_voorz","massa_alt_aandr","verl_cab_ind","api_gekentekende_voertuigen_assen","api_gekentekende_voertuigen_brandstof","api_gekentekende_voertuigen_carrosserie","api_gekentekende_voertuigen_carrosserie_specifiek","api_gekentekende_voertuigen_voertuigklasse"
"1TLT12","Personenauto","SAAB","SAAB SAAB 9-3","20230922","20210328","1023","stationwagen","5","BLAUW","Niet geregistreerd","4","1910","1570","2120","1670","750","1600","20070914","20140319","Geen verstrekking in Open Data","53865","Nee",,,,,,,"4","4",,,,,,"M1",,,"by schutbord","2120",,,,,,,"0.07","268","Nee","Nee",,"Nee","3720",,,"2022","Geen oordeel","05","Ja","2023-09-22T00:00:00.000","2021-03-28T00:00:00.000","2007-09-14T00:00:00.000","2014-03-19T00:00:00.000",,"0",,,,,,,,,,,,,,,,,,,,,,,,,,"https://opendata.rdw.nl/resource/3huj-srit.json","https://opendata.rdw.nl/resource/8ys7-d773.json","https://opendata.rdw.nl/resource/vezc-m2t6.json","https://opendata.rdw.nl/resource/jhie-znh9.json","https://opendata.rdw.nl/resource/kmfi-hrps.json"
"2SNS97","Personenauto","SAAB","SAAB SAAB 9-3","20250421","20190618","3040","cabriolet","4","GEEL","Niet geregistreerd","4","1998","1565","2020","1665",,,"20090918","20140310","Geen verstrekking in Open Data","49125","Ja",,,,,,,"2","4",,,,,,"M1",,,"by schutbord motorruimte","2020",,,,,,,"0.07","267","Nee","Nee",,"Nee",,,,"2024","Geen oordeel","05","Ja","2025-04-21T00:00:00.000","2019-06-18T00:00:00.000","2009-09-18T00:00:00.000","2014-03-10T00:00:00.000",,"0",,,,,,,,,,,,,,,,,,,,,,,,,,"https://opendata.rdw.nl/resource/3huj-srit.json","https://opendata.rdw.nl/resource/8ys7-d773.json","https://opendata.rdw.nl/resource/vezc-m2t6.json","https://opendata.rdw.nl/resource/jhie-znh9.json","https://opendata.rdw.nl/resource/kmfi-hrps.json"
"2SPZ10","Personenauto","SAAB","SAAB SAAB 9-3","20250419","20231122","3972","cabriolet","4","BEIGE","Niet geregistreerd","4","1998","1565","2020","1665","750","1600","20070604","20131123","Geen verstrekking in Open Data","52150","Ja",,,,,,,"2","4",,,,,,"M1",,,"schutbord","2020","YS3FX75F",,,,,,"0.07","268","Nee","Nee",,"Nee","3620",,,"2024","Geen oordeel","05","Ja","2025-04-19T00:00:00.000","2023-11-22T00:00:00.000","2007-06-04T00:00:00.000","2013-11-23T00:00:00.000",,"0",,,,,,,,,,,,,,,,,,,,,,,,,,"https://opendata.rdw.nl/resource/3huj-srit.json","https://opendata.rdw.nl/resource/8ys7-d773.json","https://opendata.rdw.nl/resource/vezc-m2t6.json","https://opendata.rdw.nl/resource/jhie-znh9.json","https://opendata.rdw.nl/resource/kmfi-hrps.json"
"3XJS21","Personenauto","SAAB","SAAB SAAB 9-3","20241024","20231107","625","sedan","5","ZWART","Niet geregistreerd","4","1796","1365","1910","1465","720","1400","20041026","20140820","Geen verstrekking in Open Data","30790","Ja",,,,,,,"4","4",,,,,,"M1",,,"schutbord","1910",,,,,,,"0.06","268","Nee","Nee",,"Nee","3310",,,"2023","Geen oordeel","05","Ja","2024-10-24T00:00:00.000","2023-11-07T00:00:00.000","2004-10-26T00:00:00.000","2014-08-20T00:00:00.000",,"0",,,,,,,,,,,,,,,,,,,,,,,,,,"https://opendata.rdw.nl/resource/3huj-srit.json","https://opendata.rdw.nl/resource/8ys7-d773.json","https://opendata.rdw.nl/resource/vezc-m2t6.json","https://opendata.rdw.nl/resource/jhie-znh9.json","https://opendata.rdw.nl/resource/kmfi-hrps.json"
"4XSF98","Personenauto","SAAB","SAAB SAAB 9-3","20240808","20210820","14963","cabriolet","4","ZWART","Niet geregistreerd","4","1910","1665","2130","1765",,,"20060713","20141017","Geen verstrekking in Open Data",,"Ja",,,,,,,"2","4",,,,,,"M1",,,"schutbord v.","2130",,,,,,,"0.06","268","Nee","Nee",,"Nee","3730",,,"2023","Geen oordeel","05","Ja","2024-08-08T00:00:00.000","2021-08-20T00:00:00.000","2006-07-13T00:00:00.000","2014-10-17T00:00:00.000",,"0",,,,,,,,,,,,,,,,,,,,,,,,,,"https://opendata.rdw.nl/resource/3huj-srit.json","https://opendata.rdw.nl/resource/8ys7-d773.json","https://opendata.rdw.nl/resource/vezc-m2t6.json","https://opendata.rdw.nl/resource/jhie-znh9.json","https://opendata.rdw.nl/resource/kmfi-hrps.json"
"8ZSJ43","Personenauto","SAAB","SAAB SAAB 9-3","20250320","20150320","12660","cabriolet","5","ZWART","Niet geregistreerd","4","1998","1565","2040","1665","750","1600","20050428","20150320","Geen verstrekking in Open Data",,"Ja",,,,,,,"2","4",,,,,,"M1",,,"r. schutbord","2040",,,,,,,"0.07","268","Nee","Nee",,"Nee","3620",,,"2024","Geen oordeel","05","Ja","2025-03-20T00:00:00.000","2015-03-20T00:00:00.000","2005-04-28T00:00:00.000","2015-03-20T00:00:00.000",,,,,,,,,,,,,,,,,,,,,,,,,,,,"https://opendata.rdw.nl/resource/3huj-srit.json","https://opendata.rdw.nl/resource/8ys7-d773.json","https://opendata.rdw.nl/resource/vezc-m2t6.json","https://opendata.rdw.nl/resource/jhie-znh9.json","https://opendata.rdw.nl/resource/kmfi-hrps.json"
"9TDK31","Personenauto","SAAB","SAAB SAAB 9-3","20250411","20220423","8893","sedan","5","BLAUW","Niet geregistreerd","4","1910","1485","2030","1585",,,"20070419","20131224","Geen verstrekking in Open Data","49275","Ja",,,,,,,"4","4",,,,,,"M1",,,"schutbord motorruimte","2030",,,,,,,"0.07","268","Nee","Nee",,"Nee",,,,"2024","Geen oordeel","05","Ja","2025-04-11T00:00:00.000","2022-04-23T00:00:00.000","2007-04-19T00:00:00.000","2013-12-24T00:00:00.000",,"0",,,,,,,,,,,,,,,,,,,,,,,,,,"https://opendata.rdw.nl/resource/3huj-srit.json","https://opendata.rdw.nl/resource/8ys7-d773.json","https://opendata.rdw.nl/resource/vezc-m2t6.json","https://opendata.rdw.nl/resource/jhie-znh9.json","https://opendata.rdw.nl/resource/kmfi-hrps.json"
"G238TP","Personenauto","SAAB","SAAB SAAB 9-3","20241005","20231013","158","cabriolet","4","BLAUW","Niet geregistreerd","4","1998","1565","2020","1665","750","1600","20080403","20191217","Geen verstrekking in Open Data",,"Ja","205",,,,,,"2","4",,,,,,"M1",,,"r. schutbord","2020","YS3F C",,,,,,"0.07","268","Nee","Nee",,"Nee","3620",,,"2023","Geen oordeel","05","Ja","2024-10-05T00:00:00.000","2023-10-13T00:00:00.000","2008-04-03T00:00:00.000","2019-12-17T00:00:00.000",,,,,,,,,,,,,,,,,,,,,,,,,,,,"https://opendata.rdw.nl/resource/3huj-srit.json","https://opendata.rdw.nl/resource/8ys7-d773.json","https://opendata.rdw.nl/resource/vezc-m2t6.json","https://opendata.rdw.nl/resource/jhie-znh9.json","https://opendata.rdw.nl/resource/kmfi-hrps.json"
"HD193T","Personenauto","SAAB","SAAB SAAB 9-3","20240707","20240424","10245","cabriolet","4","ZWART","Niet geregistreerd","4","1998","1565","2020","1665",,,"20060411","20151005","Geen verstrekking in Open Data",,"Ja",,,,,,,"2","4",,,,,,"M1",,,"r. schutbord","2020",,,,,,,"0.07","268","Nee","Nee",,"Nee",,,,"2024","Geen oordeel","05","Ja","2024-07-07T00:00:00.000","2024-04-24T00:00:00.000","2006-04-11T00:00:00.000","2015-10-05T00:00:00.000",,,,,,,,,,,,,,,,,,,,,,,,,,,,"https://opendata.rdw.nl/resource/3huj-srit.json","https://opendata.rdw.nl/resource/8ys7-d773.json","https://opendata.rdw.nl/resource/vezc-m2t6.json","https://opendata.rdw.nl/resource/jhie-znh9.json","https://opendata.rdw.nl/resource/kmfi-hrps.json"
"JF401T","Personenauto","SAAB","SAAB SAAB 9-3","20240705","20190812","6906","cabriolet","4","ZWART","Niet geregistreerd","4","1910","1650","2120","1750",,,"20080701","20160413","Geen verstrekking in Open Data","66980","Ja",,,,,,,"2","4",,,,,,"M1",,,"by schutbord","2120","YS3FX76P",,,,,,"0.08","268","Nee","Nee",,"Nee","3720",,,"2023","Geen oordeel","05","Ja","2024-07-05T00:00:00.000","2019-08-12T00:00:00.000","2008-07-01T00:00:00.000","2016-04-13T00:00:00.000",,,,,,,,,,,,,,,,,,,,,,,,,,,,"https://opendata.rdw.nl/resource/3huj-srit.json","https://opendata.rdw.nl/resource/8ys7-d773.json","https://opendata.rdw.nl/resource/vezc-m2t6.json","https://opendata.rdw.nl/resource/jhie-znh9.json","https://opendata.rdw.nl/resource/kmfi-hrps.json"
"JF886H","Personenauto","SAAB","SAAB SAAB 9-3","20241116","20221112","15796","cabriolet","5","BLAUW","Niet geregistreerd","4","1998","1605","2040","1705",,"1600","20050510","20160226","Geen verstrekking in Open Data",,"Nee",,,,,,,"2","4",,,,,,"M1",,,"schutbord","2040","YS3FX76Y",,,,,,"0.09","268","Nee","Nee",,"Nee","3640",,,"2023","Geen oordeel","05","Ja","2024-11-16T00:00:00.000","2022-11-12T00:00:00.000","2005-05-10T00:00:00.000","2016-02-26T00:00:00.000",,,,,,,,,,,,,,,,,,,,,,,,,,,,"https://opendata.rdw.nl/resource/3huj-srit.json","https://opendata.rdw.nl/resource/8ys7-d773.json","https://opendata.rdw.nl/resource/vezc-m2t6.json","https://opendata.rdw.nl/resource/jhie-znh9.json","https://opendata.rdw.nl/resource/kmfi-hrps.json"
"JP092R","Personenauto","SAAB","SAAB SAAB 9-3","20250310","20160525","10357","cabriolet","4","GRIJS","Niet geregistreerd","4","1998","1580","2050","1680","750","1600","20100315","20160525","Geen verstrekking in Open Data","47312","Ja",,,,,,,"2","4",,,,,,"M1",,,"schutbord motorruimte","2050","YS3FX76F",,,,,,"0.07","268","Nee","Nee",,"Nee","3650",,,"2024","Geen oordeel","05","Ja","2025-03-10T00:00:00.000","2016-05-25T00:00:00.000","2010-03-15T00:00:00.000","2016-05-25T00:00:00.000",,,,,,,,,,,,,,,,,,,,,,,,,,,,"https://opendata.rdw.nl/resource/3huj-srit.json","https://opendata.rdw.nl/resource/8ys7-d773.json","https://opendata.rdw.nl/resource/vezc-m2t6.json","https://opendata.rdw.nl/resource/jhie-znh9.json","https://opendata.rdw.nl/resource/kmfi-hrps.json"
"JS577N","Personenauto","SAAB","SAAB SAAB 9-3","20210925","20230104","6685","stationwagen","5","GRIJS","Niet geregistreerd","4","1910","1550","2100","1650","750","1600","20080909","20160602","Geen verstrekking in Open Data","44645","Nee",,,,,,,"4","4",,,,,,"M1",,,"r. op schutbord onder motorkap","2100","YS3FX56W",,,,,,"0.07","268","Nee","Nee",,"Nee","3700",,,"2023","Geen oordeel","05","Ja","2021-09-25T00:00:00.000","2023-01-04T00:00:00.000","2008-09-09T00:00:00.000","2016-06-02T00:00:00.000",,,,,,,,,,,,,,,,,,,,,,,,,,,,"https://opendata.rdw.nl/resource/3huj-srit.json","https://opendata.rdw.nl/resource/8ys7-d773.json","https://opendata.rdw.nl/resource/vezc-m2t6.json","https://opendata.rdw.nl/resource/jhie-znh9.json","https://opendata.rdw.nl/resource/kmfi-hrps.json"
"JZ363L","Personenauto","SAAB","SAAB SAAB 9-3","20240903","20211113","17184","cabriolet","4","GRIJS","Niet geregistreerd","4","1910","1675","2140","1775",,,"20080514","20160707","Geen verstrekking in Open Data",,"Ja",,,,,,,"2","4",,,,,,"M1",,,"midden tegen schutbord onder motorkap","2140","YS3FX71P",,,,,,"0.07","268","Nee","Nee",,"Nee",,,,"2023","Geen oordeel","05","Ja","2024-09-03T00:00:00.000","2021-11-13T00:00:00.000","2008-05-14T00:00:00.000","2016-07-07T00:00:00.000",,,,,,,,,,,,,,,,,,,,,,,,,,,,"https://opendata.rdw.nl/resource/3huj-srit.json","https://opendata.rdw.nl/resource/8ys7-d773.json","https://opendata.rdw.nl/resource/vezc-m2t6.json","https://opendata.rdw.nl/resource/jhie-znh9.json","https://opendata.rdw.nl/resource/kmfi-hrps.json"
"K679NZ","Personenauto","SAAB","SAAB SAAB 9-3","20250122","20210122","2002","sedan","5","GRIJS","Niet geregistreerd","4","1910","1485","2030","1585","750","1600","20080915","20210122","Geen verstrekking in Open Data",,"Ja","210",,,,,,"4","4",,,,"465","180","M1",,,"r. op schutbord onder motorkap","2030","YS3F",,,,,,"0.07","268","Nee","Nee",,"Nee","3630",,,"2024","Geen oordeel","05","Ja","2025-01-22T00:00:00.000","2021-01-22T00:00:00.000","2008-09-15T00:00:00.000","2021-01-22T00:00:00.000",,,,,,,,,,,,,,,,,,,,,,,,,,,,"https://opendata.rdw.nl/resource/3huj-srit.json","https://opendata.rdw.nl/resource/8ys7-d773.json","https://opendata.rdw.nl/resource/vezc-m2t6.json","https://opendata.rdw.nl/resource/jhie-znh9.json","https://opendata.rdw.nl/resource/kmfi-hrps.json"
"KZ717D","Personenauto","SAAB","SAAB SAAB 9-3","20250131","20220826","3403","cabriolet","4","GRIJS","Niet geregistreerd","4","1910","1640","2100","1740","750","1600","20090709","20161219","Geen verstrekking in Open Data","58285","Ja",,,,,,,"2","4",,,,,,"M1",,,"midden tegen schutbord onder motorkap","2100",,,,,,,"0.06","268","Nee","Nee",,"Nee","3700",,,"2023","Geen oordeel","05","Ja","2025-01-31T00:00:00.000","2022-08-26T00:00:00.000","2009-07-09T00:00:00.000","2016-12-19T00:00:00.000",,,,,,,,,,,,,,,,,,,,,,,,,,,,"https://opendata.rdw.nl/resource/3huj-srit.json","https://opendata.rdw.nl/resource/8ys7-d773.json","https://opendata.rdw.nl/resource/vezc-m2t6.json","https://opendata.rdw.nl/resource/jhie-znh9.json","https://opendata.rdw.nl/resource/kmfi-hrps.json"
"L760HZ","Personenauto","SAAB","SAAB SAAB 9-3","20240525","20210526","7486","cabriolet","4","ZWART","Niet geregistreerd","4","1998","1565","2020","1665","750","1600","20060720","20210526","Geen verstrekking in Open Data",,"Nee","205",,,,,,"2","4",,,,"464","176","M1",,,,"2020","9-3",,,,,,"0.07","268","Nee","Nee",,"Nee","3620",,,"2023","Geen oordeel","05","Ja","2024-05-25T00:00:00.000","2021-05-26T00:00:00.000","2006-07-20T00:00:00.000","2021-05-26T00:00:00.000",,,,,,,,,,,"144",,,,,,,,,,,,,,,,,"https://opendata.rdw.nl/resource/3huj-srit.json","https://opendata.rdw.nl/resource/8ys7-d773.json","https://opendata.rdw.nl/resource/vezc-m2t6.json","https://opendata.rdw.nl/resource/jhie-znh9.json","https://opendata.rdw.nl/resource/kmfi-hrps.json"
"L875BK","Personenauto","SAAB","SAAB SAAB 9-3","20250602","20210412","32267","cabriolet","4","BLAUW","Niet geregistreerd","4","1910","1650","2120","1750","750","1600","20081118","20210412","Geen verstrekking in Open Data",,"Ja","220",,,,,,"2","4",,,,,,"M1",,,,"2120","YS3FC",,,,,,"0.08","268","Nee","Nee",,"Nee","3720",,,"2024","Geen oordeel","05","Ja","2025-06-02T00:00:00.000","2021-04-12T00:00:00.000","2008-11-18T00:00:00.000","2021-04-12T00:00:00.000",,,,,,,,,,,,,,,,,,,,,,,,,,,,"https://opendata.rdw.nl/resource/3huj-srit.json","https://opendata.rdw.nl/resource/8ys7-d773.json","https://opendata.rdw.nl/resource/vezc-m2t6.json","https://opendata.rdw.nl/resource/jhie-znh9.json","https://opendata.rdw.nl/resource/kmfi-hrps.json"
"L954XK","Personenauto","SAAB","SAAB SAAB 9-3","20241024","20210816","28073","sedan","5","ZWART","Niet geregistreerd","6","2792","1640","2200","1740",,,"20080505","20210816","Geen verstrekking in Open Data",,"Ja","250",,,,,,"4","4",,,,,,"M1",,,,"2200",,,,,,,"0.12","268","Nee","Nee",,"Nee",,,,"2023","Geen oordeel","05","Ja","2024-10-24T00:00:00.000","2021-08-16T00:00:00.000","2008-05-05T00:00:00.000","2021-08-16T00:00:00.000",,,,,,,,,,,,,,,,,,,,,,,,,,,,"https://opendata.rdw.nl/resource/3huj-srit.json","https://opendata.rdw.nl/resource/8ys7-d773.json","https://opendata.rdw.nl/resource/vezc-m2t6.json","https://opendata.rdw.nl/resource/jhie-znh9.json","https://opendata.rdw.nl/resource/kmfi-hrps.json"
"NL680D","Personenauto","SAAB","SAAB SAAB 9-3","20250314","20170329","11394","stationwagen","5","BLAUW","Niet geregistreerd","4","1910","1540","2100","1640",,,"20060224","20170329","Geen verstrekking in Open Data",,"Ja",,,,,,,"4","4",,,,,,"M1",,,"schutbord motorruimte","2100",,,,,,,"0.07","268","Nee","Nee",,"Nee",,,,"2024","Geen oordeel","05","Ja","2025-03-14T00:00:00.000","2017-03-29T00:00:00.000","2006-02-24T00:00:00.000","2017-03-29T00:00:00.000",,,,,,,,,,,,,,,,,,,,,,,,,,,,"https://opendata.rdw.nl/resource/3huj-srit.json","https://opendata.rdw.nl/resource/8ys7-d773.json","https://opendata.rdw.nl/resource/vezc-m2t6.json","https://opendata.rdw.nl/resource/jhie-znh9.json","https://opendata.rdw.nl/resource/kmfi-hrps.json"
"NS694K","Personenauto","SAAB","SAAB SAAB 9-3","20240930","20170724","1399","sedan","5","ZWART","Niet geregistreerd","4","1796","1365","1910","1465",,"1400","20040930","20170724","Geen verstrekking in Open Data","29440","Ja",,,,,,,"4","4",,,,,,"M1",,,"schutbord by motorruimte","1910","YS3FX45B",,,,,,"0.06","268","Nee","Nee",,"Nee","3310",,,"2023","Geen oordeel","05","Ja","2024-09-30T00:00:00.000","2017-07-24T00:00:00.000","2004-09-30T00:00:00.000","2017-07-24T00:00:00.000",,,,,,,,,,,,,,,,,,,,,,,,,,,,"https://opendata.rdw.nl/resource/3huj-srit.json","https://opendata.rdw.nl/resource/8ys7-d773.json","https://opendata.rdw.nl/resource/vezc-m2t6.json","https://opendata.rdw.nl/resource/jhie-znh9.json","https://opendata.rdw.nl/resource/kmfi-hrps.json"
"PB401B","Personenauto","SAAB","SAAB SAAB 9-3","20250308","20170526","4311","cabriolet","5","GRIJS","Niet geregistreerd","4","1998","1625","2060","1725","750","1600","20050418","20170518","Geen verstrekking in Open Data","62840","Ja",,,,,,,"2","4",,,,,,"M1",,,"r. schutbord motorruimte","2060","YS3FX79Y",,,,,,"0.09","268","Nee","Nee",,"Nee","3660",,,"2024","Geen oordeel","05","Ja","2025-03-08T00:00:00.000","2017-05-26T00:00:00.000","2005-04-18T00:00:00.000","2017-05-18T00:00:00.000",,,,,,,,,,,,,,,,,,,,,,,,,,,,"https://opendata.rdw.nl/resource/3huj-srit.json","https://opendata.rdw.nl/resource/8ys7-d773.json","https://opendata.rdw.nl/resource/vezc-m2t6.json","https://opendata.rdw.nl/resource/jhie-znh9.json","https://opendata.rdw.nl/resource/kmfi-hrps.json"
"PR289S","Personenauto","SAAB","SAAB SAAB 9-3","20240514","20190514","13704","cabriolet","5","GRIJS","Niet geregistreerd","4","1998","1565","2020","1665",,"1600","20050719","20180710","Geen verstrekking in Open Data",,"Ja",,,,,,,"2","4",,,,,,"M1",,,"midden tegen schutbord onder motorkap","2020","YS3FX75F",,,,,,"0.07","268","Nee","Nee",,"Nee","3620",,,"2023","Geen oordeel","05","Ja","2024-05-14T00:00:00.000","2019-05-14T00:00:00.000","2005-07-19T00:00:00.000","2018-07-10T00:00:00.000",,,,,,,,,,,,,,,,,,,,,,,,,,,,"https://opendata.rdw.nl/resource/3huj-srit.json","https://opendata.rdw.nl/resource/8ys7-d773.json","https://opendata.rdw.nl/resource/vezc-m2t6.json","https://opendata.rdw.nl/resource/jhie-znh9.json","https://opendata.rdw.nl/resource/kmfi-hrps.json"
"RF763Z","Personenauto","SAAB","SAAB SAAB 9-3","20241110","20171111","3127","cabriolet","4","BLAUW","Niet geregistreerd","4","1998","1595","2050","1695","750","1600","20090723","20171111","Geen verstrekking in Open Data","53065","Ja",,,,,,,"2","4","0","0",,"465","0","M1",,,"midden tegen schutbord onder motorkap","2050","YS3F C",,"e4*2001/116*0077*15","F7F","A5 02","0","0.06","268","Nee","Nee",,"Nee","3650","0",,"2023","Geen oordeel","05","Ja","2024-11-10T00:00:00.000","2017-11-11T00:00:00.000","2009-07-23T00:00:00.000","2017-11-11T00:00:00.000",,,,,,,,,,,,,,,,,,,,,"F",,,,,,,"https://opendata.rdw.nl/resource/3huj-srit.json","https://opendata.rdw.nl/resource/8ys7-d773.json","https://opendata.rdw.nl/resource/vezc-m2t6.json","https://opendata.rdw.nl/resource/jhie-znh9.json","https://opendata.rdw.nl/resource/kmfi-hrps.json"
"RT744X","Personenauto","SAAB","SAAB SAAB 9-3","20241101","20191102","1110","cabriolet","4","GRIJS","Niet geregistreerd","4","1998","1595","2070","1695","750","1600","20040308","20180531","Geen verstrekking in Open Data","54040","Ja",,,,,,,"2","4","0","0",,"464","0","M1",,,"midden tegen schutbord onder motorkap","2070","YS3FX79F",,"e4*2001/116*0077*01","F7F","A5 01","0","0.06","268","Nee","Nee",,"Nee","3670","0",,"2023","Geen oordeel","05","Ja","2024-11-01T00:00:00.000","2019-11-02T00:00:00.000","2004-03-08T00:00:00.000","2018-05-31T00:00:00.000",,,,,,,,,,,,,,,,,,,,,"F",,,,,,,"https://opendata.rdw.nl/resource/3huj-srit.json","https://opendata.rdw.nl/resource/8ys7-d773.json","https://opendata.rdw.nl/resource/vezc-m2t6.json","https://opendata.rdw.nl/resource/jhie-znh9.json","https://opendata.rdw.nl/resource/kmfi-hrps.json"
"S709ZD","Personenauto","SAAB","SAAB SAAB 9-3","20240617","20230525","10315","cabriolet","4","ZWART","Niet geregistreerd","4","1910","1665","2130","1765","750","1600","20080218","20230427","Geen verstrekking in Open Data",,"Ja","195",,,,,,"2","4",,,,,,"M1",,,"schutbord","2130","YS3FX71W",,,,,,"0.06","268","Nee","Nee",,"Nee","3730",,,"2023","Geen oordeel","05","Ja","2024-06-17T00:00:00.000","2023-05-25T00:00:00.000","2008-02-18T00:00:00.000","2023-04-27T00:00:00.000",,,,,,,,,,,,,,,,,,,,,,"20231221","2023-12-21T00:00:00.000",,,,,"https://opendata.rdw.nl/resource/3huj-srit.json","https://opendata.rdw.nl/resource/8ys7-d773.json","https://opendata.rdw.nl/resource/vezc-m2t6.json","https://opendata.rdw.nl/resource/jhie-znh9.json","https://opendata.rdw.nl/resource/kmfi-hrps.json"
"SR969T","Personenauto","SAAB","SAAB SAAB 9-3","20220528","20210621","7111","sedan","5","GRIJS","Niet geregistreerd","4","1796","1365","1910","1465","730","1400","20050201","20180524","Geen verstrekking in Open Data",,"Ja",,,,,,,"4","4",,,,,,"M1",,,,"1910","YS3FX45B",,,,,,"0.06","268","Nee","Nee",,"Nee","3310",,,"2021","Geen oordeel","05","Ja","2022-05-28T00:00:00.000","2021-06-21T00:00:00.000","2005-02-01T00:00:00.000","2018-05-24T00:00:00.000",,,,,,,,,,,,,,,,,,,,,,,,,,,,"https://opendata.rdw.nl/resource/3huj-srit.json","https://opendata.rdw.nl/resource/8ys7-d773.json","https://opendata.rdw.nl/resource/vezc-m2t6.json","https://opendata.rdw.nl/resource/jhie-znh9.json","https://opendata.rdw.nl/resource/kmfi-hrps.json"
"XK992S","Personenauto","SAAB","SAAB SAAB 9-3","20250311","20210626","10712","sedan","5","ZWART","Niet geregistreerd","4","1910","1510","2060","1610","750","1600","20081009","20190123","Geen verstrekking in Open Data",,"Ja",,,,,,,"4","4",,,,,,"M1",,,,"2060",,,,,,,"0.07","268","Nee","Nee",,"Nee","3660",,,"2024","Geen oordeel","05","Ja","2025-03-11T00:00:00.000","2021-06-26T00:00:00.000","2008-10-09T00:00:00.000","2019-01-23T00:00:00.000",,,,,,,,,,,,,,,,,,,,,,,,,,,,"https://opendata.rdw.nl/resource/3huj-srit.json","https://opendata.rdw.nl/resource/8ys7-d773.json","https://opendata.rdw.nl/resource/vezc-m2t6.json","https://opendata.rdw.nl/resource/jhie-znh9.json","https://opendata.rdw.nl/resource/kmfi-hrps.json"