"kenteken","voertuigsoort","merk","handelsbenaming","vervaldatum_apk","datum_tenaamstelling","bruto_bpm","inrichting","aantal_zitplaatsen","eerste_kleur","tweede_kleur","aantal_cilinders","cilinderinhoud","massa_ledig_voertuig","toegestane_maximum_massa_voertuig","massa_rijklaar","maximum_massa_trekken_ongeremd","maximum_trekken_massa_geremd","datum_eerste_toelating","datum_eerste_tenaamstelling_in_nederland","wacht_op_keuren","catalogusprijs","wam_verzekerd","maximale_constructiesnelheid","laadvermogen","oplegger_geremd","aanhangwagen_autonoom_geremd","aanhangwagen_middenas_geremd","aantal_staanplaatsen","aantal_deuren","aantal_wielen","afstand_hart_koppeling_tot_achterzijde_voertuig","afstand_voorzijde_voertuig_tot_hart_koppeling","afwijkende_maximum_snelheid","lengte","breedte","europese_voertuigcategorie","europese_voertuigcategorie_toevoeging","europese_uitvoeringcategorie_toevoeging","plaats_chassisnummer","technische_max_massa_voertuig","type","type_gasinstallatie","typegoedkeuringsnummer","variant","uitvoering","volgnummer_wijziging_eu_typegoedkeuring","vermogen_massarijklaar","wielbasis","export_indicator","openstaande_terugroepactie_indicator","vervaldatum_tachograaf","taxi_indicator","maximum_massa_samenstelling","aantal_rolstoelplaatsen","maximum_ondersteunende_snelheid","jaar_laatste_registratie_tellerstand","tellerstandoordeel","code_toelichting_tellerstandoordeel","tenaamstellen_mogelijk","vervaldatum_apk_dt","datum_tenaamstelling_dt","datum_eerste_toelating_dt","datum_eerste_tenaamstelling_in_nederland_dt","vervaldatum_tachograaf_dt","maximum_last_onder_de_vooras_sen_tezamen_koppeling","type_remsysteem_voertuig_code","rupsonderstelconfiguratiecode","wielbasis_voertuig_minimum","wielbasis_voertuig_maximum","lengte_voertuig_minimum","lengte_voertuig_maximum","breedte_voertuig_minimum","breedte_voertuig_maximum","hoogte_voertuig","hoogte_voertuig_minimum","hoogte_voertuig_maximum","massa_bedrijfsklaar_minimaal","massa_bedrijfsklaar_maximaal","technisch_toelaatbaar_massa_koppelpunt","maximum_massa_technisch_maximaal","maximum_massa_technisch_minimaal","subcategorie_nederland","verticale_belasting_koppelpunt_getrokken_voertuig","zuinigheidsclassificatie","registratie_datum_goedkeuring_afschrijvingsmoment_bpm","registratie_datum_goedkeuring_afschrijvingsmoment_bpm_dt","gem_lading_wrde","aerodyn_voorz","massa_alt_aandr","verl_cab_ind","api_gekentekende_voertuigen_assen","api_gekentekende_voertuigen_brandstof","api_gekentekende_voertuigen_carrosserie","api_gekentekende_voertuigen_carrosserie_specifiek","api_gekentekende_voertuigen_voertuigklasse"
"00JGH4","Personenauto","SAAB","SAAB 9-5","20241206","20120711","14401","sedan","5","GRIJS","Niet geregistreerd","4","1985","1505","2090","1605","750","1800","20090514","20090514","Geen verstrekking in Open Data",,"Ja",,,,,,,"4","4","0","0",,"484","0","M1",,,"midden tegen schutbord onder motorkap","2090","YS3E",,"e4*2001/116*0096*06","E4C","A5 02","0","0.07","270","Nee","Nee",,"Nee","3890","0",,"2023","Logisch","00","Ja","2024-12-06T00:00:00.000","2012-07-11T00:00:00.000","2009-05-14T00:00:00.000","2009-05-14T00:00:00.000",,,,,,,,,,,,,,,,,,,,,"F",,,,,,,"https://opendata.rdw.nl/resource/3huj-srit.json","https://opendata.rdw.nl/resource/8ys7-d773.json","https://opendata.rdw.nl/resource/vezc-m2t6.json","https://opendata.rdw.nl/resource/jhie-znh9.json","https://opendata.rdw.nl/resource/kmfi-hrps.json"
"00KBJ8","Personenauto","SAAB","SAAB 9-5","20241012","20120402","14821","stationwagen","5","ZWART","Niet geregistreerd","4","2290","1580","2150","1680","750","1800","20080923","20091006","Geen verstrekking in Open Data",,"Ja",,,,,,,"4","4","0","0",,"484","0","M1",,,"by schutbord","2150","YS3E",,"e4*2001/116*0096*06","E5G","A5 02","2","0.11","270","Nee","Nee",,"Nee","3950","0",,"2023","Geen oordeel","05","Ja","2024-10-12T00:00:00.000","2012-04-02T00:00:00.000","2008-09-23T00:00:00.000","2009-10-06T00:00:00.000",,,,,,,,,,,,,,,,,,,,,"F",,,,,,,"https://opendata.rdw.nl/resource/3huj-srit.json","https://opendata.rdw.nl/resource/8ys7-d773.json","https://opendata.rdw.nl/resource/vezc-m2t6.json","https://opendata.rdw.nl/resource/jhie-znh9.json","https://opendata.rdw.nl/resource/kmfi-hrps.json"
"00PSH1","Personenauto","SAAB","SAAB 9-5","20250412","20210904","12191","stationwagen","5","GRIJS","Niet geregistreerd","4","2290","1560","2130","1660","750","1800","20001023","20110315","Geen verstrekking in Open Data",,"Ja",,,,,,,"4","4","0","0",,"481","0","M1",,,"midden tegen schutbord onder motorkap","2130",,,"e11*96/27*0073*09","E5G","M02","1","0.10","270","Nee","Nee",,"Nee","3930","0","0.00","2024","Geen oordeel","05","Ja","2025-04-12T00:00:00.000","2021-09-04T00:00:00.000","2000-10-23T00:00:00.000","2011-03-15T00:00:00.000",,,,,,,,,,,,,,,,,,,,,,,,,,,,"https://opendata.rdw.nl/resource/3huj-srit.json","https://opendata.rdw.nl/resource/8ys7-d773.json","https://opendata.rdw.nl/resource/vezc-m2t6.json","https://opendata.rdw.nl/resource/jhie-znh9.json","https://opendata.rdw.nl/resource/kmfi-hrps.json"
"00RDL7","Personenauto","SAAB","SAAB 9-5","20250509","20231229","18414","sedan","5","GRIJS","Niet geregistreerd","4","1998","1650","2280","1750","750","1800","20110503","20110503","Geen verstrekking in Open Data","64207","Ja",,,,,,,"4","4","0","0",,"501","0","M1",,,"r. schutbord","2280","YS3G",,"e4*2007/46*0137*02","G4Z","A6F01","0","0.09","284","Nee","Nee",,"Nee","4080","0","0.00","2024","Logisch","00","Ja","2025-05-09T00:00:00.000","2023-12-29T00:00:00.000","2011-05-03T00:00:00.000","2011-05-03T00:00:00.000",,,,,,,,,,,,,,,,,,,,,"D",,,,,,,"https://opendata.rdw.nl/resource/3huj-srit.json","https://opendata.rdw.nl/resource/8ys7-d773.json","https://opendata.rdw.nl/resource/vezc-m2t6.json","https://opendata.rdw.nl/resource/jhie-znh9.json","https://opendata.rdw.nl/resource/kmfi-hrps.json"
"00SKD2","Personenauto","SAAB","SAAB 9-5","20241002","20180522","8501","sedan","5","BLAUW","Niet geregistreerd","4","1910","1535","2130","1635","750","1800","20060712","20111006","Geen verstrekking in Open Data",,"Ja",,,,,,,"4","4","0","0",,"484","0","M1",,,"r. tegen schutbord onder motorkap","2130",,,"e4*2001/116*0096*01","E4W","A5 01","0","0.07","270","Nee","Nee",,"Nee","3930","0",,"2023","Geen oordeel","05","Ja","2024-10-02T00:00:00.000","2018-05-22T00:00:00.000","2006-07-12T00:00:00.000","2011-10-06T00:00:00.000",,,,,,,,,,,,,,,,,,,,,"E",,,,,,,"https://opendata.rdw.nl/resource/3huj-srit.json","https://opendata.rdw.nl/resource/8ys7-d773.json","https://opendata.rdw.nl/resource/vezc-m2t6.json","https://opendata.rdw.nl/resource/jhie-znh9.json","https://opendata.rdw.nl/resource/kmfi-hrps.json"
"00XBZ2","Personenauto","SAAB","SAAB 9-5","20240609","20181012","7191","stationwagen","5","BLAUW","Niet geregistreerd","4","1910","1555","2160","1655","750","1800","20080514","20120510","Geen verstrekking in Open Data","58575","Ja",,,,,,,"4","4",,,,"484",,"M1",,,"r. tegen schutbord onder motorkap","2160",,,,,,,"0.07","270","Nee","Nee",,"Nee","3960",,,"2023","Geen oordeel","05","Ja","2024-06-09T00:00:00.000","2018-10-12T00:00:00.000","2008-05-14T00:00:00.000","2012-05-10T00:00:00.000",,,,,,,,,,,,,,,,,,,,,"D",,,,,,,"https://opendata.rdw.nl/resource/3huj-srit.json","https://opendata.rdw.nl/resource/8ys7-d773.json","https://opendata.rdw.nl/resource/vezc-m2t6.json","https://opendata.rdw.nl/resource/jhie-znh9.json","https://opendata.rdw.nl/resource/kmfi-hrps.json"
"00XVD6","Personenauto","SAAB","SAAB 9-5","20240930","20240322","16586","stationwagen","5","GRIJS","Niet geregistreerd","4","2290","1555","2150","1655","750","1800","20090220","20120822","Geen verstrekking in Open Data",,"Ja",,,,,,,"4","4","0","0",,"484","0","M1",,,"midden tegen schutbord onder motorkap","2150","YS3E",,"e4*2001/116*0096*06","E5E","A5 02","0","0.08","270","Nee","Nee",,"Nee","3950","0",,"2024","Geen oordeel","05","Ja","2024-09-30T00:00:00.000","2024-03-22T00:00:00.000","2009-02-20T00:00:00.000","2012-08-22T00:00:00.000",,,,,,,,,,,,,,,,,,,,,"F",,,,,,,"https://opendata.rdw.nl/resource/3huj-srit.json","https://opendata.rdw.nl/resource/8ys7-d773.json","https://opendata.rdw.nl/resource/vezc-m2t6.json","https://opendata.rdw.nl/resource/jhie-znh9.json","https://opendata.rdw.nl/resource/kmfi-hrps.json"
"01FJRN","Personenauto","SAAB","SAAB 9-5","20230827","20180430","14009","sedan","5","ZWART","Niet geregistreerd","6","2962","1545","2110","1645","750","1800","20000411","20000411","Geen verstrekking in Open Data",,"Nee",,,,,,,"4","4","0","0",,"481","0","M1",,,"midden tegen schutbord onder motorkap","2110",,,"e11*96/27*0073*07","E4Z","A06","1","0.09","270","Nee","Nee",,"Nee","3910","0",,"2022","Logisch","00","Ja","2023-08-27T00:00:00.000","2018-04-30T00:00:00.000","2000-04-11T00:00:00.000","2000-04-11T00:00:00.000",,,,,,,,,,,,,,,,,,,,,,,,,,,,"https://opendata.rdw.nl/resource/3huj-srit.json","https://opendata.rdw.nl/resource/8ys7-d773.json","https://opendata.rdw.nl/resource/vezc-m2t6.json","https://opendata.rdw.nl/resource/jhie-znh9.json","https://opendata.rdw.nl/resource/kmfi-hrps.json"
"01GHTD","Personenauto","SAAB","SAAB 9-5","20240331","20200824","11740","sedan","5","ZWART","Niet geregistreerd","4","2290","1520","2090","1620","750","1800","20001115","20001115","Geen verstrekking in Open Data",,"Nee",,,,,,,"4","4","0","0",,"481","0","M1",,,"midden tegen schutbord onder motorkap","2090",,,"e11*96/27*0073*08","E4E","A07","1","0.08","270","Nee","Nee",,"Nee","3890","0","0.00","2023","Geen oordeel","05","Ja","2024-03-31T00:00:00.000","2020-08-24T00:00:00.000","2000-11-15T00:00:00.000","2000-11-15T00:00:00.000",,,,,,,,,,,,,,,,,,,,,,,,,,,,"https://opendata.rdw.nl/resource/3huj-srit.json","https://opendata.rdw.nl/resource/8ys7-d773.json","https://opendata.rdw.nl/resource/vezc-m2t6.json","https://opendata.rdw.nl/resource/jhie-znh9.json","https://opendata.rdw.nl/resource/kmfi-hrps.json"
"01HPZD","Personenauto","SAAB","SAAB 9-5","20240120","20240322","12055","sedan","5","GRIJS","Niet geregistreerd","4","2290","1530","2090","1630","750","1800","20011011","20011011","Geen verstrekking in Open Data",,"Nee",,,,,,,"4","4","0","0",,"483","0","M1",,,"midden tegen schutbord onder motorkap","2090",,,"e11*96/27*0073*10","E4E","A08","0","0.08","270","Nee","Nee",,"Nee","3890","0",,"2023","Logisch","00","Ja","2024-01-20T00:00:00.000","2024-03-22T00:00:00.000","2001-10-11T00:00:00.000","2001-10-11T00:00:00.000",,,,,,,,,,,,,,,,,,,,,"D",,,,,,,"https://opendata.rdw.nl/resource/3huj-srit.json","https://opendata.rdw.nl/resource/8ys7-d773.json","https://opendata.rdw.nl/resource/vezc-m2t6.json","https://opendata.rdw.nl/resource/jhie-znh9.json","https://opendata.rdw.nl/resource/kmfi-hrps.json"
"01HSGP","Personenauto","SAAB","SAAB 9-5","20240625","20200806","9505","stationwagen","5","ZWART","Niet geregistreerd","4","1985","1585","2160","1685","750","1800","20011107","20011107","Geen verstrekking in Open Data",,"Ja",,,,,,,"4","4","0","0",,"481","0","M1",,,"midden tegen schutbord onder motorkap","2160",,,"e11*96/27*0073*09","E5C","A05","1","0.07","270","Nee","Nee",,"Nee","3960","0","0.00","2024","Logisch","00","Ja","2024-06-25T00:00:00.000","2020-08-06T00:00:00.000","2001-11-07T00:00:00.000","2001-11-07T00:00:00.000",,,,,,,,,,,,,,,,,,,,,"E",,,,,,,"https://opendata.rdw.nl/resource/3huj-srit.json","https://opendata.rdw.nl/resource/8ys7-d773.json","https://opendata.rdw.nl/resource/vezc-m2t6.json","https://opendata.rdw.nl/resource/jhie-znh9.json","https://opendata.rdw.nl/resource/kmfi-hrps.json"
"01HSTR","Personenauto","SAAB","SAAB 9-5","20140831","20130708","13180","stationwagen","5","GRIJS","Niet geregistreerd","6","2958","1640","2210","1740","750","1800","20011114","20011114","Geen verstrekking in Open Data",,"Nee",,,,,,,"4","4","0","0",,"483","0","M1",,,"midden tegen schutbord onder motorkap","2210",,,"e11*96/27*0073*10","E5L","M01","0","0.07","270","Nee","Nee",,"Nee","4010","0",,"2013","Logisch","00","Ja","2014-08-31T00:00:00.000","2013-07-08T00:00:00.000","2001-11-14T00:00:00.000","2001-11-14T00:00:00.000",,,,,,,,,,,,,,,,,,,,,"E",,,,,,,"https://opendata.rdw.nl/resource/3huj-srit.json","https://opendata.rdw.nl/resource/8ys7-d773.json","https://opendata.rdw.nl/resource/vezc-m2t6.json","https://opendata.rdw.nl/resource/jhie-znh9.json","https://opendata.rdw.nl/resource/kmfi-hrps.json"
"01JFNN","Personenauto","SAAB","SAAB 9-5","20241006","20140827","12561","stationwagen","5","GRIJS","Niet geregistreerd","4","2290","1595","2170","1695","750","1800","20020306","20020306","Geen verstrekking in Open Data",,"Ja",,,,,,,"4","4","0","0",,"483","0","M1",,,"midden tegen schutbord onder motorkap","2170",,,"e11*96/27*0073*11","E5E","A04","0","0.08","270","Nee","Nee",,"Nee","3970","0",,"2023","Logisch","00","Ja","2024-10-06T00:00:00.000","2014-08-27T00:00:00.000","2002-03-06T00:00:00.000","2002-03-06T00:00:00.000",,,,,,,,,,,,,,,,,,,,,"E",,,,,,,"https://opendata.rdw.nl/resource/3huj-srit.json","https://opendata.rdw.nl/resource/8ys7-d773.json","https://opendata.rdw.nl/resource/vezc-m2t6.json","https://opendata.rdw.nl/resource/jhie-znh9.json","https://opendata.rdw.nl/resource/kmfi-hrps.json"
"01JRBZ","Personenauto","SAAB","SAAB 9-5","20230921","20230622","14358","stationwagen","5","BLAUW","Niet geregistreerd","4","2290","1610","2170","1710","750","1800","20020705","20020705","Geen verstrekking in Open Data",,"Ja",,,,,,,"4","4","0","0",,"483","0","M1",,,"midden tegen schutbord onder motorkap","2170",,,"e11*96/27*0073*13","E5G/TK","A01","0","0.11","270","Nee","Nee",,"Nee","3970","0",,"2023","Logisch","00","Ja","2023-09-21T00:00:00.000","2023-06-22T00:00:00.000","2002-07-05T00:00:00.000","2002-07-05T00:00:00.000",,,,,,,,,,,,,,,,,,,,,"E",,,,,,,"https://opendata.rdw.nl/resource/3huj-srit.json","https://opendata.rdw.nl/resource/8ys7-d773.json","https://opendata.rdw.nl/resource/vezc-m2t6.json","https://opendata.rdw.nl/resource/jhie-znh9.json","https://opendata.rdw.nl/resource/kmfi-hrps.json"
"01JZDG","Personenauto","SAAB","SAAB 9-5","20241113","20060120","12490","stationwagen","5","BLAUW","Niet geregistreerd","4","2290","1595","2170","1695","750","1800","20021016","20021016","Geen verstrekking in Open Data",,"Ja",,,,,,,"4","4","0","0",,"483","0","M1",,,"midden tegen schutbord onder motorkap","2170",,,"e11*96/27*0073*14","E5E","A04","0","0.08","270","Nee","Nee",,"Nee","3970","0",,"2023","Onlogisch","04","Ja","2024-11-13T00:00:00.000","2006-01-20T00:00:00.000","2002-10-16T00:00:00.000","2002-10-16T00:00:00.000",,,,,,,,,,,,,,,,,,,,,"E",,,,,,,"https://opendata.rdw.nl/resource/3huj-srit.json","https://opendata.rdw.nl/resource/8ys7-d773.json","https://opendata.rdw.nl/resource/vezc-m2t6.json","https://opendata.rdw.nl/resource/jhie-znh9.json","https://opendata.rdw.nl/resource/kmfi-hrps.json"
"01KRF6","Personenauto","SAAB","SAAB 9-5","20250103","20210806","15777","stationwagen","5","GRIJS","Niet geregistreerd","4","1985","1555","2150","1655","750","1800","20100116","20100116","Geen verstrekking in Open Data",,"Ja",,,,,,,"4","4","0","0",,"484","0","M1",,,"midden tegen schutbord onder motorkap","2150","YS3E",,"e4*2001/116*0096*06","E5CBP","A5 01","2","0.07","270","Nee","Nee",,"Nee","3950","0",,"2024","Logisch","00","Ja","2025-01-03T00:00:00.000","2021-08-06T00:00:00.000","2010-01-16T00:00:00.000","2010-01-16T00:00:00.000",,"0",,,,,,,,,,,,,,,,,,,"G",,,,,,,"https://opendata.rdw.nl/resource/3huj-srit.json","https://opendata.rdw.nl/resource/8ys7-d773.json","https://opendata.rdw.nl/resource/vezc-m2t6.json","https://opendata.rdw.nl/resource/jhie-znh9.json","https://opendata.rdw.nl/resource/kmfi-hrps.json"
"01LFJZ","Personenauto","SAAB","SAAB 9-5","20241215","20240314","10837","sedan","5","ZWART","Niet geregistreerd","4","1985","1530","2090","1630","750","1800","20021202","20021202","Geen verstrekking in Open Data",,"Ja",,,,,,,"4","4","0","0",,"483","0","M1",,,"midden tegen schutbord onder motorkap","2090",,,"e11*96/27*0073*13","E4C","A09","0","0.07","270","Nee","Nee",,"Nee","3890","0",,"2023","Logisch","00","Ja","2024-12-15T00:00:00.000","2024-03-14T00:00:00.000","2002-12-02T00:00:00.000","2002-12-02T00:00:00.000",,,,,,,,,,,,,,,,,,,,,"E",,,,,,,"https://opendata.rdw.nl/resource/3huj-srit.json","https://opendata.rdw.nl/resource/8ys7-d773.json","https://opendata.rdw.nl/resource/vezc-m2t6.json","https://opendata.rdw.nl/resource/jhie-znh9.json","https://opendata.rdw.nl/resource/kmfi-hrps.json"
"01LGJ6","Personenauto","SAAB","9-5","20250416","20230610","14146","stationwagen",,"GRIJS","Niet geregistreerd","4","2290","1610","2170","1710","750","1800","20020221","20100407","Geen verstrekking in Open Data",,"Ja",,,,,,,"4","4",,,,,,"M1",,,"schutbord motorruimte","2170",,,,,,,"0.11","270","Nee","Nee",,"Nee","3970",,,"2024","Geen oordeel","05","Ja","2025-04-16T00:00:00.000","2023-06-10T00:00:00.000","2002-02-21T00:00:00.000","2010-04-07T00:00:00.000",,"0",,,,,,,,,,,,,,,,,,,,,,,,,,"https://opendata.rdw.nl/resource/3huj-srit.json","https://opendata.rdw.nl/resource/8ys7-d773.json","https://opendata.rdw.nl/resource/vezc-m2t6.json","https://opendata.rdw.nl/resource/jhie-znh9.json","https://opendata.rdw.nl/resource/kmfi-hrps.json"
"01LGJR","Personenauto","SAAB","SAAB 9-5","20240906","20220818","14940","sedan","5","BLAUW","Niet geregistreerd","6","2962","1560","2120","1660","750","1800","20030102","20030102","Geen verstrekking in Open Data",,"Ja",,,,,,,"4","4","0","0",,"483","0","M1",,,"midden tegen schutbord onder motorkap","2120",,,"e11*96/27*0073*15","E4Z","A08","0","0.09","270","Nee","Nee",,"Nee","3920","0",,"2023","Logisch","00","Ja","2024-09-06T00:00:00.000","2022-08-18T00:00:00.000","2003-01-02T00:00:00.000","2003-01-02T00:00:00.000",,,,,,,,,,,,,,,,,,,,,"F",,,,,,,"https://opendata.rdw.nl/resource/3huj-srit.json","https://opendata.rdw.nl/resource/8ys7-d773.json","https://opendata.rdw.nl/resource/vezc-m2t6.json","https://opendata.rdw.nl/resource/jhie-znh9.json","https://opendata.rdw.nl/resource/kmfi-hrps.json"
"01LHHN","Personenauto","SAAB","SAAB 9-5","20240712","20220825","8650","sedan","5","ZWART","Niet geregistreerd","4","1985","1495","2060","1595","750","1800","20030402","20030402","Geen verstrekking in Open Data",,"Ja",,,,,,,"4","4","0","0",,"483","0","M1",,,"midden tegen schutbord onder motorkap","2060",,,"e11*96/27*0073*13","E4C","M08","0","0.07","270","Nee","Nee",,"Nee","3860","0",,"2024","Logisch","00","Ja","2024-07-12T00:00:00.000","2022-08-25T00:00:00.000","2003-04-02T00:00:00.000","2003-04-02T00:00:00.000",,,,,,,,,,,,,,,,,,,,,"D",,,,,,,"https://opendata.rdw.nl/resource/3huj-srit.json","https://opendata.rdw.nl/resource/8ys7-d773.json","https://opendata.rdw.nl/resource/vezc-m2t6.json","https://opendata.rdw.nl/resource/jhie-znh9.json","https://opendata.rdw.nl/resource/kmfi-hrps.json"
"01LLGX","Personenauto","SAAB","SAAB 9-5","20231112","20231110","11062","stationwagen","5","ZWART","Niet geregistreerd","4","2290","1595","2170","1695","750","1800","20030220","20030220","Geen verstrekking in Open Data",,"Nee",,,,,,,"4","4","0","0",,"483","0","M1",,,"midden tegen schutbord onder motorkap","2170",,,"e11*96/27*0073*15","E5E","A04","0","0.08","270","Nee","Nee",,"Nee","3970","0",,"2022","Logisch","00","Ja","2023-11-12T00:00:00.000","2023-11-10T00:00:00.000","2003-02-20T00:00:00.000","2003-02-20T00:00:00.000",,,,,,,,,,,,,,,,,,,,,"E",,,,,,,"https://opendata.rdw.nl/resource/3huj-srit.json","https://opendata.rdw.nl/resource/8ys7-d773.json","https://opendata.rdw.nl/resource/vezc-m2t6.json","https://opendata.rdw.nl/resource/jhie-znh9.json","https://opendata.rdw.nl/resource/kmfi-hrps.json"
"01LNVZ","Personenauto","SAAB","SAAB 9-5","20240309","20240210","11899","sedan","5","GRIJS","Niet geregistreerd","4","2290","1530","2090","1630","750","1800","20030320","20030320","Geen verstrekking in Open Data",,"Ja",,,,,,,"4","4","0","0",,"483","0","M1",,,"midden tegen schutbord onder motorkap","2090",,,"e11*96/27*0073*15","E4E","A08","0","0.08","270","Nee","Nee",,"Nee","3890","0",,"2024","Logisch","00","Ja","2024-03-09T00:00:00.000","2024-02-10T00:00:00.000","2003-03-20T00:00:00.000","2003-03-20T00:00:00.000",,,,,,,,,,,,,,,,,,,,,"E",,,,,,,"https://opendata.rdw.nl/resource/3huj-srit.json","https://opendata.rdw.nl/resource/8ys7-d773.json","https://opendata.rdw.nl/resource/vezc-m2t6.json","https://opendata.rdw.nl/resource/jhie-znh9.json","https://opendata.rdw.nl/resource/kmfi-hrps.json"
"01LTV8","Personenauto","SAAB","SAAB 9-5","20241026","20240403","13190","sedan","5","GRIJS","Niet geregistreerd","4","1956","1650","2280","1750","750","1700","20100629","20100629","Geen verstrekking in Open Data","57600","Nee",,,,,,,"4","4","0","0",,"501","0","M1",,,"r. schutbord","2280","YS3G",,"e4*2007/46*0137*01","G4L","A6F01","0","0.07","284","Nee","Nee",,"Nee","4080","0","0.00","2023","Geen oordeel","05","Ja","2024-10-26T00:00:00.000","2024-04-03T00:00:00.000","2010-06-29T00:00:00.000","2010-06-29T00:00:00.000",,,,,,,,,,,,,,,,,,,,,"C",,,,,,,"https://opendata.rdw.nl/resource/3huj-srit.json","https://opendata.rdw.nl/resource/8ys7-d773.json","https://opendata.rdw.nl/resource/vezc-m2t6.json","https://opendata.rdw.nl/resource/jhie-znh9.json","https://opendata.rdw.nl/resource/kmfi-hrps.json"
"01LXVD","Personenauto","SAAB","SAAB 9-5","20240723","20120828","14693","sedan","5","BLAUW","Niet geregistreerd","6","2962","1560","2120","1660","750","1800","20030626","20030626","Geen verstrekking in Open Data",,"Ja",,,,,,,"4","4","0","0",,"483","0","M1",,,"midden tegen schutbord onder motorkap","2120",,,"e11*96/27*0073*17","E4Z","A08","0","0.09","270","Nee","Nee",,"Nee","3920","0",,"2023","Logisch","00","Ja","2024-07-23T00:00:00.000","2012-08-28T00:00:00.000","2003-06-26T00:00:00.000","2003-06-26T00:00:00.000",,,,,,,,,,,,,,,,,,,,,"F",,,,,,,"https://opendata.rdw.nl/resource/3huj-srit.json","https://opendata.rdw.nl/resource/8ys7-d773.json","https://opendata.rdw.nl/resource/vezc-m2t6.json","https://opendata.rdw.nl/resource/jhie-znh9.json","https://opendata.rdw.nl/resource/kmfi-hrps.json"
"01NBND","Personenauto","SAAB","SAAB 9-5","20240415","20231004","10951","stationwagen","5","ZWART","Niet geregistreerd","4","1985","1560","2130","1660","750","1800","20020822","20030710","Geen verstrekking in Open Data",,"Ja",,,,,,,"4","4","0","0",,"483","0","M1",,,"midden tegen schutbord onder motorkap","2130",,,"e11*96/27*0073*14","E5C","M06","0","0.07","270","Nee","Nee",,"Nee","3930","0",,"2023","Geen oordeel","05","Ja","2024-04-15T00:00:00.000","2023-10-04T00:00:00.000","2002-08-22T00:00:00.000","2003-07-10T00:00:00.000",,,,,,,,,,,,,,,,,,,,,"D",,,,,,,"https://opendata.rdw.nl/resource/3huj-srit.json","https://opendata.rdw.nl/resource/8ys7-d773.json","https://opendata.rdw.nl/resource/vezc-m2t6.json","https://opendata.rdw.nl/resource/jhie-znh9.json","https://opendata.rdw.nl/resource/kmfi-hrps.json"
"01NJFN","Personenauto","SAAB","SAAB 9-5","20231113","20231024","10853","sedan","5","ZWART","Niet geregistreerd","4","1985","1495","2070","1595","750","1800","20031007","20031007","Geen verstrekking in Open Data",,"Nee",,,,,,,"4","4","0","0",,"483","0","M1",,,"midden tegen schutbord onder motorkap","2070",,,"e11*96/27*0073*18","E4C","M09","0","0.07","270","Nee","Nee",,"Nee","3870","0",,"2023","Logisch","00","Ja","2023-11-13T00:00:00.000","2023-10-24T00:00:00.000","2003-10-07T00:00:00.000","2003-10-07T00:00:00.000",,,,,,,,,,,,,,,,,,,,,"D",,,,,,,"https://opendata.rdw.nl/resource/3huj-srit.json","https://opendata.rdw.nl/resource/8ys7-d773.json","https://opendata.rdw.nl/resource/vezc-m2t6.json","https://opendata.rdw.nl/resource/jhie-znh9.json","https://opendata.rdw.nl/resource/kmfi-hrps.json"