"kenteken","voertuigsoort","merk","handelsbenaming","vervaldatum_apk","datum_tenaamstelling","bruto_bpm","inrichting","aantal_zitplaatsen","eerste_kleur","tweede_kleur","aantal_cilinders","cilinderinhoud","massa_ledig_voertuig","toegestane_maximum_massa_voertuig","massa_rijklaar","maximum_massa_trekken_ongeremd","maximum_trekken_massa_geremd","datum_eerste_toelating","datum_eerste_tenaamstelling_in_nederland","wacht_op_keuren","catalogusprijs","wam_verzekerd","maximale_constructiesnelheid","laadvermogen","oplegger_geremd","aanhangwagen_autonoom_geremd","aanhangwagen_middenas_geremd","aantal_staanplaatsen","aantal_deuren","aantal_wielen","afstand_hart_koppeling_tot_achterzijde_voertuig","afstand_voorzijde_voertuig_tot_hart_koppeling","afwijkende_maximum_snelheid","lengte","breedte","europese_voertuigcategorie","europese_voertuigcategorie_toevoeging","europese_uitvoeringcategorie_toevoeging","plaats_chassisnummer","technische_max_massa_voertuig","type","type_gasinstallatie","typegoedkeuringsnummer","variant","uitvoering","volgnummer_wijziging_eu_typegoedkeuring","vermogen_massarijklaar","wielbasis","export_indicator","openstaande_terugroepactie_indicator","vervaldatum_tachograaf","taxi_indicator","maximum_massa_samenstelling","aantal_rolstoelplaatsen","maximum_ondersteunende_snelheid","jaar_laatste_registratie_tellerstand","tellerstandoordeel","code_toelichting_tellerstandoordeel","tenaamstellen_mogelijk","vervaldatum_apk_dt","datum_tenaamstelling_dt","datum_eerste_toelating_dt","datum_eerste_tenaamstelling_in_nederland_dt","vervaldatum_tachograaf_dt","maximum_last_onder_de_vooras_sen_tezamen_koppeling","type_remsysteem_voertuig_code","rupsonderstelconfiguratiecode","wielbasis_voertuig_minimum","wielbasis_voertuig_maximum","lengte_voertuig_minimum","lengte_voertuig_maximum","breedte_voertuig_minimum","breedte_voertuig_maximum","hoogte_voertuig","hoogte_voertuig_minimum","hoogte_voertuig_maximum","massa_bedrijfsklaar_minimaal","massa_bedrijfsklaar_maximaal","technisch_toelaatbaar_massa_koppelpunt","maximum_massa_technisch_maximaal","maximum_massa_technisch_minimaal","subcategorie_nederland","verticale_belasting_koppelpunt_getrokken_voertuig","zuinigheidsclassificatie","registratie_datum_goedkeuring_afschrijvingsmoment_bpm","registratie_datum_goedkeuring_afschrijvingsmoment_bpm_dt","gem_lading_wrde","aerodyn_voorz","massa_alt_aandr","verl_cab_ind","api_gekentekende_voertuigen_assen","api_gekentekende_voertuigen_brandstof","api_gekentekende_voertuigen_carrosserie","api_gekentekende_voertuigen_carrosserie_specifiek","api_gekentekende_voertuigen_voertuigklasse"
"1TLB70","Personenauto","ROLLS ROYCE","WRAITH","20250314","20240109","74841","coupe","4","BLAUW","Niet geregistreerd","12","6592","2335","2810","2435",,,"20140313","20140313","Geen verstrekking in Open Data","403335","Ja",,,,,,,"2","4","0","0",,"527","0","M1",,,"r. voorwielscherm by motorruimte","2810","GHOST FAMILY",,"e11*2007/46*0101*07","XZ01","6A040","0","0.19","311","Nee","Nee",,"Nee","0","0",,"2024","Logisch","00","Ja","2025-03-14T00:00:00.000","2024-01-09T00:00:00.000","2014-03-13T00:00:00.000","2014-03-13T00:00:00.000",,,,,,,,,,,,,,,,,,,,,"G",,,,,,,"https://opendata.rdw.nl/resource/3huj-srit.json","https://opendata.rdw.nl/resource/8ys7-d773.json","https://opendata.rdw.nl/resource/vezc-m2t6.json","https://opendata.rdw.nl/resource/jhie-znh9.json","https://opendata.rdw.nl/resource/kmfi-hrps.json"
"2TTJ18","Personenauto","ROLLS ROYCE","WRAITH","20230922","20200131","74841","coupe","4","BLAUW","Niet geregistreerd","12","6592","2335","2810","2435",,,"20140508","20140508","Geen verstrekking in Open Data","398253","Ja",,,,,,,"2","4","0","0",,"527","0","M1",,,"r. voorwielscherm by motorruimte","2810","GHOST FAMILY",,"e11*2007/46*0101*07","XZ01","6A040","0","0.19","311","Nee","Nee",,"Nee","0","0",,"2022","Logisch","00","Ja","2023-09-22T00:00:00.000","2020-01-31T00:00:00.000","2014-05-08T00:00:00.000","2014-05-08T00:00:00.000",,,,,,,,,,,,,,,,,,,,,"G",,,,,,,"https://opendata.rdw.nl/resource/3huj-srit.json","https://opendata.rdw.nl/resource/8ys7-d773.json","https://opendata.rdw.nl/resource/vezc-m2t6.json","https://opendata.rdw.nl/resource/jhie-znh9.json","https://opendata.rdw.nl/resource/kmfi-hrps.json"
"2XKD48","Personenauto","ROLLS ROYCE","WRAITH","20241201","20230628","74838","coupe","4","ZWART","Niet geregistreerd","12","6592","2335","2810","2435",,,"20140825","20140825","Geen verstrekking in Open Data","360000","Ja",,,,,,,"2","4","0","0",,"527","0","M1",,,"r. voorwielscherm by motorruimte","2810","GHOST FAMILY",,"e11*2007/46*0101*09","XZ01","6A040000","0","0.19","311","Nee","Nee",,"Nee","0","0",,"2023","Geen oordeel","05","Ja","2024-12-01T00:00:00.000","2023-06-28T00:00:00.000","2014-08-25T00:00:00.000","2014-08-25T00:00:00.000",,,,,,,,,,,,,,,,,,,,,"G",,,,,,,"https://opendata.rdw.nl/resource/3huj-srit.json","https://opendata.rdw.nl/resource/8ys7-d773.json","https://opendata.rdw.nl/resource/vezc-m2t6.json","https://opendata.rdw.nl/resource/jhie-znh9.json","https://opendata.rdw.nl/resource/kmfi-hrps.json"
"6XFP17","Personenauto","ROLLS ROYCE","WRAITH","20240829","20140711","74841","coupe","4","ROOD","Niet geregistreerd","12","6592","2335","2810","2435",,,"20140711","20140711","Geen verstrekking in Open Data","395636","Ja",,,,,,,"2","4","0","0",,"527","0","M1",,,"r. voorwielscherm by motorruimte","2810","GHOST FAMILY",,"e11*2007/46*0101*08","XZ01","6A040000","0","0.19","311","Nee","Nee",,"Nee","0","0",,"2023","Logisch","00","Ja","2024-08-29T00:00:00.000","2014-07-11T00:00:00.000","2014-07-11T00:00:00.000","2014-07-11T00:00:00.000",,,,,,,,,,,,,,,,,,,,,"G",,,,,,,"https://opendata.rdw.nl/resource/3huj-srit.json","https://opendata.rdw.nl/resource/8ys7-d773.json","https://opendata.rdw.nl/resource/vezc-m2t6.json","https://opendata.rdw.nl/resource/jhie-znh9.json","https://opendata.rdw.nl/resource/kmfi-hrps.json"
"6ZKD30","Personenauto","ROLLS ROYCE","WRAITH","20250518","20221007","74841","coupe","4","ZWART","Niet geregistreerd","12","6592","2335","2810","2435",,,"20150102","20150102","Geen verstrekking in Open Data","403571","Ja",,,,,,,"2","4","0","0",,"527","0","M1",,,"r. voorwielscherm by motorruimte","2810","GHOST FAMILY",,"e11*2007/46*0101*09","XZ01","6A040000","0","0.19","311","Nee","Nee",,"Nee","0","0",,"2024","Logisch","00","Ja","2025-05-18T00:00:00.000","2022-10-07T00:00:00.000","2015-01-02T00:00:00.000","2015-01-02T00:00:00.000",,,,,,,,,,,,,,,,,,,,,"G",,,,,,,"https://opendata.rdw.nl/resource/3huj-srit.json","https://opendata.rdw.nl/resource/8ys7-d773.json","https://opendata.rdw.nl/resource/vezc-m2t6.json","https://opendata.rdw.nl/resource/jhie-znh9.json","https://opendata.rdw.nl/resource/kmfi-hrps.json"
"7TPR78","Personenauto","ROLLS ROYCE","WRAITH","20230411","20230501","74841","coupe","4","BLAUW","Niet geregistreerd","12","6592","2335","2810","2435",,,"20140411","20140411","Geen verstrekking in Open Data","399664","Nee",,,,,,,"2","4","0","0",,"527","0","M1",,,"r. voorwielscherm by motorruimte","2810","GHOST FAMILY",,"e11*2007/46*0101*07","XZ01","6A040","0","0.19","311","Nee","Nee",,"Nee","0","0",,"2022","Logisch","00","Ja","2023-04-11T00:00:00.000","2023-05-01T00:00:00.000","2014-04-11T00:00:00.000","2014-04-11T00:00:00.000",,,,,,,,,,,,,,,,,,,,,"G",,,,,,,"https://opendata.rdw.nl/resource/3huj-srit.json","https://opendata.rdw.nl/resource/8ys7-d773.json","https://opendata.rdw.nl/resource/vezc-m2t6.json","https://opendata.rdw.nl/resource/jhie-znh9.json","https://opendata.rdw.nl/resource/kmfi-hrps.json"
"8ZSK13","Personenauto","ROLLS ROYCE","WRAITH","20240320","20230711","76337","coupe","4","BLAUW","Niet geregistreerd","12","6592","2335","2810","2435",,,"20150313","20150313","Geen verstrekking in Open Data","420187","Ja",,,,,,,"2","4","0","0",,"527","0","M1",,,"r. voorwielscherm by motorruimte","2810","GHOST FAMILY",,"e11*2007/46*0101*09","XZ01","6A040000","0","0.19","311","Nee","Nee",,"Nee","0","0",,"2023","Logisch","00","Ja","2024-03-20T00:00:00.000","2023-07-11T00:00:00.000","2015-03-13T00:00:00.000","2015-03-13T00:00:00.000",,,,,,,,,,,,,,,,,,,,,"G",,,,,,,"https://opendata.rdw.nl/resource/3huj-srit.json","https://opendata.rdw.nl/resource/8ys7-d773.json","https://opendata.rdw.nl/resource/vezc-m2t6.json","https://opendata.rdw.nl/resource/jhie-znh9.json","https://opendata.rdw.nl/resource/kmfi-hrps.json"
"9TXB87","Personenauto","ROLLS ROYCE","WRAITH","20250411","20180614","74841","coupe","4","BLAUW","Niet geregistreerd","12","6592","2335","2810","2435",,,"20140530","20140530","Geen verstrekking in Open Data","399936","Ja",,,,,,,"2","4","0","0",,"527","0","M1",,,"r. voorwielscherm by motorruimte","2810","GHOST FAMILY",,"e11*2007/46*0101*08","XZ01","6A040000","0","0.19","311","Nee","Nee",,"Nee","0","0",,"2024","Logisch","00","Ja","2025-04-11T00:00:00.000","2018-06-14T00:00:00.000","2014-05-30T00:00:00.000","2014-05-30T00:00:00.000",,,,,,,,,,,,,,,,,,,,,"G",,,,,,,"https://opendata.rdw.nl/resource/3huj-srit.json","https://opendata.rdw.nl/resource/8ys7-d773.json","https://opendata.rdw.nl/resource/vezc-m2t6.json","https://opendata.rdw.nl/resource/jhie-znh9.json","https://opendata.rdw.nl/resource/kmfi-hrps.json"
"GH600K","Personenauto","ROLLS ROYCE","WRAITH","20240511","20180302","58620","coupe","4","ZWART","GRIJS","12","6592","2335","2810","2435",,,"20140320","20150529","Geen verstrekking in Open Data","421415","Ja",,,,,,,"2","4","0","0",,"527","0","M1",,,"r. voorwielscherm by motorruimte","2810","GHOST FAMILY",,"e11*2007/46*0101*07","XZ01","6A040","0","0.19","311","Nee","Nee",,"Nee","0","0",,"2023","Geen oordeel","05","Ja","2024-05-11T00:00:00.000","2018-03-02T00:00:00.000","2014-03-20T00:00:00.000","2015-05-29T00:00:00.000",,,,,,,,,,,,,,,,,,,,,"G",,,,,,,"https://opendata.rdw.nl/resource/3huj-srit.json","https://opendata.rdw.nl/resource/8ys7-d773.json","https://opendata.rdw.nl/resource/vezc-m2t6.json","https://opendata.rdw.nl/resource/jhie-znh9.json","https://opendata.rdw.nl/resource/kmfi-hrps.json"
"GJ901H","Personenauto","ROLLS ROYCE","WRAITH","20250523","20220310","59383","coupe","4","ZWART","Niet geregistreerd","12","6592","2335","2810","2435",,,"20140924","20150602","Geen verstrekking in Open Data","425431","Ja",,,,,,,"2","4","0","0",,"527","0","M1",,,"r. voorwielscherm by motorruimte","2810","GHOST FAMILY",,"e11*2007/46*0101*09","XZ01","6A040000","0","0.19","311","Nee","Nee",,"Nee","0","0",,"2024","Geen oordeel","05","Ja","2025-05-23T00:00:00.000","2022-03-10T00:00:00.000","2014-09-24T00:00:00.000","2015-06-02T00:00:00.000",,,,,,,,,,,,,,,,,,,,,"G",,,,,,,"https://opendata.rdw.nl/resource/3huj-srit.json","https://opendata.rdw.nl/resource/8ys7-d773.json","https://opendata.rdw.nl/resource/vezc-m2t6.json","https://opendata.rdw.nl/resource/jhie-znh9.json","https://opendata.rdw.nl/resource/kmfi-hrps.json"
"HX630K","Personenauto","ROLLS ROYCE","WRAITH","20240916","20230807","76337","coupe","4","ZWART","Niet geregistreerd","12","6592","2335","2810","2435",,,"20160115","20160115","Geen verstrekking in Open Data","426556","Ja",,,,,,,"2","4","0","0",,"527","0","M1",,,"r. voorwielscherm by motorruimte","2810","GHOST FAMILY",,"e11*2007/46*0101*11","XZ01","6A040000","0","0.19","311","Nee","Nee",,"Nee","0","0","0.00","2023","Logisch","00","Ja","2024-09-16T00:00:00.000","2023-08-07T00:00:00.000","2016-01-15T00:00:00.000","2016-01-15T00:00:00.000",,,,,,,,,,,,,,,,,,,,,"G",,,,,,,"https://opendata.rdw.nl/resource/3huj-srit.json","https://opendata.rdw.nl/resource/8ys7-d773.json","https://opendata.rdw.nl/resource/vezc-m2t6.json","https://opendata.rdw.nl/resource/jhie-znh9.json","https://opendata.rdw.nl/resource/kmfi-hrps.json"
"HZ580L","Personenauto","ROLLS ROYCE","WRAITH","20250301","20240508","86263","coupe","4","ZWART","Niet geregistreerd","12","6592","2335","2810","2435",,,"20160129","20160129","Geen verstrekking in Open Data","425746","Ja",,,,,,,"2","4","0","0",,"527","195","M1",,,"in motorruimte r.","2810","GHOST FAMILY",,"e11*2007/46*0101*09","XZ01","6A040000","0","0.19","311","Nee","Nee",,"Nee","0","0",,"2024","Logisch","00","Ja","2025-03-01T00:00:00.000","2024-05-08T00:00:00.000","2016-01-29T00:00:00.000","2016-01-29T00:00:00.000",,,,,,,,,,,"151",,,,,,,,,,"G",,,,,,,"https://opendata.rdw.nl/resource/3huj-srit.json","https://opendata.rdw.nl/resource/8ys7-d773.json","https://opendata.rdw.nl/resource/vezc-m2t6.json","https://opendata.rdw.nl/resource/jhie-znh9.json","https://opendata.rdw.nl/resource/kmfi-hrps.json"
"K758VL","Personenauto","ROLLS ROYCE","WRAITH","20250622","20210317","84720","coupe","4","ZWART","Niet geregistreerd","12","6592","2335","2810","2435",,,"20170622","20210317","Geen verstrekking in Open Data","374149","Ja","250",,,,,,"2","4",,,,"527","195","M1",,,"r. voorwielscherm by motorruimte","2810","GHOST FAMILY",,"e11*2007/46*0101*12","XZ01","6A040000","0","0.19","311","Nee","Nee",,"Nee",,,,"2023","Geen oordeel","05","Ja","2025-06-22T00:00:00.000","2021-03-17T00:00:00.000","2017-06-22T00:00:00.000","2021-03-17T00:00:00.000",,,,,,,,,,,"151",,,,,,,,,,"G",,,,,,,"https://opendata.rdw.nl/resource/3huj-srit.json","https://opendata.rdw.nl/resource/8ys7-d773.json","https://opendata.rdw.nl/resource/vezc-m2t6.json","https://opendata.rdw.nl/resource/jhie-znh9.json","https://opendata.rdw.nl/resource/kmfi-hrps.json"
"KJ570F","Personenauto","ROLLS ROYCE","WRAITH","20250416","20200929","58894","coupe","4","ZWART","Niet geregistreerd","12","6592","2335","2810","2435",,,"20150901","20160921","Geen verstrekking in Open Data","415267","Ja",,,,,,,"2","4","0","0",,"527","0","M1",,,"r. voorwielscherm by motorruimte","2810","GHOST FAMILY",,"e11*2007/46*0101*06","XZ01","6A040","0","0.19","311","Nee","Nee",,"Nee","0","0",,"2024","Geen oordeel","05","Ja","2025-04-16T00:00:00.000","2020-09-29T00:00:00.000","2015-09-01T00:00:00.000","2016-09-21T00:00:00.000",,,,,,,,,,,,,,,,,,,,,"G",,,,,,,"https://opendata.rdw.nl/resource/3huj-srit.json","https://opendata.rdw.nl/resource/8ys7-d773.json","https://opendata.rdw.nl/resource/vezc-m2t6.json","https://opendata.rdw.nl/resource/jhie-znh9.json","https://opendata.rdw.nl/resource/kmfi-hrps.json"
"L274DV","Personenauto","ROLLS ROYCE","WRAITH","20250426","20210428","77814","coupe","4","ZWART","Niet geregistreerd","12","6592","2335","2810","2435",,,"20150531","20210428","Geen verstrekking in Open Data","382096","Ja","250",,,,,,"2","4","0","0",,"527","195","M1",,,,"2810","GHOST FAMILY",,"e11*2007/46*0101*07","XZ01","6A040","0","0.19","311","Nee","Nee",,"Nee","0","0",,"2024","Geen oordeel","05","Ja","2025-04-26T00:00:00.000","2021-04-28T00:00:00.000","2015-05-31T00:00:00.000","2021-04-28T00:00:00.000",,,,,,,,,,,"151",,,,,,,,,,,,,,,,,"https://opendata.rdw.nl/resource/3huj-srit.json","https://opendata.rdw.nl/resource/8ys7-d773.json","https://opendata.rdw.nl/resource/vezc-m2t6.json","https://opendata.rdw.nl/resource/jhie-znh9.json","https://opendata.rdw.nl/resource/kmfi-hrps.json"
"L780LD","Personenauto","ROLLS ROYCE","WRAITH","20250606","20210621","74827","coupe","4","GRIJS","Niet geregistreerd","12","6592","2335","2810","2435",,,"20140626","20210621","Geen verstrekking in Open Data","360000","Ja","250",,,,,,"2","4","0","0",,"527","195","M1",,,,"2810","GHOST FAMILY",,"e11*2007/46*0101*07","XZ01","6A040","0","0.19","311","Nee","Nee",,"Nee","0","0",,"2024","Geen oordeel","05","Ja","2025-06-06T00:00:00.000","2021-06-21T00:00:00.000","2014-06-26T00:00:00.000","2021-06-21T00:00:00.000",,,,,,,,,,,"151",,,,,,,,,,,,,,,,,"https://opendata.rdw.nl/resource/3huj-srit.json","https://opendata.rdw.nl/resource/8ys7-d773.json","https://opendata.rdw.nl/resource/vezc-m2t6.json","https://opendata.rdw.nl/resource/jhie-znh9.json","https://opendata.rdw.nl/resource/kmfi-hrps.json"
"ND979J","Personenauto","ROLLS ROYCE","WRAITH","20250102","20180825","89131","coupe","4","ZWART","Niet geregistreerd","12","6592","2335","2810","2435",,,"20170102","20170102","Geen verstrekking in Open Data","483000","Ja",,,,,,,"2","4","0","0",,"529","195","M1",,,"in motorruimte r.","2810","GHOST FAMILY",,"e11*2007/46*0101*13","XZ01","6A0400B0","0","0.19","311","Nee","Nee",,"Nee","0","0","0.00","2022","Logisch","00","Ja","2025-01-02T00:00:00.000","2018-08-25T00:00:00.000","2017-01-02T00:00:00.000","2017-01-02T00:00:00.000",,,,,,,,,,,"151",,,,,,,,,,"G",,,,,,,"https://opendata.rdw.nl/resource/3huj-srit.json","https://opendata.rdw.nl/resource/8ys7-d773.json","https://opendata.rdw.nl/resource/vezc-m2t6.json","https://opendata.rdw.nl/resource/jhie-znh9.json","https://opendata.rdw.nl/resource/kmfi-hrps.json"
"NF775R","Personenauto","ROLLS ROYCE","WRAITH","20250103","20210402","86263","coupe","4","ZWART","Niet geregistreerd","12","6592","2335","2810","2435",,,"20170103","20170103","Geen verstrekking in Open Data","452770","Ja",,,,,,,"2","4","0","0",,"529","195","M1",,,"in motorruimte r.","2810","GHOST FAMILY",,"e11*2007/46*0101*13","XZ01","6A040000","0","0.19","311","Nee","Nee",,"Nee","0","0","0.00","2022","Logisch","00","Ja","2025-01-03T00:00:00.000","2021-04-02T00:00:00.000","2017-01-03T00:00:00.000","2017-01-03T00:00:00.000",,,,,,,,,,,"151",,,,,,,,,,"G",,,,,,,"https://opendata.rdw.nl/resource/3huj-srit.json","https://opendata.rdw.nl/resource/8ys7-d773.json","https://opendata.rdw.nl/resource/vezc-m2t6.json","https://opendata.rdw.nl/resource/jhie-znh9.json","https://opendata.rdw.nl/resource/kmfi-hrps.json"
"NJ855V","Personenauto","ROLLS ROYCE","WRAITH","20250215","20240203","88990","coupe","4","BLAUW","Niet geregistreerd","12","6592","2335","2810","2435",,,"20170215","20170215","Geen verstrekking in Open Data","434663","Ja",,,,,,,"2","4","0","0",,"529","195","M1",,,"in motorruimte r.","2810","GHOST FAMILY",,"e11*2007/46*0101*13","XZ01","6A040000","0","0.19","311","Nee","Nee",,"Nee","0","0","0.00","2024","Logisch","00","Ja","2025-02-15T00:00:00.000","2024-02-03T00:00:00.000","2017-02-15T00:00:00.000","2017-02-15T00:00:00.000",,,,,,,,,,,"151",,,,,,,,,,"G",,,,,,,"https://opendata.rdw.nl/resource/3huj-srit.json","https://opendata.rdw.nl/resource/8ys7-d773.json","https://opendata.rdw.nl/resource/vezc-m2t6.json","https://opendata.rdw.nl/resource/jhie-znh9.json","https://opendata.rdw.nl/resource/kmfi-hrps.json"
"NT931L","Personenauto","ROLLS ROYCE","WRAITH","20250426","20170426","88990","coupe","4","ZWART","Niet geregistreerd","12","6592","2335","2810","2435",,,"20170426","20170426","Geen verstrekking in Open Data","453183","Ja",,,,,,,"2","4","0","0",,"529","195","M1",,,"in motorruimte r.","2810","GHOST FAMILY",,"e11*2007/46*0101*13","XZ01","6A040000","0","0.19","311","Nee","Nee",,"Nee","0","0","0.00","2023","Logisch","00","Ja","2025-04-26T00:00:00.000","2017-04-26T00:00:00.000","2017-04-26T00:00:00.000","2017-04-26T00:00:00.000",,,,,,,,,,,"151",,,,,,,,,,"G",,,,,,,"https://opendata.rdw.nl/resource/3huj-srit.json","https://opendata.rdw.nl/resource/8ys7-d773.json","https://opendata.rdw.nl/resource/vezc-m2t6.json","https://opendata.rdw.nl/resource/jhie-znh9.json","https://opendata.rdw.nl/resource/kmfi-hrps.json"
"NX567Z","Personenauto","ROLLS ROYCE","WRAITH","20240906","20170530","70838","coupe","4","ZWART","Niet geregistreerd","12","6592","2335","2810","2435",,,"20140723","20170530","Geen verstrekking in Open Data","360000","Ja",,,,,,,"2","4","0","0",,"527","0","M1",,,"r. voorwielscherm by motorruimte","2810","GHOST FAMILY",,"e11*2007/46*0101*08","XZ01","6A040000","0","0.19","311","Nee","Nee",,"Nee","0","0",,"2023","Geen oordeel","05","Ja","2024-09-06T00:00:00.000","2017-05-30T00:00:00.000","2014-07-23T00:00:00.000","2017-05-30T00:00:00.000",,,,,,,,,,,,,,,,,,,,,"G",,,,,,,"https://opendata.rdw.nl/resource/3huj-srit.json","https://opendata.rdw.nl/resource/8ys7-d773.json","https://opendata.rdw.nl/resource/vezc-m2t6.json","https://opendata.rdw.nl/resource/jhie-znh9.json","https://opendata.rdw.nl/resource/kmfi-hrps.json"
"R359BG","Personenauto","ROLLS ROYCE","WRAITH","20250208","20220713","76335","coupe","4","BLAUW","Niet geregistreerd","12","6592","2335","2810","2435",,,"20150610","20220713","Geen verstrekking in Open Data","353620","Ja","250",,,,,,"2","4","0","0",,"527","195","M1",,,"r. voorwielscherm by motorruimte","2810","GHOST FAMILY",,"e11*2007/46*0101*09","XZ01","6A040000","0","0.19","311","Nee","Nee",,"Nee","0","0",,"2024","Geen oordeel","05","Ja","2025-02-08T00:00:00.000","2022-07-13T00:00:00.000","2015-06-10T00:00:00.000","2022-07-13T00:00:00.000",,,,,,,,,,,"151",,,,,,,,,,,"20220712","2022-07-12T00:00:00.000",,,,,"https://opendata.rdw.nl/resource/3huj-srit.json","https://opendata.rdw.nl/resource/8ys7-d773.json","https://opendata.rdw.nl/resource/vezc-m2t6.json","https://opendata.rdw.nl/resource/jhie-znh9.json","https://opendata.rdw.nl/resource/kmfi-hrps.json"
"T382JK","Personenauto","ROLLS ROYCE","WRAITH","20270624","20230624","107274","coupe","4","GROEN","Niet geregistreerd","12","6592","2395","2810","2495",,,"20230624","20230624","Geen verstrekking in Open Data","561574","Ja","250",,,,,,"4","4",,,,"529","195","M1",,,,"2810","GHOST FAMILY",,"e1*2007/46*1989*05","XZ01","IAW400B0","0","0.18","311","Nee","Nee",,"Nee",,,,"2023","Logisch","00","Ja","2027-06-24T00:00:00.000","2023-06-24T00:00:00.000","2023-06-24T00:00:00.000","2023-06-24T00:00:00.000",,,,,,,,,,,"151",,,,,,,,,,"G","20230623","2023-06-23T00:00:00.000",,,,,"https://opendata.rdw.nl/resource/3huj-srit.json","https://opendata.rdw.nl/resource/8ys7-d773.json","https://opendata.rdw.nl/resource/vezc-m2t6.json","https://opendata.rdw.nl/resource/jhie-znh9.json","https://opendata.rdw.nl/resource/kmfi-hrps.json"
"TT151B","Personenauto","ROLLS ROYCE","WRAITH","20241231","20181102","74841","coupe","4","BLAUW","Niet geregistreerd","12","6592","2335","2810","2435",,,"20140602","20181102","Geen verstrekking in Open Data","395447","Ja",,,,,,,"2","4","0","0",,"527","0","M1",,,"r. voorwielscherm by motorruimte","2810","GHOST FAMILY",,"e11*2007/46*0101*11","XZ01","6A040000","0","0.19","311","Nee","Nee",,"Nee","0","0","0.00","2023","Geen oordeel","05","Ja","2024-12-31T00:00:00.000","2018-11-02T00:00:00.000","2014-06-02T00:00:00.000","2018-11-02T00:00:00.000",,,,,,,,,,,,,,,,,,,,,,,,,,,,"https://opendata.rdw.nl/resource/3huj-srit.json","https://opendata.rdw.nl/resource/8ys7-d773.json","https://opendata.rdw.nl/resource/vezc-m2t6.json","https://opendata.rdw.nl/resource/jhie-znh9.json","https://opendata.rdw.nl/resource/kmfi-hrps.json"
"TX998F","Personenauto","ROLLS ROYCE","WRAITH","20241222","20220414","61607","coupe","4","ZWART","WIT","12","6592","2335","2810","2435",,,"20140415","20181102","Geen verstrekking in Open Data","360037","Ja",,,,,,,"2","4","0","0",,"527","0","M1",,,,"2810","GHOST FAMILY",,"e11*2007/46*0101*08","XZ01","6A040000","0","0.19","311","Nee","Nee",,"Nee","0","0",,"2023","Geen oordeel","05","Ja","2024-12-22T00:00:00.000","2022-04-14T00:00:00.000","2014-04-15T00:00:00.000","2018-11-02T00:00:00.000",,,,,,,,,,,,,,,,,,,,,"G",,,,,,,"https://opendata.rdw.nl/resource/3huj-srit.json","https://opendata.rdw.nl/resource/8ys7-d773.json","https://opendata.rdw.nl/resource/vezc-m2t6.json","https://opendata.rdw.nl/resource/jhie-znh9.json","https://opendata.rdw.nl/resource/kmfi-hrps.json"
"ZD342B","Personenauto","ROLLS ROYCE","WRAITH","20250721","20190425","101880","coupe","4","ZWART","Niet geregistreerd","12","6592","2335","2810","2435",,,"20190425","20190425","Geen verstrekking in Open Data","501920","Ja",,,,,,,"2","4",,,,"527","195","M1",,,,"2810","GHOST FAMILY",,"e11*2007/46*0101*18","XZ01","6AW400B0","0","0.18","311","Nee","Nee",,"Nee",,,,"2023","Logisch","00","Ja","2025-07-21T00:00:00.000","2019-04-25T00:00:00.000","2019-04-25T00:00:00.000","2019-04-25T00:00:00.000",,,,,,,,,,,"151",,,,,,,,,,,,,,,,,"https://opendata.rdw.nl/resource/3huj-srit.json","https://opendata.rdw.nl/resource/8ys7-d773.json","https://opendata.rdw.nl/resource/vezc-m2t6.json","https://opendata.rdw.nl/resource/jhie-znh9.json","https://opendata.rdw.nl/resource/kmfi-hrps.json"
