"kenteken","voertuigsoort","merk","handelsbenaming","vervaldatum_apk","datum_tenaamstelling","bruto_bpm","inrichting","aantal_zitplaatsen","eerste_kleur","tweede_kleur","aantal_cilinders","cilinderinhoud","massa_ledig_voertuig","toegestane_maximum_massa_voertuig","massa_rijklaar","maximum_massa_trekken_ongeremd","maximum_trekken_massa_geremd","datum_eerste_toelating","datum_eerste_tenaamstelling_in_nederland","wacht_op_keuren","catalogusprijs","wam_verzekerd","maximale_constructiesnelheid","laadvermogen","oplegger_geremd","aanhangwagen_autonoom_geremd","aanhangwagen_middenas_geremd","aantal_staanplaatsen","aantal_deuren","aantal_wielen","afstand_hart_koppeling_tot_achterzijde_voertuig","afstand_voorzijde_voertuig_tot_hart_koppeling","afwijkende_maximum_snelheid","lengte","breedte","europese_voertuigcategorie","europese_voertuigcategorie_toevoeging","europese_uitvoeringcategorie_toevoeging","plaats_chassisnummer","technische_max_massa_voertuig","type","type_gasinstallatie","typegoedkeuringsnummer","variant","uitvoering","volgnummer_wijziging_eu_typegoedkeuring","vermogen_massarijklaar","wielbasis","export_indicator","openstaande_terugroepactie_indicator","vervaldatum_tachograaf","taxi_indicator","maximum_massa_samenstelling","aantal_rolstoelplaatsen","maximum_ondersteunende_snelheid","jaar_laatste_registratie_tellerstand","tellerstandoordeel","code_toelichting_tellerstandoordeel","tenaamstellen_mogelijk","vervaldatum_apk_dt","datum_tenaamstelling_dt","datum_eerste_toelating_dt","datum_eerste_tenaamstelling_in_nederland_dt","vervaldatum_tachograaf_dt","maximum_last_onder_de_vooras_sen_tezamen_koppeling","type_remsysteem_voertuig_code","rupsonderstelconfiguratiecode","wielbasis_voertuig_minimum","wielbasis_voertuig_maximum","lengte_voertuig_minimum","lengte_voertuig_maximum","breedte_voertuig_minimum","breedte_voertuig_maximum","hoogte_voertuig","hoogte_voertuig_minimum","hoogte_voertuig_maximum","massa_bedrijfsklaar_minimaal","massa_bedrijfsklaar_maximaal","technisch_toelaatbaar_massa_koppelpunt","maximum_massa_technisch_maximaal","maximum_massa_technisch_minimaal","subcategorie_nederland","verticale_belasting_koppelpunt_getrokken_voertuig","zuinigheidsclassificatie","registratie_datum_goedkeuring_afschrijvingsmoment_bpm","registratie_datum_goedkeuring_afschrijvingsmoment_bpm_dt","gem_lading_wrde","aerodyn_voorz","massa_alt_aandr","verl_cab_ind","api_gekentekende_voertuigen_assen","api_gekentekende_voertuigen_brandstof","api_gekentekende_voertuigen_carrosserie","api_gekentekende_voertuigen_carrosserie_specifiek","api_gekentekende_voertuigen_voertuigklasse"
"00GBL7","Personenauto","RENAULT","MEGANE","20241003","20220830","5324","stationwagen","5","GRIJS","Niet geregistreerd","4","1598","1190","1795","1290","645","1300","20080530","20080530","Geen verstrekking in Open Data",,"Ja",,,,,,,"4","4","0","0",,"450","0","M1",,,"r. in motorruimte op steun","1795",,,"e2*98/14*0272*34","KM1R","KM1R0H","0","0.06","269","Nee","Nee",,"Nee","2800","0","0.00","2023","Logisch","00","Ja","2024-10-03T00:00:00.000","2022-08-30T00:00:00.000","2008-05-30T00:00:00.000","2008-05-30T00:00:00.000",,,,,,,,,,,,,,,,,,,,,"C",,,,,,,"https://opendata.rdw.nl/resource/3huj-srit.json","https://opendata.rdw.nl/resource/8ys7-d773.json","https://opendata.rdw.nl/resource/vezc-m2t6.json","https://opendata.rdw.nl/resource/jhie-znh9.json","https://opendata.rdw.nl/resource/kmfi-hrps.json"
"00GJF5","Personenauto","RENAULT","LAGUNA","20240628","20201205","7627","stationwagen","5","GRIJS","Niet geregistreerd","4","1997","1365","1940","1465","650","1300","20080628","20080628","Geen verstrekking in Open Data",,"Ja",,,,,,,"4","4","0","0",,"480","0","M1",,,"r. tegen schutbord onder motorkap","1940","T",,"e2*2001/116*0363*07","KT0F","KT0F06","0","0.07","276","Nee","Nee",,"Nee","3240","0",,"2023","Logisch","00","Ja","2024-06-28T00:00:00.000","2020-12-05T00:00:00.000","2008-06-28T00:00:00.000","2008-06-28T00:00:00.000",,,,,,,,,,,,,,,,,,,,,"C",,,,,,,"https://opendata.rdw.nl/resource/3huj-srit.json","https://opendata.rdw.nl/resource/8ys7-d773.json","https://opendata.rdw.nl/resource/vezc-m2t6.json","https://opendata.rdw.nl/resource/jhie-znh9.json","https://opendata.rdw.nl/resource/kmfi-hrps.json"
"00GJX5","Personenauto","RENAULT","KOLEOS","20240925","20240501","9516","stationwagen","5","ZWART","Niet geregistreerd","4","2488","1539","2100","1639","750","2000","20080925","20080925","Geen verstrekking in Open Data",,"Ja",,,,,,,"4","4","0","0",,"452","0","M1",,,"op r. voorwielscherm onder motorkap","2100","Y",,"e11*2001/116*0261*00","VY0C","VY0C06","0","0.08","269","Nee","Nee",,"Nee","4100","0","0.00","2024","Logisch","00","Ja","2024-09-25T00:00:00.000","2024-05-01T00:00:00.000","2008-09-25T00:00:00.000","2008-09-25T00:00:00.000",,,,,,,,,,,,,,,,,,,,,"E",,,,,,,"https://opendata.rdw.nl/resource/3huj-srit.json","https://opendata.rdw.nl/resource/8ys7-d773.json","https://opendata.rdw.nl/resource/vezc-m2t6.json","https://opendata.rdw.nl/resource/jhie-znh9.json","https://opendata.rdw.nl/resource/kmfi-hrps.json"
"00GRD4","Personenauto","RENAULT","CLIO","20250215","20230624","3064","stationwagen","5","ROOD","Niet geregistreerd","4","1149","1095","1608","1195","535","1200","20080826","20080826","Geen verstrekking in Open Data",,"Ja",,,,,,,"4","4","0","0",,"420","0","M1",,,"r. in kofferruimte by reservewiel","1608","R",,"e2*2001/116*0327*18","KR1P","KR1P0H","0","0.06","258","Nee","Nee",,"Nee","2500","0",,"2024","Logisch","00","Ja","2025-02-15T00:00:00.000","2023-06-24T00:00:00.000","2008-08-26T00:00:00.000","2008-08-26T00:00:00.000",,,,,,,,,,,,,,,,,,,,,"B",,,,,,,"https://opendata.rdw.nl/resource/3huj-srit.json","https://opendata.rdw.nl/resource/8ys7-d773.json","https://opendata.rdw.nl/resource/vezc-m2t6.json","https://opendata.rdw.nl/resource/jhie-znh9.json","https://opendata.rdw.nl/resource/kmfi-hrps.json"
"00GSF5","Personenauto","RENAULT","CLIO","20250425","20190315","3220","stationwagen","5","BLAUW","Niet geregistreerd","4","1149","1095","1608","1195","535","1200","20080830","20080830","Geen verstrekking in Open Data",,"Ja",,,,,,,"4","4","0","0",,"420","0","M1",,,"r. in kofferruimte by reservewiel","1608","R",,"e2*2001/116*0327*18","KR1P","KR1P0H","0","0.06","258","Nee","Nee",,"Nee","2500","0",,"2024","Logisch","00","Ja","2025-04-25T00:00:00.000","2019-03-15T00:00:00.000","2008-08-30T00:00:00.000","2008-08-30T00:00:00.000",,,,,,,,,,,,,,,,,,,,,"B",,,,,,,"https://opendata.rdw.nl/resource/3huj-srit.json","https://opendata.rdw.nl/resource/8ys7-d773.json","https://opendata.rdw.nl/resource/vezc-m2t6.json","https://opendata.rdw.nl/resource/jhie-znh9.json","https://opendata.rdw.nl/resource/kmfi-hrps.json"
"00GTD1","Personenauto","RENAULT","CLIO","20250402","20150604","4090","stationwagen","5","ROOD","Niet geregistreerd","4","1598","1145","1665","1245","535","1150","20080910","20080910","Geen verstrekking in Open Data",,"Ja",,,,,,,"4","4","0","0",,"420","0","M1",,,"r. in kofferruimte by reservewiel","1665","R",,"e2*2001/116*0327*18","KR1B","KR1B0H","0","0.07","258","Nee","Nee",,"Nee","2550","0",,"2024","Logisch","00","Ja","2025-04-02T00:00:00.000","2015-06-04T00:00:00.000","2008-09-10T00:00:00.000","2008-09-10T00:00:00.000",,,,,,,,,,,,,,,,,,,,,"C",,,,,,,"https://opendata.rdw.nl/resource/3huj-srit.json","https://opendata.rdw.nl/resource/8ys7-d773.json","https://opendata.rdw.nl/resource/vezc-m2t6.json","https://opendata.rdw.nl/resource/jhie-znh9.json","https://opendata.rdw.nl/resource/kmfi-hrps.json"
"00GXK3","Personenauto","RENAULT","MEGANE","20241011","20171012","5233","stationwagen","5","BLAUW","Niet geregistreerd","4","1598","1245","1795","1345","645","1300","20080930","20080930","Geen verstrekking in Open Data",,"Ja",,,,,,,"4","4","0","0",,"450","0","M1",,,"r. in motorruimte op steun","1795","M","G3 gasinstallatie","e2*98/14*0272*35","KM1R","KM1R0H","0","0.06","269","Nee","Nee",,"Nee","2800","0",,"2024","Logisch","00","Ja","2024-10-11T00:00:00.000","2017-10-12T00:00:00.000","2008-09-30T00:00:00.000","2008-09-30T00:00:00.000",,"0",,,,,,,,,,,,,,,,,,,"C",,,,,,,"https://opendata.rdw.nl/resource/3huj-srit.json","https://opendata.rdw.nl/resource/8ys7-d773.json","https://opendata.rdw.nl/resource/vezc-m2t6.json","https://opendata.rdw.nl/resource/jhie-znh9.json","https://opendata.rdw.nl/resource/kmfi-hrps.json"
"00HFH2","Personenauto","RENAULT","CLIO","20241108","20081106","3401","stationwagen","5","GRIJS","Niet geregistreerd","4","1149","1095","1608","1195","535","1200","20081106","20081106","Geen verstrekking in Open Data",,"Ja",,,,,,,"4","4","0","0",,"420","0","M1",,,"r. in kofferruimte by reservewiel","1608",,,"e2*2001/116*0327*16","KR1P","KR1P0H","0","0.06","258","Nee","Nee",,"Nee","2500","0","0.00","2023","Logisch","00","Ja","2024-11-08T00:00:00.000","2008-11-06T00:00:00.000","2008-11-06T00:00:00.000","2008-11-06T00:00:00.000",,,,,,,,,,,,,,,,,,,,,"B",,,,,,,"https://opendata.rdw.nl/resource/3huj-srit.json","https://opendata.rdw.nl/resource/8ys7-d773.json","https://opendata.rdw.nl/resource/vezc-m2t6.json","https://opendata.rdw.nl/resource/jhie-znh9.json","https://opendata.rdw.nl/resource/kmfi-hrps.json"
"00HKD4","Personenauto","RENAULT","KOLEOS","20250226","20150217","9516","stationwagen","5","GRIJS","Niet geregistreerd","4","2488","1539","2100","1639","750","2000","20090206","20090206","Geen verstrekking in Open Data",,"Ja",,,,,,,"4","4","0","0",,"452","0","M1",,,"op r. voorwielscherm onder motorkap","2100","Y",,"e11*2001/116*0261*00","VY0C","VY0C06","0","0.08","269","Nee","Nee",,"Nee","4100","0","0.00","2024","Logisch","00","Ja","2025-02-26T00:00:00.000","2015-02-17T00:00:00.000","2009-02-06T00:00:00.000","2009-02-06T00:00:00.000",,,,,,,,,,,,,,,,,,,,,"E",,,,,,,"https://opendata.rdw.nl/resource/3huj-srit.json","https://opendata.rdw.nl/resource/8ys7-d773.json","https://opendata.rdw.nl/resource/vezc-m2t6.json","https://opendata.rdw.nl/resource/jhie-znh9.json","https://opendata.rdw.nl/resource/kmfi-hrps.json"
"00HPJ8","Personenauto","RENAULT","KANGOO","20250518","20220520","4876","stationwagen","5","BLAUW","Niet geregistreerd","4","1598","1423","1924","1523","736","1050","20090202","20090202","Geen verstrekking in Open Data",,"Ja",,,,,,,"0","4","0","0",,"421","0","M1",,,"r. onder motorkap op schetsplaat","1924","W","G3 gasinstallatie","e2*2001/116*0364*05","KW0D","KW0DB5","0","0.05","270","Nee","Nee",,"Nee","2974","0",,"2024","Logisch","00","Ja","2025-05-18T00:00:00.000","2022-05-20T00:00:00.000","2009-02-02T00:00:00.000","2009-02-02T00:00:00.000",,"0",,,,,,,,,,,,,,,,,,,"D",,,,,,,"https://opendata.rdw.nl/resource/3huj-srit.json","https://opendata.rdw.nl/resource/8ys7-d773.json","https://opendata.rdw.nl/resource/vezc-m2t6.json","https://opendata.rdw.nl/resource/jhie-znh9.json","https://opendata.rdw.nl/resource/kmfi-hrps.json"
"00HSB6","Personenauto","RENAULT","MEGANE","20240511","20240208","6165","stationwagen","5","GROEN","Niet geregistreerd","4","1461","1235","1850","1335","650","1300","20090211","20090211","Geen verstrekking in Open Data",,"Ja",,,,,,,"4","4","0","0",,"450","0","M1",,,"r. in motorruimte op steun","1850","M",,"e2*98/14*0272*37","KMS6","KMS6C6","0","0.06","269","Nee","Nee",,"Nee","2850","0","0.00","2024","Logisch","00","Ja","2024-05-11T00:00:00.000","2024-02-08T00:00:00.000","2009-02-11T00:00:00.000","2009-02-11T00:00:00.000",,,,,,,,,,,,,,,,,,,,,"B",,,,,,,"https://opendata.rdw.nl/resource/3huj-srit.json","https://opendata.rdw.nl/resource/8ys7-d773.json","https://opendata.rdw.nl/resource/vezc-m2t6.json","https://opendata.rdw.nl/resource/jhie-znh9.json","https://opendata.rdw.nl/resource/kmfi-hrps.json"
"00HVZ4","Personenauto","RENAULT","CLIO","20250422","20200812","3473","stationwagen","5","GRIJS","Niet geregistreerd","4","1149","1095","1608","1195","535","1200","20090319","20090319","Geen verstrekking in Open Data",,"Ja",,,,,,,"4","4","0","0",,"0","0","M1",,,"r. in kofferruimte by reservewiel","1608","R",,"e2*2001/116*0327*21","KR1P","KR1P0H","0","0.06","258","Nee","Nee",,"Nee","2500","0",,"2024","Logisch","00","Ja","2025-04-22T00:00:00.000","2020-08-12T00:00:00.000","2009-03-19T00:00:00.000","2009-03-19T00:00:00.000",,,,,,,,,,,,,,,,,,,,,"B",,,,,,,"https://opendata.rdw.nl/resource/3huj-srit.json","https://opendata.rdw.nl/resource/8ys7-d773.json","https://opendata.rdw.nl/resource/vezc-m2t6.json","https://opendata.rdw.nl/resource/jhie-znh9.json","https://opendata.rdw.nl/resource/kmfi-hrps.json"
"00HXH2","Personenauto","RENAULT","CLIO","20241001","20151005","2947","stationwagen","5","GRIJS","Niet geregistreerd","4","1149","1095","1608","1195","535","1200","20090326","20090326","Geen verstrekking in Open Data",,"Ja",,,,,,,"4","4","0","0",,"0","0","M1",,,"r. in kofferruimte by reservewiel","1608","R",,"e2*2001/116*0327*21","KR1P","KR1P0H","0","0.06","258","Nee","Nee",,"Nee","2500","0",,"2023","Logisch","00","Ja","2024-10-01T00:00:00.000","2015-10-05T00:00:00.000","2009-03-26T00:00:00.000","2009-03-26T00:00:00.000",,,,,,,,,,,,,,,,,,,,,"B",,,,,,,"https://opendata.rdw.nl/resource/3huj-srit.json","https://opendata.rdw.nl/resource/8ys7-d773.json","https://opendata.rdw.nl/resource/vezc-m2t6.json","https://opendata.rdw.nl/resource/jhie-znh9.json","https://opendata.rdw.nl/resource/kmfi-hrps.json"
"00HZF2","Personenauto","RENAULT","LAGUNA","20240828","20200829","8514","stationwagen","5","GRIJS","Niet geregistreerd","4","1997","1365","1940","1465","650","1300","20090331","20090331","Geen verstrekking in Open Data",,"Ja",,,,,,,"4","4","0","0",,"480","0","M1",,,"r. tegen schutbord onder motorkap","1940","T",,"e2*2001/116*0363*03","KTEF","KTEF06","0","0.07","276","Nee","Nee",,"Nee","3240","0","0.00","2023","Logisch","00","Ja","2024-08-28T00:00:00.000","2020-08-29T00:00:00.000","2009-03-31T00:00:00.000","2009-03-31T00:00:00.000",,,,,,,,,,,,,,,,,,,,,"C",,,,,,,"https://opendata.rdw.nl/resource/3huj-srit.json","https://opendata.rdw.nl/resource/8ys7-d773.json","https://opendata.rdw.nl/resource/vezc-m2t6.json","https://opendata.rdw.nl/resource/jhie-znh9.json","https://opendata.rdw.nl/resource/kmfi-hrps.json"
"00JHD3","Personenauto","RENAULT","KANGOO","20240905","20150723","3467","stationwagen","5","GRIJS","Niet geregistreerd","4","1598","1139","1645","1239","595","1150","20030605","20090525","Geen verstrekking in Open Data",,"Ja",,,,,,,"4","4","0","0",,"0","0","M1",,,"op bodemplaat by r. voorzitting","1645",,"G3 gasinstallatie","e2*98/14*0164*28","KC0S","KC0SAA","0","0.06","260","Nee","Nee",,"Nee","2500","0",,"2023","Geen oordeel","05","Ja","2024-09-05T00:00:00.000","2015-07-23T00:00:00.000","2003-06-05T00:00:00.000","2009-05-25T00:00:00.000",,"0",,,,,,,,,,,,,,,,,,,"E",,,,,,,"https://opendata.rdw.nl/resource/3huj-srit.json","https://opendata.rdw.nl/resource/8ys7-d773.json","https://opendata.rdw.nl/resource/vezc-m2t6.json","https://opendata.rdw.nl/resource/jhie-znh9.json","https://opendata.rdw.nl/resource/kmfi-hrps.json"
"00JLN8","Personenauto","RENAULT","LAGUNA","20240728","20150710","10684","stationwagen","5","GRIJS","Niet geregistreerd","4","1998","1463","2038","1563","650","1300","20090630","20090630","Geen verstrekking in Open Data",,"Ja",,,,,,,"4","4","0","0",,"480","0","M1",,,"r. tegen schutbord onder motorkap","2038","T",,"e2*2001/116*0363*09","KTEH","KTEH0E","0","0.08","276","Nee","Nee",,"Nee","3338","0",,"2023","Logisch","00","Ja","2024-07-28T00:00:00.000","2015-07-10T00:00:00.000","2009-06-30T00:00:00.000","2009-06-30T00:00:00.000",,,,,,,,,,,,,,,,,,,,,"D",,,,,,,"https://opendata.rdw.nl/resource/3huj-srit.json","https://opendata.rdw.nl/resource/8ys7-d773.json","https://opendata.rdw.nl/resource/vezc-m2t6.json","https://opendata.rdw.nl/resource/jhie-znh9.json","https://opendata.rdw.nl/resource/kmfi-hrps.json"
"00JNH3","Personenauto","RENAULT","CLIO","20240726","20200717","4126","stationwagen","5","ZWART","Niet geregistreerd","4","1598","1187","1665","1287","535","1150","20090708","20090708","Geen verstrekking in Open Data",,"Ja",,,,,,,"4","4","0","0",,"0","0","M1",,,"r. in kofferruimte by reservewiel","1665","R","G3 gasinstallatie","e2*2001/116*0327*24","KRA0","KRA006","0","0.07","258","Nee","Nee",,"Nee","2550","0",,"2023","Logisch","00","Ja","2024-07-26T00:00:00.000","2020-07-17T00:00:00.000","2009-07-08T00:00:00.000","2009-07-08T00:00:00.000",,"0",,,,,,,,,,,,,,,,,,,"C",,,,,,,"https://opendata.rdw.nl/resource/3huj-srit.json","https://opendata.rdw.nl/resource/8ys7-d773.json","https://opendata.rdw.nl/resource/vezc-m2t6.json","https://opendata.rdw.nl/resource/jhie-znh9.json","https://opendata.rdw.nl/resource/kmfi-hrps.json"
"00JVF5","Personenauto","RENAULT","KANGOO","20241003","20220509","3311","stationwagen","5","GRIJS","Niet geregistreerd","4","1598","1095","1645","1195","595","1150","20030625","20090909","Geen verstrekking in Open Data",,"Ja",,,,,,,"4","4","0","0",,"0","0","M1",,,"op bodemplaat by r. voorzitting","1645",,,"e2*98/14*0164*29","KC0S","KC0SAA","0","0.06","260","Nee","Nee",,"Nee","2500","0",,"2023","Geen oordeel","05","Ja","2024-10-03T00:00:00.000","2022-05-09T00:00:00.000","2003-06-25T00:00:00.000","2009-09-09T00:00:00.000",,,,,,,,,,,,,,,,,,,,,"E",,,,,,,"https://opendata.rdw.nl/resource/3huj-srit.json","https://opendata.rdw.nl/resource/8ys7-d773.json","https://opendata.rdw.nl/resource/vezc-m2t6.json","https://opendata.rdw.nl/resource/jhie-znh9.json","https://opendata.rdw.nl/resource/kmfi-hrps.json"
"00KBK8","Personenauto","RENAULT","CLIO","20241019","20201027","2249","stationwagen","5","WIT","Niet geregistreerd","4","1149","1085","1598","1185","535","1200","20091009","20091009","Geen verstrekking in Open Data",,"Ja",,,,,,,"4","4","0","0",,"0","0","M1",,,"r. in kofferruimte by reservewiel","1598","R",,"e2*2001/116*0327*27","KR1J","KR1J0H","0","0.05","258","Nee","Nee",,"Nee","2500","0",,"2023","Logisch","00","Ja","2024-10-19T00:00:00.000","2020-10-27T00:00:00.000","2009-10-09T00:00:00.000","2009-10-09T00:00:00.000",,,,,,,,,,,,,,,,,,,,,"B",,,,,,,"https://opendata.rdw.nl/resource/3huj-srit.json","https://opendata.rdw.nl/resource/8ys7-d773.json","https://opendata.rdw.nl/resource/vezc-m2t6.json","https://opendata.rdw.nl/resource/jhie-znh9.json","https://opendata.rdw.nl/resource/kmfi-hrps.json"
"00KBT4","Personenauto","RENAULT","CLIO","20240804","20230113","2185","stationwagen","5","ROOD","Niet geregistreerd","4","1149","1085","1598","1185","535","1200","20091019","20091019","Geen verstrekking in Open Data",,"Ja",,,,,,,"4","4","0","0",,"0","0","M1",,,"r. in kofferruimte by reservewiel","1598","R",,"e2*2001/116*0327*27","KR1J","KR1J0H","0","0.05","258","Nee","Nee",,"Nee","2500","0",,"2023","Logisch","00","Ja","2024-08-04T00:00:00.000","2023-01-13T00:00:00.000","2009-10-19T00:00:00.000","2009-10-19T00:00:00.000",,,,,,,,,,,,,,,,,,,,,"B",,,,,,,"https://opendata.rdw.nl/resource/3huj-srit.json","https://opendata.rdw.nl/resource/8ys7-d773.json","https://opendata.rdw.nl/resource/vezc-m2t6.json","https://opendata.rdw.nl/resource/jhie-znh9.json","https://opendata.rdw.nl/resource/kmfi-hrps.json"
"00KDL8","Personenauto","RENAULT","MEGANE","20250403","20200803","5706","stationwagen","5","GRIJS","Niet geregistreerd","4","1397","1215","1790","1315","657","1300","20091021","20091021","Geen verstrekking in Open Data",,"Ja",,,,,,,"4","4","0","0",,"456","0","M1",,,"r. deurstyl","1790","Z",,"e2*2001/116*0373*08","KZ1V","KZ1V06","0","0.07","270","Nee","Nee",,"Nee","3090","0",,"2024","Logisch","00","Ja","2025-04-03T00:00:00.000","2020-08-03T00:00:00.000","2009-10-21T00:00:00.000","2009-10-21T00:00:00.000",,,,,,,,,,,,,,,,,,,,,"B",,,,,,,"https://opendata.rdw.nl/resource/3huj-srit.json","https://opendata.rdw.nl/resource/8ys7-d773.json","https://opendata.rdw.nl/resource/vezc-m2t6.json","https://opendata.rdw.nl/resource/jhie-znh9.json","https://opendata.rdw.nl/resource/kmfi-hrps.json"
"00KDS4","Personenauto","RENAULT","MEGANE","20250104","20230107","3974","stationwagen","5","ZWART","Niet geregistreerd","4","1598","1240","1770","1340","670","1300","20091023","20091023","Geen verstrekking in Open Data",,"Ja",,,,,,,"4","4","0","0",,"456","0","M1",,,"r. deurstyl","1770","Z",,"e2*2001/116*0373*09","KZ0H","KZ0H05","0","0.06","270","Nee","Nee",,"Nee","3070","0",,"2023","Logisch","00","Ja","2025-01-04T00:00:00.000","2023-01-07T00:00:00.000","2009-10-23T00:00:00.000","2009-10-23T00:00:00.000",,,,,,,,,,,,,,,,,,,,,"B",,,,,,,"https://opendata.rdw.nl/resource/3huj-srit.json","https://opendata.rdw.nl/resource/8ys7-d773.json","https://opendata.rdw.nl/resource/vezc-m2t6.json","https://opendata.rdw.nl/resource/jhie-znh9.json","https://opendata.rdw.nl/resource/kmfi-hrps.json"
"00KFZ2","Personenauto","RENAULT","CLIO","20250121","20200125","2708","stationwagen","5","GRIJS","Niet geregistreerd","4","1149","1095","1608","1195","535","1200","20091110","20091110","Geen verstrekking in Open Data",,"Ja",,,,,,,"4","4","0","0",,"0","0","M1",,,"r. in kofferruimte by reservewiel","1608","R",,"e2*2001/116*0327*27","KR1P","KR1P0H","0","0.06","258","Nee","Nee",,"Nee","2500","0",,"2024","Logisch","00","Ja","2025-01-21T00:00:00.000","2020-01-25T00:00:00.000","2009-11-10T00:00:00.000","2009-11-10T00:00:00.000",,,,,,,,,,,,,,,,,,,,,"B",,,,,,,"https://opendata.rdw.nl/resource/3huj-srit.json","https://opendata.rdw.nl/resource/8ys7-d773.json","https://opendata.rdw.nl/resource/vezc-m2t6.json","https://opendata.rdw.nl/resource/jhie-znh9.json","https://opendata.rdw.nl/resource/kmfi-hrps.json"
"00KGL1","Personenauto","RENAULT","CLIO","20241118","20180301","2595","stationwagen","5","BLAUW","Niet geregistreerd","4","1149","1095","1608","1195","535","1200","20091112","20091112","Geen verstrekking in Open Data",,"Ja",,,,,,,"4","4","0","0",,"0","0","M1",,,"r. in kofferruimte by reservewiel","1608","R",,"e2*2001/116*0327*27","KR1P","KR1P0H","0","0.06","258","Nee","Nee",,"Nee","2500","0",,"2023","Logisch","00","Ja","2024-11-18T00:00:00.000","2018-03-01T00:00:00.000","2009-11-12T00:00:00.000","2009-11-12T00:00:00.000",,,,,,,,,,,,,,,,,,,,,"B",,,,,,,"https://opendata.rdw.nl/resource/3huj-srit.json","https://opendata.rdw.nl/resource/8ys7-d773.json","https://opendata.rdw.nl/resource/vezc-m2t6.json","https://opendata.rdw.nl/resource/jhie-znh9.json","https://opendata.rdw.nl/resource/kmfi-hrps.json"
"00KGS7","Personenauto","RENAULT","CLIO","20241115","20231002","2923","stationwagen","5","GROEN","Niet geregistreerd","4","1149","1095","1608","1195","535","1200","20091114","20091114","Geen verstrekking in Open Data",,"Ja",,,,,,,"4","4","0","0",,"0","0","M1",,,"r. in kofferruimte by reservewiel","1608","R",,"e2*2001/116*0327*27","KR1P","KR1P0H","0","0.06","258","Nee","Nee",,"Nee","2500","0",,"2023","Logisch","00","Ja","2024-11-15T00:00:00.000","2023-10-02T00:00:00.000","2009-11-14T00:00:00.000","2009-11-14T00:00:00.000",,,,,,,,,,,,,,,,,,,,,"B",,,,,,,"https://opendata.rdw.nl/resource/3huj-srit.json","https://opendata.rdw.nl/resource/8ys7-d773.json","https://opendata.rdw.nl/resource/vezc-m2t6.json","https://opendata.rdw.nl/resource/jhie-znh9.json","https://opendata.rdw.nl/resource/kmfi-hrps.json"
"00KHP7","Personenauto","RENAULT","AVANTIME","20160622","20240115","4284","stationwagen","5","BLAUW","Niet geregistreerd","6","2946","1716","2300","1816","750","2000","20020326","20091125","Geen verstrekking in Open Data",,"Nee",,,,,,,"2","4","0","0",,"464","0","M1",,,"r. tegen schutbord onder motorkap","2300",,,"e2*98/14*0247*02","DE0T","DE0T06","0","0.08","270","Nee","Nee",,"Nee","3890","0",,"2023","Geen oordeel","05","Ja","2016-06-22T00:00:00.000","2024-01-15T00:00:00.000","2002-03-26T00:00:00.000","2009-11-25T00:00:00.000",,,,,,,,,,,,,,,,,,,,,"F",,,,,,,"https://opendata.rdw.nl/resource/3huj-srit.json","https://opendata.rdw.nl/resource/8ys7-d773.json","https://opendata.rdw.nl/resource/vezc-m2t6.json","https://opendata.rdw.nl/resource/jhie-znh9.json","https://opendata.rdw.nl/resource/kmfi-hrps.json"