"kenteken","voertuigsoort","merk","handelsbenaming","vervaldatum_apk","datum_tenaamstelling","bruto_bpm","inrichting","aantal_zitplaatsen","eerste_kleur","tweede_kleur","aantal_cilinders","cilinderinhoud","massa_ledig_voertuig","toegestane_maximum_massa_voertuig","massa_rijklaar","maximum_massa_trekken_ongeremd","maximum_trekken_massa_geremd","datum_eerste_toelating","datum_eerste_tenaamstelling_in_nederland","wacht_op_keuren","catalogusprijs","wam_verzekerd","maximale_constructiesnelheid","laadvermogen","oplegger_geremd","aanhangwagen_autonoom_geremd","aanhangwagen_middenas_geremd","aantal_staanplaatsen","aantal_deuren","aantal_wielen","afstand_hart_koppeling_tot_achterzijde_voertuig","afstand_voorzijde_voertuig_tot_hart_koppeling","afwijkende_maximum_snelheid","lengte","breedte","europese_voertuigcategorie","europese_voertuigcategorie_toevoeging","europese_uitvoeringcategorie_toevoeging","plaats_chassisnummer","technische_max_massa_voertuig","type","type_gasinstallatie","typegoedkeuringsnummer","variant","uitvoering","volgnummer_wijziging_eu_typegoedkeuring","vermogen_massarijklaar","wielbasis","export_indicator","openstaande_terugroepactie_indicator","vervaldatum_tachograaf","taxi_indicator","maximum_massa_samenstelling","aantal_rolstoelplaatsen","maximum_ondersteunende_snelheid","jaar_laatste_registratie_tellerstand","tellerstandoordeel","code_toelichting_tellerstandoordeel","tenaamstellen_mogelijk","vervaldatum_apk_dt","datum_tenaamstelling_dt","datum_eerste_toelating_dt","datum_eerste_tenaamstelling_in_nederland_dt","vervaldatum_tachograaf_dt","maximum_last_onder_de_vooras_sen_tezamen_koppeling","type_remsysteem_voertuig_code","rupsonderstelconfiguratiecode","wielbasis_voertuig_minimum","wielbasis_voertuig_maximum","lengte_voertuig_minimum","lengte_voertuig_maximum","breedte_voertuig_minimum","breedte_voertuig_maximum","hoogte_voertuig","hoogte_voertuig_minimum","hoogte_voertuig_maximum","massa_bedrijfsklaar_minimaal","massa_bedrijfsklaar_maximaal","technisch_toelaatbaar_massa_koppelpunt","maximum_massa_technisch_maximaal","maximum_massa_technisch_minimaal","subcategorie_nederland","verticale_belasting_koppelpunt_getrokken_voertuig","zuinigheidsclassificatie","registratie_datum_goedkeuring_afschrijvingsmoment_bpm","registratie_datum_goedkeuring_afschrijvingsmoment_bpm_dt","gem_lading_wrde","aerodyn_voorz","massa_alt_aandr","verl_cab_ind","api_gekentekende_voertuigen_assen","api_gekentekende_voertuigen_brandstof","api_gekentekende_voertuigen_carrosserie","api_gekentekende_voertuigen_carrosserie_specifiek","api_gekentekende_voertuigen_voertuigklasse"
"7XPG60","Personenauto","RENAULT","CAPTUR","20250127","20190123","2375","MPV","5","BLAUW","Niet geregistreerd","3","898","1076","1658","1176","585","1200","20130814","20140930","Geen verstrekking in Open Data","20210","Ja",,,,,,,"4","4",,,,,,"M1",,,"r. bodemplaat kofferruimte","1658",,,,,,,"0.06","260","Nee","Nee",,"Nee","2588",,,"2024","Geen oordeel","05","Ja","2025-01-27T00:00:00.000","2019-01-23T00:00:00.000","2013-08-14T00:00:00.000","2014-09-30T00:00:00.000",,"0",,,,,,,,,,,,,,,,,,,,,,,,,,"https://opendata.rdw.nl/resource/3huj-srit.json","https://opendata.rdw.nl/resource/8ys7-d773.json","https://opendata.rdw.nl/resource/vezc-m2t6.json","https://opendata.rdw.nl/resource/jhie-znh9.json","https://opendata.rdw.nl/resource/kmfi-hrps.json"
"7ZPK74","Personenauto","RENAULT","CAPTUR","20241125","20201015","2375","MPV","5","BLAUW","Niet geregistreerd","3","898","1081","1658","1181","585","1200","20131125","20150221","Geen verstrekking in Open Data","20405","Ja",,,,,,,"4","4",,,,,,"M1",,,"a. kofferruimte","1658",,,,,,,"0.06","261","Nee","Nee",,"Nee",,,,"2023","Geen oordeel","05","Ja","2024-11-25T00:00:00.000","2020-10-15T00:00:00.000","2013-11-25T00:00:00.000","2015-02-21T00:00:00.000",,,,,,,,,,,,,,,,,,,,,,,,,,,,"https://opendata.rdw.nl/resource/3huj-srit.json","https://opendata.rdw.nl/resource/8ys7-d773.json","https://opendata.rdw.nl/resource/vezc-m2t6.json","https://opendata.rdw.nl/resource/jhie-znh9.json","https://opendata.rdw.nl/resource/kmfi-hrps.json"
"G111RH","Personenauto","RENAULT","CAPTUR","20241113","20191116","467","MPV","5","ORANJE","Niet geregistreerd","3","898","1188","1658","1288","585","1200","20140613","20191111","Geen verstrekking in Open Data","17480","Ja",,,,,,,"4","4",,,,,,"M1",,,"by kofferruimte","1658",,,,,,,"0.05","261","Nee","Nee",,"Nee","2558",,,"2023","Geen oordeel","05","Ja","2024-11-13T00:00:00.000","2019-11-16T00:00:00.000","2014-06-13T00:00:00.000","2019-11-11T00:00:00.000",,,,,,,,,,,,,,,,,,,,,,,,,,,,"https://opendata.rdw.nl/resource/3huj-srit.json","https://opendata.rdw.nl/resource/8ys7-d773.json","https://opendata.rdw.nl/resource/vezc-m2t6.json","https://opendata.rdw.nl/resource/jhie-znh9.json","https://opendata.rdw.nl/resource/kmfi-hrps.json"
"G138DP","Personenauto","RENAULT","CAPTUR","20250302","20210306","15839","MPV","5","ZWART","Niet geregistreerd","4","1598","1230","1744","1330",,,"20171210","20190830","Geen verstrekking in Open Data","39226","Ja",,,,,,,"4","4",,,,,,"M1",,,"a. kofferruimte","1744",,,,,,,"0.06","262","Nee","Nee",,"Nee",,,,"2023","Geen oordeel","05","Ja","2025-03-02T00:00:00.000","2021-03-06T00:00:00.000","2017-12-10T00:00:00.000","2019-08-30T00:00:00.000",,,,,,,,,,,,,,,,,,,,,,,,,,,,"https://opendata.rdw.nl/resource/3huj-srit.json","https://opendata.rdw.nl/resource/8ys7-d773.json","https://opendata.rdw.nl/resource/vezc-m2t6.json","https://opendata.rdw.nl/resource/jhie-znh9.json","https://opendata.rdw.nl/resource/kmfi-hrps.json"
"G261BZ","Personenauto","RENAULT","CAPTUR","20250210","20200214","1151","MPV","5","ORANJE","ZWART","4","1197","1260","1726","1360",,,"20160606","20200214","Geen verstrekking in Open Data","28230","Ja","192",,,,,,"4","4",,,,,,"M1",,,,"1726","R",,,,,,"0.06","261","Nee","Nee",,"Nee",,,,"2024","Geen oordeel","05","Ja","2025-02-10T00:00:00.000","2020-02-14T00:00:00.000","2016-06-06T00:00:00.000","2020-02-14T00:00:00.000",,,,,,,,,,,,,,,,,,,,,,,,,,,,"https://opendata.rdw.nl/resource/3huj-srit.json","https://opendata.rdw.nl/resource/8ys7-d773.json","https://opendata.rdw.nl/resource/vezc-m2t6.json","https://opendata.rdw.nl/resource/jhie-znh9.json","https://opendata.rdw.nl/resource/kmfi-hrps.json"
"GT175X","Personenauto","RENAULT","CAPTUR","20240720","20190426","2719","MPV","5","BLAUW","Niet geregistreerd","3","898","1076","1658","1176","585","1200","20140709","20150821","Geen verstrekking in Open Data","20990","Ja",,,,,,,"4","4",,,,,,"M1",,,"r. kofferruimte","1658",,,,,,,"0.06","261","Nee","Nee",,"Nee",,,,"2023","Geen oordeel","05","Ja","2024-07-20T00:00:00.000","2019-04-26T00:00:00.000","2014-07-09T00:00:00.000","2015-08-21T00:00:00.000",,,,,,,,,,,,,,,,,,,,,,,,,,,,"https://opendata.rdw.nl/resource/3huj-srit.json","https://opendata.rdw.nl/resource/8ys7-d773.json","https://opendata.rdw.nl/resource/vezc-m2t6.json","https://opendata.rdw.nl/resource/jhie-znh9.json","https://opendata.rdw.nl/resource/kmfi-hrps.json"
"H657GB","Personenauto","RENAULT","CAPTUR","20250329","20200225","2438","MPV","5","GRIJS","Niet geregistreerd","4","1197","1130","1693","1230",,"900","20170329","20200204","Geen verstrekking in Open Data","24659","Ja",,,,,,,"4","4",,,,,,"M1",,,"r. bodemplaat by kofferruimte","1693",,,,,,,"0.07","262","Nee","Nee",,"Nee","2593",,,"2023","Geen oordeel","05","Ja","2025-03-29T00:00:00.000","2020-02-25T00:00:00.000","2017-03-29T00:00:00.000","2020-02-04T00:00:00.000",,,,,,,,,,,,,,,,,,,,,,,,,,,,"https://opendata.rdw.nl/resource/3huj-srit.json","https://opendata.rdw.nl/resource/8ys7-d773.json","https://opendata.rdw.nl/resource/vezc-m2t6.json","https://opendata.rdw.nl/resource/jhie-znh9.json","https://opendata.rdw.nl/resource/kmfi-hrps.json"
"H687TH","Personenauto","RENAULT","CAPTUR","20240512","20210904","12987","MPV","5","WIT","ZWART","4","1199","1148","1744","1248",,,"20170228","20200513","Geen verstrekking in Open Data","44285","Ja",,,,,,,"4","4",,,,,,"M1",,,"r. bodemplaat by kofferruimte","1744",,,,,,,"0.07","261","Nee","Nee",,"Nee",,,,"2022","Geen oordeel","05","Ja","2024-05-12T00:00:00.000","2021-09-04T00:00:00.000","2017-02-28T00:00:00.000","2020-05-13T00:00:00.000",,,,,,,,,,,,,,,,,,,,,,,,,,,,"https://opendata.rdw.nl/resource/3huj-srit.json","https://opendata.rdw.nl/resource/8ys7-d773.json","https://opendata.rdw.nl/resource/vezc-m2t6.json","https://opendata.rdw.nl/resource/jhie-znh9.json","https://opendata.rdw.nl/resource/kmfi-hrps.json"
"HJ720P","Personenauto","RENAULT","CAPTUR","20240818","20220824","4247","MPV","5","ZWART","ORANJE","4","1197","1155","1726","1255",,"900","20150205","20151112","Geen verstrekking in Open Data","24680","Ja",,,,,,,"4","4",,,,,,"M1",,,"bodemplaat kofferruimte","1726",,,,,,,"0.07","261","Nee","Nee",,"Nee","2626",,,"2024","Geen oordeel","05","Ja","2024-08-18T00:00:00.000","2022-08-24T00:00:00.000","2015-02-05T00:00:00.000","2015-11-12T00:00:00.000",,,,,,,,,,,,,,,,,,,,,,,,,,,,"https://opendata.rdw.nl/resource/3huj-srit.json","https://opendata.rdw.nl/resource/8ys7-d773.json","https://opendata.rdw.nl/resource/vezc-m2t6.json","https://opendata.rdw.nl/resource/jhie-znh9.json","https://opendata.rdw.nl/resource/kmfi-hrps.json"
"HJ765F","Personenauto","RENAULT","CAPTUR","20240921","20190928","4173","MPV","5","BLAUW","Niet geregistreerd","3","1197","1155","1726","1255","625","1200","20150220","20160423","Geen verstrekking in Open Data","24480","Ja",,,,,,,"4","4",,,,,,"M1",,,"r. kofferruimte","1726",,,,,,,"0.07","261","Nee","Nee",,"Nee","2626",,,"2023","Geen oordeel","05","Ja","2024-09-21T00:00:00.000","2019-09-28T00:00:00.000","2015-02-20T00:00:00.000","2016-04-23T00:00:00.000",,,,,,,,,,,,,,,,,,,,,,,,,,,,"https://opendata.rdw.nl/resource/3huj-srit.json","https://opendata.rdw.nl/resource/8ys7-d773.json","https://opendata.rdw.nl/resource/vezc-m2t6.json","https://opendata.rdw.nl/resource/jhie-znh9.json","https://opendata.rdw.nl/resource/kmfi-hrps.json"
"J515JX","Personenauto","RENAULT","CAPTUR","20240824","20200828","2756","MPV","5","ORANJE","Niet geregistreerd","4","1197","1260","1726","1360",,,"20160329","20200828","Geen verstrekking in Open Data","28493","Ja","192",,,,,,"4","4",,,,,,"M1",,,,"1726","R",,,,,,"0.06","262","Nee","Nee",,"Nee",,,,"2024","Geen oordeel","05","Ja","2024-08-24T00:00:00.000","2020-08-28T00:00:00.000","2016-03-29T00:00:00.000","2020-08-28T00:00:00.000",,,,,,,,,,,,,,,,,,,,,,,,,,,,"https://opendata.rdw.nl/resource/3huj-srit.json","https://opendata.rdw.nl/resource/8ys7-d773.json","https://opendata.rdw.nl/resource/vezc-m2t6.json","https://opendata.rdw.nl/resource/jhie-znh9.json","https://opendata.rdw.nl/resource/kmfi-hrps.json"
"JL890Z","Personenauto","RENAULT","CAPTUR","20250610","20160510","2375","MPV","5","WIT","Niet geregistreerd","3","898","1076","1658","1176","585","1200","20131206","20160510","Geen verstrekking in Open Data","18115","Ja",,,,,,,"4","4",,,,,,"M1",,,"r. kofferruimte by bodemplaat","1658","R",,,,,,"0.06","262","Nee","Nee",,"Nee","2558",,,"2024","Geen oordeel","05","Ja","2025-06-10T00:00:00.000","2016-05-10T00:00:00.000","2013-12-06T00:00:00.000","2016-05-10T00:00:00.000",,,,,,,,,,,,,,,,,,,,,,,,,,,,"https://opendata.rdw.nl/resource/3huj-srit.json","https://opendata.rdw.nl/resource/8ys7-d773.json","https://opendata.rdw.nl/resource/vezc-m2t6.json","https://opendata.rdw.nl/resource/jhie-znh9.json","https://opendata.rdw.nl/resource/kmfi-hrps.json"
"KF299R","Personenauto","RENAULT","CAPTUR","20250225","20161019","3719","MPV","5","ROOD","Niet geregistreerd","3","898","1076","1658","1176","585","1200","20150225","20161019","Geen verstrekking in Open Data","23770","Ja",,,,,,,"4","4",,,,,,"M1",,,"r. kofferruimte by bodemplaat","1658","R",,,,,,"0.06","261","Nee","Nee",,"Nee","2558",,,"2024","Geen oordeel","05","Ja","2025-02-25T00:00:00.000","2016-10-19T00:00:00.000","2015-02-25T00:00:00.000","2016-10-19T00:00:00.000",,,,,,,,,,,,,,,,,,,,,,,,,,,,"https://opendata.rdw.nl/resource/3huj-srit.json","https://opendata.rdw.nl/resource/8ys7-d773.json","https://opendata.rdw.nl/resource/vezc-m2t6.json","https://opendata.rdw.nl/resource/jhie-znh9.json","https://opendata.rdw.nl/resource/kmfi-hrps.json"
"KL067T","Personenauto","RENAULT","CAPTUR","20250425","20231117","1037","MPV","5","BRUIN","ZWART","4","1197","1260","1726","1360",,,"20160603","20170503","Geen verstrekking in Open Data","28231","Ja",,,,,,,"4","4",,,,,,"M1",,,"r. op bodemplaat in kofferruimte","1726","R",,,,,,"0.06","260","Nee","Nee",,"Nee",,,,"2024","Geen oordeel","05","Ja","2025-04-25T00:00:00.000","2023-11-17T00:00:00.000","2016-06-03T00:00:00.000","2017-05-03T00:00:00.000",,,,,,,,,,,,,,,,,,,,,,,,,,,,"https://opendata.rdw.nl/resource/3huj-srit.json","https://opendata.rdw.nl/resource/8ys7-d773.json","https://opendata.rdw.nl/resource/vezc-m2t6.json","https://opendata.rdw.nl/resource/jhie-znh9.json","https://opendata.rdw.nl/resource/kmfi-hrps.json"
"L083PN","Personenauto","RENAULT","CAPTUR","20250709","20210710","2438","MPV","5","WIT","Niet geregistreerd","3","898","1073","1659","1173","586","1200","20190709","20210710","Geen verstrekking in Open Data","24959","Ja",,,,,,,"4","4",,,,,,"M1",,,,"1659",,,,,,,"0.06","261","Nee","Nee",,"Nee","2559",,,"2023","Geen oordeel","05","Ja","2025-07-09T00:00:00.000","2021-07-10T00:00:00.000","2019-07-09T00:00:00.000","2021-07-10T00:00:00.000",,,,,,,,,,,,,,,,,,,,,,,,,,,,"https://opendata.rdw.nl/resource/3huj-srit.json","https://opendata.rdw.nl/resource/8ys7-d773.json","https://opendata.rdw.nl/resource/vezc-m2t6.json","https://opendata.rdw.nl/resource/jhie-znh9.json","https://opendata.rdw.nl/resource/kmfi-hrps.json"
"L598RN","Personenauto","RENAULT","CAPTUR","20241011","20210914","1598","MPV","5","GEEL","ZWART","4","1197","1260","1726","1360",,,"20160610","20210818","Geen verstrekking in Open Data","27861","Ja","192",,,,,,"4","4",,,,,,"M1",,,,"1726","R",,,,,,"0.06","261","Nee","Nee",,"Nee",,,,"2023","Geen oordeel","05","Ja","2024-10-11T00:00:00.000","2021-09-14T00:00:00.000","2016-06-10T00:00:00.000","2021-08-18T00:00:00.000",,,,,,,,,,,,,,,,,,,,,,,,,,,,"https://opendata.rdw.nl/resource/3huj-srit.json","https://opendata.rdw.nl/resource/8ys7-d773.json","https://opendata.rdw.nl/resource/vezc-m2t6.json","https://opendata.rdw.nl/resource/jhie-znh9.json","https://opendata.rdw.nl/resource/kmfi-hrps.json"
"L976ND","Personenauto","RENAULT","CAPTUR","20240803","20210806","1024","MPV","5","BLAUW","GEEL","3","1197","1260","1726","1360",,,"20160212","20210709","Geen verstrekking in Open Data","27541","Ja","192",,,,,,"4","4",,,,,,"M1",,,,"1726",,,,,,,"0.06","412","Nee","Nee",,"Nee",,,,"2024","Geen oordeel","05","Ja","2024-08-03T00:00:00.000","2021-08-06T00:00:00.000","2016-02-12T00:00:00.000","2021-07-09T00:00:00.000",,,,,,,,,,,,,,,,,,,,,,,,,,,,"https://opendata.rdw.nl/resource/3huj-srit.json","https://opendata.rdw.nl/resource/8ys7-d773.json","https://opendata.rdw.nl/resource/vezc-m2t6.json","https://opendata.rdw.nl/resource/jhie-znh9.json","https://opendata.rdw.nl/resource/kmfi-hrps.json"
"N407GN","Personenauto","RENAULT","CAPTUR","20240927","20211023","559","MPV","5","ZWART","Niet geregistreerd","3","898","1148","1659","1248",,,"20180927","20211023","Geen verstrekking in Open Data","26298","Ja",,,,,,,"4","4",,,,,,"M1",,,"r. deurstyl","1659",,,,,,,"0.05","261","Nee","Nee",,"Nee",,,,"2022","Geen oordeel","05","Ja","2024-09-27T00:00:00.000","2021-10-23T00:00:00.000","2018-09-27T00:00:00.000","2021-10-23T00:00:00.000",,,,,,,,,,,,,,,,,,,,,,"20211013","2021-10-13T00:00:00.000",,,,,"https://opendata.rdw.nl/resource/3huj-srit.json","https://opendata.rdw.nl/resource/8ys7-d773.json","https://opendata.rdw.nl/resource/vezc-m2t6.json","https://opendata.rdw.nl/resource/jhie-znh9.json","https://opendata.rdw.nl/resource/kmfi-hrps.json"
"NG244T","Personenauto","RENAULT","CAPTUR","20241120","20170123","3750","MPV","5","ORANJE","Niet geregistreerd","4","1197","1155","1726","1255","625","1200","20131030","20170123","Geen verstrekking in Open Data","24671","Ja",,,,,,,"4","4",,,,,,"M1",,,"r. kofferruimte","1726","R",,,,,,"0.07","261","Nee","Nee",,"Nee","2626",,,"2023","Geen oordeel","05","Ja","2024-11-20T00:00:00.000","2017-01-23T00:00:00.000","2013-10-30T00:00:00.000","2017-01-23T00:00:00.000",,,,,,,,,,,,,,,,,,,,,,,,,,,,"https://opendata.rdw.nl/resource/3huj-srit.json","https://opendata.rdw.nl/resource/8ys7-d773.json","https://opendata.rdw.nl/resource/vezc-m2t6.json","https://opendata.rdw.nl/resource/jhie-znh9.json","https://opendata.rdw.nl/resource/kmfi-hrps.json"
"NG457P","Personenauto","RENAULT","CAPTUR","20240912","20210403","1517","MPV","5","GRIJS","Niet geregistreerd","4","1197","1155","1726","1255","450","900","20130923","20170118","Geen verstrekking in Open Data","22575","Ja",,,,,,,"4","4",,,,,,"M1",,,"r.","1726",,,,,,,"0.07","261","Nee","Nee",,"Nee","2626",,,"2023","Geen oordeel","05","Ja","2024-09-12T00:00:00.000","2021-04-03T00:00:00.000","2013-09-23T00:00:00.000","2017-01-18T00:00:00.000",,,,,,,,,,,,,,,,,,,,,,,,,,,,"https://opendata.rdw.nl/resource/3huj-srit.json","https://opendata.rdw.nl/resource/8ys7-d773.json","https://opendata.rdw.nl/resource/vezc-m2t6.json","https://opendata.rdw.nl/resource/jhie-znh9.json","https://opendata.rdw.nl/resource/kmfi-hrps.json"
"NJ582R","Personenauto","RENAULT","CAPTUR","20250603","20170215","4279","MPV","5","GRIJS","Niet geregistreerd","4","1197","1155","1726","1255","625","1200","20150603","20170215","Geen verstrekking in Open Data","25049","Ja",,,,,,,"4","4",,,,,,"M1",,,"r. bodemplaat kofferruimte","1726","R",,,,,,"0.07","261","Nee","Nee",,"Nee","2626",,,"2024","Geen oordeel","05","Ja","2025-06-03T00:00:00.000","2017-02-15T00:00:00.000","2015-06-03T00:00:00.000","2017-02-15T00:00:00.000",,,,,,,,,,,,,,,,,,,,,,,,,,,,"https://opendata.rdw.nl/resource/3huj-srit.json","https://opendata.rdw.nl/resource/8ys7-d773.json","https://opendata.rdw.nl/resource/vezc-m2t6.json","https://opendata.rdw.nl/resource/jhie-znh9.json","https://opendata.rdw.nl/resource/kmfi-hrps.json"
"NN007J","Personenauto","RENAULT","CAPTUR","20250325","20201030","4503","MPV","5","ROOD","Niet geregistreerd","4","1197","1277","1726","1377","625","1200","20150827","20170322","Geen verstrekking in Open Data","25765","Ja",,,,,,,"4","4",,,,,,"M1",,,"kofferruimte r.","1726","R",,,,,,"0.06","261","Nee","Nee",,"Nee","2626",,,"2024","Geen oordeel","05","Ja","2025-03-25T00:00:00.000","2020-10-30T00:00:00.000","2015-08-27T00:00:00.000","2017-03-22T00:00:00.000",,,,,,,,,,,,,,,,,,,,,,,,,,,,"https://opendata.rdw.nl/resource/3huj-srit.json","https://opendata.rdw.nl/resource/8ys7-d773.json","https://opendata.rdw.nl/resource/vezc-m2t6.json","https://opendata.rdw.nl/resource/jhie-znh9.json","https://opendata.rdw.nl/resource/kmfi-hrps.json"
"NP131S","Personenauto","RENAULT","CAPTUR","20240928","20240229","2935","MPV","5","GRIJS","Niet geregistreerd","3","898","1080","1653","1180","590","1200","20150928","20170321","Geen verstrekking in Open Data","21385","Ja",,,,,,,"4","4",,,,,,"M1",,,"r. kofferruimte by bodemplaat","1653","R",,,,,,"0.06","261","Nee","Nee",,"Nee","2553",,,"2024","Geen oordeel","05","Ja","2024-09-28T00:00:00.000","2024-02-29T00:00:00.000","2015-09-28T00:00:00.000","2017-03-21T00:00:00.000",,,,,,,,,,,,,,,,,,,,,,,,,,,,"https://opendata.rdw.nl/resource/3huj-srit.json","https://opendata.rdw.nl/resource/8ys7-d773.json","https://opendata.rdw.nl/resource/vezc-m2t6.json","https://opendata.rdw.nl/resource/jhie-znh9.json","https://opendata.rdw.nl/resource/kmfi-hrps.json"
"NZ222B","Personenauto","RENAULT","CAPTUR","20240916","20171025","3740","MPV","5","GRIJS","Niet geregistreerd","4","1197","1159","1723","1259","625","1200","20161129","20171025","Geen verstrekking in Open Data","25875","Ja",,,,,,,"4","4",,,,,,"M1",,,"r. kofferruimte","1723","R",,,,,,"0.07","261","Nee","Nee",,"Nee","2623",,,"2022","Geen oordeel","05","Ja","2024-09-16T00:00:00.000","2017-10-25T00:00:00.000","2016-11-29T00:00:00.000","2017-10-25T00:00:00.000",,,,,,,,,,,,,,,,,,,,,,,,,,,,"https://opendata.rdw.nl/resource/3huj-srit.json","https://opendata.rdw.nl/resource/8ys7-d773.json","https://opendata.rdw.nl/resource/vezc-m2t6.json","https://opendata.rdw.nl/resource/jhie-znh9.json","https://opendata.rdw.nl/resource/kmfi-hrps.json"
"P111XL","Personenauto","RENAULT","CAPTUR","20241203","20220701","3892","MPV","5","WIT","ZWART","4","1332","1234","1816","1334","650","1200","20201203","20220701","Geen verstrekking in Open Data","35870","Ja",,,,,,,"4","4",,,,,,"M1",,,,"1816",,,,,,,"0.07","261","Nee","Nee",,"Nee","3316",,,"2024","Geen oordeel","05","Ja","2024-12-03T00:00:00.000","2022-07-01T00:00:00.000","2020-12-03T00:00:00.000","2022-07-01T00:00:00.000",,,,,,,,,,,,,,,,,,,,,,"20220602","2022-06-02T00:00:00.000",,,,,"https://opendata.rdw.nl/resource/3huj-srit.json","https://opendata.rdw.nl/resource/8ys7-d773.json","https://opendata.rdw.nl/resource/vezc-m2t6.json","https://opendata.rdw.nl/resource/jhie-znh9.json","https://opendata.rdw.nl/resource/kmfi-hrps.json"
"P429FT","Personenauto","RENAULT","CAPTUR","20241108","20221220","807","MPV","5","GRIJS","Niet geregistreerd","4","1197","1155","1726","1255","600","900","20141106","20220223","Geen verstrekking in Open Data","24875","Ja",,,,,,,"4","4",,,,,,"M1",,,,"1726",,,,,,,"0.07","260","Nee","Nee",,"Nee","2626",,,"2024","Geen oordeel","05","Ja","2024-11-08T00:00:00.000","2022-12-20T00:00:00.000","2014-11-06T00:00:00.000","2022-02-23T00:00:00.000",,,,,,,,,,,,,,,,,,,,,,"20220222","2022-02-22T00:00:00.000",,,,,"https://opendata.rdw.nl/resource/3huj-srit.json","https://opendata.rdw.nl/resource/8ys7-d773.json","https://opendata.rdw.nl/resource/vezc-m2t6.json","https://opendata.rdw.nl/resource/jhie-znh9.json","https://opendata.rdw.nl/resource/kmfi-hrps.json"
"P813ZV","Personenauto","RENAULT","CAPTUR","20250714","20220716","3303","MPV","5","ORANJE","Niet geregistreerd","4","1197","1260","1726","1360",,,"20160808","20220716","Geen verstrekking in Open Data","27226","Ja","192",,,,,,"4","4",,,,,,"M1",,,,"1726","R",,,,,,"0.06","261","Nee","Nee",,"Nee",,,,"2024","Geen oordeel","05","Ja","2025-07-14T00:00:00.000","2022-07-16T00:00:00.000","2016-08-08T00:00:00.000","2022-07-16T00:00:00.000",,,,,,,,,,,,,,,,,,,,,,"20220707","2022-07-07T00:00:00.000",,,,,"https://opendata.rdw.nl/resource/3huj-srit.json","https://opendata.rdw.nl/resource/8ys7-d773.json","https://opendata.rdw.nl/resource/vezc-m2t6.json","https://opendata.rdw.nl/resource/jhie-znh9.json","https://opendata.rdw.nl/resource/kmfi-hrps.json"
"PR066J","Personenauto","RENAULT","CAPTUR","20240921","20170903","356","MPV","5","ZWART","Niet geregistreerd","3","898","1080","1653","1180","590","1200","20160913","20170903","Geen verstrekking in Open Data","22075","Ja",,,,,,,"4","4",,,,,,"M1",,,"a. bodemplaat by kofferruimte","1653",,,,,,,"0.06","261","Nee","Nee",,"Nee","2553",,,"2023","Geen oordeel","05","Ja","2024-09-21T00:00:00.000","2017-09-03T00:00:00.000","2016-09-13T00:00:00.000","2017-09-03T00:00:00.000",,,,,,,,,,,,,,,,,,,,,,,,,,,,"https://opendata.rdw.nl/resource/3huj-srit.json","https://opendata.rdw.nl/resource/8ys7-d773.json","https://opendata.rdw.nl/resource/vezc-m2t6.json","https://opendata.rdw.nl/resource/jhie-znh9.json","https://opendata.rdw.nl/resource/kmfi-hrps.json"
"PZ808B","Personenauto","RENAULT","CAPTUR","20241112","20171128","1656","MPV","5","ZWART","WIT","4","1197","1155","1726","1255","625","900","20141112","20171128","Geen verstrekking in Open Data","25869","Ja",,,,,,,"4","4",,,,,,"M1",,,"bodemplaat kofferruimte","1726",,,,,,,"0.07","263","Nee","Nee",,"Nee","2626",,,"2023","Geen oordeel","05","Ja","2024-11-12T00:00:00.000","2017-11-28T00:00:00.000","2014-11-12T00:00:00.000","2017-11-28T00:00:00.000",,,,,,,,,,,,,,,,,,,,,,,,,,,,"https://opendata.rdw.nl/resource/3huj-srit.json","https://opendata.rdw.nl/resource/8ys7-d773.json","https://opendata.rdw.nl/resource/vezc-m2t6.json","https://opendata.rdw.nl/resource/jhie-znh9.json","https://opendata.rdw.nl/resource/kmfi-hrps.json"