"kenteken","voertuigsoort","merk","handelsbenaming","vervaldatum_apk","datum_tenaamstelling","bruto_bpm","inrichting","aantal_zitplaatsen","eerste_kleur","tweede_kleur","aantal_cilinders","cilinderinhoud","massa_ledig_voertuig","toegestane_maximum_massa_voertuig","massa_rijklaar","maximum_massa_trekken_ongeremd","maximum_trekken_massa_geremd","datum_eerste_toelating","datum_eerste_tenaamstelling_in_nederland","wacht_op_keuren","catalogusprijs","wam_verzekerd","maximale_constructiesnelheid","laadvermogen","oplegger_geremd","aanhangwagen_autonoom_geremd","aanhangwagen_middenas_geremd","aantal_staanplaatsen","aantal_deuren","aantal_wielen","afstand_hart_koppeling_tot_achterzijde_voertuig","afstand_voorzijde_voertuig_tot_hart_koppeling","afwijkende_maximum_snelheid","lengte","breedte","europese_voertuigcategorie","europese_voertuigcategorie_toevoeging","europese_uitvoeringcategorie_toevoeging","plaats_chassisnummer","technische_max_massa_voertuig","type","type_gasinstallatie","typegoedkeuringsnummer","variant","uitvoering","volgnummer_wijziging_eu_typegoedkeuring","vermogen_massarijklaar","wielbasis","export_indicator","openstaande_terugroepactie_indicator","vervaldatum_tachograaf","taxi_indicator","maximum_massa_samenstelling","aantal_rolstoelplaatsen","maximum_ondersteunende_snelheid","jaar_laatste_registratie_tellerstand","tellerstandoordeel","code_toelichting_tellerstandoordeel","tenaamstellen_mogelijk","vervaldatum_apk_dt","datum_tenaamstelling_dt","datum_eerste_toelating_dt","datum_eerste_tenaamstelling_in_nederland_dt","vervaldatum_tachograaf_dt","maximum_last_onder_de_vooras_sen_tezamen_koppeling","type_remsysteem_voertuig_code","rupsonderstelconfiguratiecode","wielbasis_voertuig_minimum","wielbasis_voertuig_maximum","lengte_voertuig_minimum","lengte_voertuig_maximum","breedte_voertuig_minimum","breedte_voertuig_maximum","hoogte_voertuig","hoogte_voertuig_minimum","hoogte_voertuig_maximum","massa_bedrijfsklaar_minimaal","massa_bedrijfsklaar_maximaal","technisch_toelaatbaar_massa_koppelpunt","maximum_massa_technisch_maximaal","maximum_massa_technisch_minimaal","subcategorie_nederland","verticale_belasting_koppelpunt_getrokken_voertuig","zuinigheidsclassificatie","registratie_datum_goedkeuring_afschrijvingsmoment_bpm","registratie_datum_goedkeuring_afschrijvingsmoment_bpm_dt","gem_lading_wrde","aerodyn_voorz","massa_alt_aandr","verl_cab_ind","api_gekentekende_voertuigen_assen","api_gekentekende_voertuigen_brandstof","api_gekentekende_voertuigen_carrosserie","api_gekentekende_voertuigen_carrosserie_specifiek","api_gekentekende_voertuigen_voertuigklasse"
"17JDTN","Personenauto","PORSCHE","911 SC TARGA","20250731","20091005","8204","coupe",,"BRUIN","Niet geregistreerd","6",,"1130",,"1230",,,"19780301","20020226","Geen verstrekking in Open Data",,"Ja",,,,,,,"2","4","0","0",,"0","0","M1",,,"r. op dwarsbalk boven vooras in kofferruimte","0",,,,,,"0","0.00","227","Nee","Nee",,"Nee","0",,,"2023","Geen oordeel","05","Ja","2025-07-31T00:00:00.000","2009-10-05T00:00:00.000","1978-03-01T00:00:00.000","2002-02-26T00:00:00.000",,"0",,,,,,,,,,,,,,,,,,,,,,,,,,"https://opendata.rdw.nl/resource/3huj-srit.json","https://opendata.rdw.nl/resource/8ys7-d773.json","https://opendata.rdw.nl/resource/vezc-m2t6.json","https://opendata.rdw.nl/resource/jhie-znh9.json","https://opendata.rdw.nl/resource/kmfi-hrps.json"
"17YE62","Personenauto","PORSCHE","911 SC TARGA","20260430","20240515",,"coupe","4","GRIJS","Niet geregistreerd","6","2956","1130","1500","1230",,,"19771201","20240515","Geen verstrekking in Open Data",,"Nee","225",,,,,,"2","4",,,,,,"M1",,,"onder dwarsbalk kofferruimte","1500",,,,,,,"0.11","227","Nee","Nee",,"Nee",,,,"2024","Geen oordeel","05","Ja","2026-04-30T00:00:00.000","2024-05-15T00:00:00.000","1977-12-01T00:00:00.000","2024-05-15T00:00:00.000",,,,,,,,,,,,,,,,,,,,,,"20240513","2024-05-13T00:00:00.000",,,,,"https://opendata.rdw.nl/resource/3huj-srit.json","https://opendata.rdw.nl/resource/8ys7-d773.json","https://opendata.rdw.nl/resource/vezc-m2t6.json","https://opendata.rdw.nl/resource/jhie-znh9.json","https://opendata.rdw.nl/resource/kmfi-hrps.json"
"4KKT09","Personenauto","PORSCHE","911 SC TARGA","20251020","20130516",,"coupe","4","ZWART","Niet geregistreerd","6","2994","1220",,"1320",,,"19780228","20130516","Geen verstrekking in Open Data",,"Ja",,,,,,,"2","4",,,,,,"M1",,,"r. dwarsbalk kofferruimte",,,,,,,,"0.10","227","Nee","Nee",,"Nee",,,,"2023","Geen oordeel","05","Ja","2025-10-20T00:00:00.000","2013-05-16T00:00:00.000","1978-02-28T00:00:00.000","2013-05-16T00:00:00.000",,"0",,,,,,,,,,,,,,,,,,,,,,,,,,"https://opendata.rdw.nl/resource/3huj-srit.json","https://opendata.rdw.nl/resource/8ys7-d773.json","https://opendata.rdw.nl/resource/vezc-m2t6.json","https://opendata.rdw.nl/resource/jhie-znh9.json","https://opendata.rdw.nl/resource/kmfi-hrps.json"
"58TVHT","Personenauto","PORSCHE","911 SC TARGA","20251208","20210910","7949","coupe",,"BRUIN","Niet geregistreerd","6","2994","1130",,"1230",,,"19801108","20070202","Geen verstrekking in Open Data",,"Ja",,,,,,,"2","4","0","0",,"0","0","M1",,,"midden op bodemplaat in kofferruimte","0",,,,,,"0","0.13","227","Nee","Nee",,"Nee","0",,,"2023","Geen oordeel","05","Ja","2025-12-08T00:00:00.000","2021-09-10T00:00:00.000","1980-11-08T00:00:00.000","2007-02-02T00:00:00.000",,"0",,,,,,,,,,,,,,,,,,,,,,,,,,"https://opendata.rdw.nl/resource/3huj-srit.json","https://opendata.rdw.nl/resource/8ys7-d773.json","https://opendata.rdw.nl/resource/vezc-m2t6.json","https://opendata.rdw.nl/resource/jhie-znh9.json","https://opendata.rdw.nl/resource/kmfi-hrps.json"
"66TM76","Personenauto","PORSCHE","911 SC TARGA","20251124","20190828",,"coupe","4","GROEN","Niet geregistreerd","6","3125","1130","1500","1230",,,"19771102","19771102","Geen verstrekking in Open Data",,"Ja",,,,,,,"2","4",,,,,,"M1",,,"boven op dwarsbalk boven vooras in kofferruimte","1500",,,,,,,"0.13","227","Nee","Nee",,"Nee",,,,"2023","Geen oordeel","05","Ja","2025-11-24T00:00:00.000","2019-08-28T00:00:00.000","1977-11-02T00:00:00.000","1977-11-02T00:00:00.000",,,,,,,,,,,,,,,,,,,,,,,,,,,,"https://opendata.rdw.nl/resource/3huj-srit.json","https://opendata.rdw.nl/resource/8ys7-d773.json","https://opendata.rdw.nl/resource/vezc-m2t6.json","https://opendata.rdw.nl/resource/jhie-znh9.json","https://opendata.rdw.nl/resource/kmfi-hrps.json"
"6XFH10","Personenauto","PORSCHE","911 SC TARGA","20250703","20140703",,"coupe","2","GRIJS","Niet geregistreerd","6","3000","1190","1468","1290",,,"19800228","20140703","Geen verstrekking in Open Data",,"Ja",,,,,,,"2","4",,,,,,"M1",,,"r. bodemplaat kofferruimte","1468",,,,,,,"0.11","227","Nee","Nee",,"Nee",,,,"2023","Onlogisch","04","Ja","2025-07-03T00:00:00.000","2014-07-03T00:00:00.000","1980-02-28T00:00:00.000","2014-07-03T00:00:00.000",,"0",,,,,,,,,,,,,,,,,,,,,,,,,,"https://opendata.rdw.nl/resource/3huj-srit.json","https://opendata.rdw.nl/resource/8ys7-d773.json","https://opendata.rdw.nl/resource/vezc-m2t6.json","https://opendata.rdw.nl/resource/jhie-znh9.json","https://opendata.rdw.nl/resource/kmfi-hrps.json"
"6XGH51","Personenauto","PORSCHE","911 SC TARGA","20260406","20141106",,"coupe","4","ORANJE","Niet geregistreerd","6","2994","1131","1500","1231",,,"19790228","20140716","Geen verstrekking in Open Data",,"Ja",,,,,,,"2","4",,,,,,"M1",,,"r. bodemplaat kofferruimte","1500",,,,,,,"0.11","227","Nee","Nee",,"Nee",,,,"2024","Geen oordeel","05","Ja","2026-04-06T00:00:00.000","2014-11-06T00:00:00.000","1979-02-28T00:00:00.000","2014-07-16T00:00:00.000",,"0",,,,,,,,,,,,,,,,,,,,,,,,,,"https://opendata.rdw.nl/resource/3huj-srit.json","https://opendata.rdw.nl/resource/8ys7-d773.json","https://opendata.rdw.nl/resource/vezc-m2t6.json","https://opendata.rdw.nl/resource/jhie-znh9.json","https://opendata.rdw.nl/resource/kmfi-hrps.json"
"91JVN8","Personenauto","PORSCHE","911 SC TARGA","20240910","20151017",,"coupe","4","BEIGE","Niet geregistreerd","6","2994","1130","1500","1230",,,"19820228","20090915","Geen verstrekking in Open Data",,"Ja",,,,,,,"2","4","0","0",,"0","0","M1",,,"r. bodemplaat by kofferruimte","1500",,,,,,"0","0.12","227","Nee","Nee",,"Nee","0",,,"2022","Geen oordeel","05","Ja","2024-09-10T00:00:00.000","2015-10-17T00:00:00.000","1982-02-28T00:00:00.000","2009-09-15T00:00:00.000",,"0",,,,,,,,,,,,,,,,,,,,,,,,,,"https://opendata.rdw.nl/resource/3huj-srit.json","https://opendata.rdw.nl/resource/8ys7-d773.json","https://opendata.rdw.nl/resource/vezc-m2t6.json","https://opendata.rdw.nl/resource/jhie-znh9.json","https://opendata.rdw.nl/resource/kmfi-hrps.json"
"G056BZ","Personenauto","PORSCHE","911 SC TARGA","20250820","20190912",,"coupe","4","BLAUW","Niet geregistreerd","6","2994","1090","1550","1190",,,"19820228","20190912","Geen verstrekking in Open Data",,"Ja",,,,,,,"2","4",,,,,,"M1",,,"r. bodemplaat","1550",,,,,,,"0.13","227","Nee","Nee",,"Nee",,,,"2023","Geen oordeel","05","Ja","2025-08-20T00:00:00.000","2019-09-12T00:00:00.000","1982-02-28T00:00:00.000","2019-09-12T00:00:00.000",,,,,,,,,,,,,,,,,,,,,,,,,,,,"https://opendata.rdw.nl/resource/3huj-srit.json","https://opendata.rdw.nl/resource/8ys7-d773.json","https://opendata.rdw.nl/resource/vezc-m2t6.json","https://opendata.rdw.nl/resource/jhie-znh9.json","https://opendata.rdw.nl/resource/kmfi-hrps.json"
"G567KJ","Personenauto","PORSCHE","911 SC TARGA","20251018","20191010","22909","coupe","4","ZWART","Niet geregistreerd","6","3000","1130","1460","1230",,,"19800630","20191010","Geen verstrekking in Open Data",,"Ja",,,,,,,"2","4",,,,,,"M1",,,,"1460",,,,,,,"0.11","227","Nee","Nee",,"Nee",,,,"2023","Onlogisch","04","Ja","2025-10-18T00:00:00.000","2019-10-10T00:00:00.000","1980-06-30T00:00:00.000","2019-10-10T00:00:00.000",,,,,,,,,,,,,,,,,,,,,,,,,,,,"https://opendata.rdw.nl/resource/3huj-srit.json","https://opendata.rdw.nl/resource/8ys7-d773.json","https://opendata.rdw.nl/resource/vezc-m2t6.json","https://opendata.rdw.nl/resource/jhie-znh9.json","https://opendata.rdw.nl/resource/kmfi-hrps.json"
"GD124G","Personenauto","PORSCHE","911 SC TARGA","20260327","20150414",,"coupe","4","BLAUW","Niet geregistreerd","6","2994","1130","1500","1230","480","800","19800228","20150414","Geen verstrekking in Open Data",,"Ja",,,,,,,"2","4","0","0",,"0","0","M1",,,"r. dwarsbalk kofferruimte","1500",,,,,,"0","0.12","227","Nee","Nee",,"Nee","0",,,"2024","Geen oordeel","05","Ja","2026-03-27T00:00:00.000","2015-04-14T00:00:00.000","1980-02-28T00:00:00.000","2015-04-14T00:00:00.000",,,,,,,,,,,,,,,,,,,,,,,,,,,,"https://opendata.rdw.nl/resource/3huj-srit.json","https://opendata.rdw.nl/resource/8ys7-d773.json","https://opendata.rdw.nl/resource/vezc-m2t6.json","https://opendata.rdw.nl/resource/jhie-znh9.json","https://opendata.rdw.nl/resource/kmfi-hrps.json"
"GD648S","Personenauto","PORSCHE","911 SC TARGA","20250531","20150424",,"coupe","4","GRIJS","Niet geregistreerd","6","2994","1130","1500","1230","480","800","19811203","20150424","Geen verstrekking in Open Data",,"Ja",,,,,,,"2","4","0","0",,"0","0","M1",,,"r. dwarsbalk kofferruimte","1500",,,,,,"0","0.12","227","Nee","Nee",,"Nee","0",,,"2023","Geen oordeel","05","Ja","2025-05-31T00:00:00.000","2015-04-24T00:00:00.000","1981-12-03T00:00:00.000","2015-04-24T00:00:00.000",,,,,,,,,,,,,,,,,,,,,,,,,,,,"https://opendata.rdw.nl/resource/3huj-srit.json","https://opendata.rdw.nl/resource/8ys7-d773.json","https://opendata.rdw.nl/resource/vezc-m2t6.json","https://opendata.rdw.nl/resource/jhie-znh9.json","https://opendata.rdw.nl/resource/kmfi-hrps.json"
"GG989V","Personenauto","PORSCHE","911 SC TARGA","20250514","20150522",,"coupe","4","ROOD","Niet geregistreerd","6","3164","1190","1500","1290",,,"19840228","20150522","Geen verstrekking in Open Data",,"Ja",,,,,,,"2","4",,,,,,"M1",,,"r. bodemplaat in kofferruimte","1500",,,,,,,"0.13","227","Nee","Nee",,"Nee",,,,"2024","Geen oordeel","05","Ja","2025-05-14T00:00:00.000","2015-05-22T00:00:00.000","1984-02-28T00:00:00.000","2015-05-22T00:00:00.000",,,,,,,,,,,,,,,,,,,,,,,,,,,,"https://opendata.rdw.nl/resource/3huj-srit.json","https://opendata.rdw.nl/resource/8ys7-d773.json","https://opendata.rdw.nl/resource/vezc-m2t6.json","https://opendata.rdw.nl/resource/jhie-znh9.json","https://opendata.rdw.nl/resource/kmfi-hrps.json"
"GV91PS","Personenauto","PORSCHE","911 SC TARGA",,"20190423","720","coupe","4","WIT","Niet geregistreerd","6","2998","1130","1500","1230",,,"19810904","19810904","Geen verstrekking in Open Data",,"Ja",,,,,,,"2","4",,,,,,"M1",,,,"1500",,,,,,,"0.12","227","Nee","Nee",,"Nee",,,,"2019","Logisch","00","Ja",,"2019-04-23T00:00:00.000","1981-09-04T00:00:00.000","1981-09-04T00:00:00.000",,,,,,,,,,,,,,,,,,,,,,,,,,,,"https://opendata.rdw.nl/resource/3huj-srit.json","https://opendata.rdw.nl/resource/8ys7-d773.json","https://opendata.rdw.nl/resource/vezc-m2t6.json","https://opendata.rdw.nl/resource/jhie-znh9.json","https://opendata.rdw.nl/resource/kmfi-hrps.json"
"GZ840V","Personenauto","PORSCHE","911 SC TARGA","20230529","20150929",,"coupe","4","ROOD","Niet geregistreerd","6","2994","1130","1500","1230","480","800","19830921","20150929","Geen verstrekking in Open Data",,"Ja",,,,,,,"2","4","0","0",,"0","0","M1",,,"r. bodemplaat by kofferruimte","1500",,,,,,"0","0.11","227","Nee","Nee",,"Nee","2300",,,"2021","Geen oordeel","05","Ja","2023-05-29T00:00:00.000","2015-09-29T00:00:00.000","1983-09-21T00:00:00.000","2015-09-29T00:00:00.000",,,,,,,,,,,,,,,,,,,,,,,,,,,,"https://opendata.rdw.nl/resource/3huj-srit.json","https://opendata.rdw.nl/resource/8ys7-d773.json","https://opendata.rdw.nl/resource/vezc-m2t6.json","https://opendata.rdw.nl/resource/jhie-znh9.json","https://opendata.rdw.nl/resource/kmfi-hrps.json"
"H685VP","Personenauto","PORSCHE","911 SC TARGA","20240701","20200609","11578","coupe","2","WIT","Niet geregistreerd","6","2994","1190","1500","1290",,"800","19820402","20200609","Geen verstrekking in Open Data",,"Ja",,,,,,,"2","4",,,,,,"M1",,,,"1500",,,,,,,"0.10","227","Nee","Nee",,"Nee","2300",,,"2022","Geen oordeel","05","Ja","2024-07-01T00:00:00.000","2020-06-09T00:00:00.000","1982-04-02T00:00:00.000","2020-06-09T00:00:00.000",,,,,,,,,,,,,,,,,,,,,,,,,,,,"https://opendata.rdw.nl/resource/3huj-srit.json","https://opendata.rdw.nl/resource/8ys7-d773.json","https://opendata.rdw.nl/resource/vezc-m2t6.json","https://opendata.rdw.nl/resource/jhie-znh9.json","https://opendata.rdw.nl/resource/kmfi-hrps.json"
"HF604N","Personenauto","PORSCHE","911 SC TARGA","20251012","20151027",,"coupe","4","ZWART","Niet geregistreerd","6","3000","1130","1399","1230",,,"19780228","20151027","Geen verstrekking in Open Data",,"Ja",,,,,,,"2","4","0","0",,"0","0","M1",,,"r. bodemplaat by kofferruimte","1399",,,,,,"0","0.11","227","Nee","Nee",,"Nee","0",,,"2023","Geen oordeel","02","Ja","2025-10-12T00:00:00.000","2015-10-27T00:00:00.000","1978-02-28T00:00:00.000","2015-10-27T00:00:00.000",,,,,,,,,,,,,,,,,,,,,,,,,,,,"https://opendata.rdw.nl/resource/3huj-srit.json","https://opendata.rdw.nl/resource/8ys7-d773.json","https://opendata.rdw.nl/resource/vezc-m2t6.json","https://opendata.rdw.nl/resource/jhie-znh9.json","https://opendata.rdw.nl/resource/kmfi-hrps.json"
"HP474V","Personenauto","PORSCHE","911 SC TARGA","20251207","20160105",,"coupe","4","GRIJS","Niet geregistreerd","6","2994","1213",,"1313",,,"19830228","20160105","Geen verstrekking in Open Data",,"Ja",,,,,,,"2","4",,,,,,"M1",,,"by kofferruimte v. pers.ruimte",,,,,,,,"0.11","227","Nee","Nee",,"Nee",,,,"2023","Geen oordeel","05","Ja","2025-12-07T00:00:00.000","2016-01-05T00:00:00.000","1983-02-28T00:00:00.000","2016-01-05T00:00:00.000",,,,,,,,,,,,,,,,,,,,,,,,,,,,"https://opendata.rdw.nl/resource/3huj-srit.json","https://opendata.rdw.nl/resource/8ys7-d773.json","https://opendata.rdw.nl/resource/vezc-m2t6.json","https://opendata.rdw.nl/resource/jhie-znh9.json","https://opendata.rdw.nl/resource/kmfi-hrps.json"
"J828JT","Personenauto","PORSCHE","911 SC TARGA","20250703","20230708",,"coupe","4","BLAUW","Niet geregistreerd","6","2994","1170",,"1270",,,"19780228","20200903","Geen verstrekking in Open Data",,"Ja","225",,,,,,"2","4",,,,,,"M1",,,"r. by kofferruimte",,"911",,,,,,"0.10","227","Nee","Nee",,"Nee",,,,"2023","Geen oordeel","05","Ja","2025-07-03T00:00:00.000","2023-07-08T00:00:00.000","1978-02-28T00:00:00.000","2020-09-03T00:00:00.000",,,,,,,,,,,,,,,,,,,,,,,,,,,,"https://opendata.rdw.nl/resource/3huj-srit.json","https://opendata.rdw.nl/resource/8ys7-d773.json","https://opendata.rdw.nl/resource/vezc-m2t6.json","https://opendata.rdw.nl/resource/jhie-znh9.json","https://opendata.rdw.nl/resource/kmfi-hrps.json"
"JG411D","Personenauto","PORSCHE","911 SC TARGA","20240821","20190817",,"coupe","4","BLAUW","Niet geregistreerd","6","2994","1130","1500","1230","480","800","19790228","20160302","Geen verstrekking in Open Data",,"Ja",,,,,,,"2","4","0","0",,"0","0","M1",,,"r. op dwarsbalk boven vooras in kofferruimte","1500",,,,,,"0","0.12","227","Nee","Nee",,"Nee","0",,,"2022","Geen oordeel","05","Ja","2024-08-21T00:00:00.000","2019-08-17T00:00:00.000","1979-02-28T00:00:00.000","2016-03-02T00:00:00.000",,,,,,,,,,,,,,,,,,,,,,,,,,,,"https://opendata.rdw.nl/resource/3huj-srit.json","https://opendata.rdw.nl/resource/8ys7-d773.json","https://opendata.rdw.nl/resource/vezc-m2t6.json","https://opendata.rdw.nl/resource/jhie-znh9.json","https://opendata.rdw.nl/resource/kmfi-hrps.json"
"JL10FD","Personenauto","PORSCHE","911 SC TARGA",,"20170426",,"coupe","4","WIT","Niet geregistreerd","6","3200","1130",,"1230",,,"19830225","19830225","Geen verstrekking in Open Data",,"Ja",,,,,,,"2","4","0","0",,"0","0","M1",,,"r. op dwarsbalk boven vooras in kofferruimte","0",,,,,,"0","0.14","227","Nee","Nee",,"Nee","0",,,"2017","Geen oordeel","07","Ja",,"2017-04-26T00:00:00.000","1983-02-25T00:00:00.000","1983-02-25T00:00:00.000",,,,,,,,,,,,,,,,,,,,,,,,,,,,"https://opendata.rdw.nl/resource/3huj-srit.json","https://opendata.rdw.nl/resource/8ys7-d773.json","https://opendata.rdw.nl/resource/vezc-m2t6.json","https://opendata.rdw.nl/resource/jhie-znh9.json","https://opendata.rdw.nl/resource/kmfi-hrps.json"
"JP698D","Personenauto","PORSCHE","911 SC TARGA","20260409","20221122",,"coupe","4","BLAUW","Niet geregistreerd","6","3000","1226","1551","1326",,,"19820228","20160702","Geen verstrekking in Open Data",,"Ja",,,,,,,"2","4",,,,,,"M1",,,"r. bodemplaat kofferruimte","1551",,,,,,,"0.11","227","Nee","Nee",,"Nee",,,,"2024","Geen oordeel","05","Ja","2026-04-09T00:00:00.000","2022-11-22T00:00:00.000","1982-02-28T00:00:00.000","2016-07-02T00:00:00.000",,,,,,,,,,,,,,,,,,,,,,,,,,,,"https://opendata.rdw.nl/resource/3huj-srit.json","https://opendata.rdw.nl/resource/8ys7-d773.json","https://opendata.rdw.nl/resource/vezc-m2t6.json","https://opendata.rdw.nl/resource/jhie-znh9.json","https://opendata.rdw.nl/resource/kmfi-hrps.json"
"K102FH","Personenauto","PORSCHE","911 SC TARGA","20241109","20201204",,"coupe","4","GRIJS","Niet geregistreerd","6","2994","1229","1400","1329",,,"19790915","20201127","Geen verstrekking in Open Data",,"Ja",,,,,,,"2","4",,,,,,"M1",,,"r. bodemplaat kofferruimte","1400",,,,,,,"0.10","227","Nee","Nee",,"Nee",,,,"2022","Geen oordeel","05","Ja","2024-11-09T00:00:00.000","2020-12-04T00:00:00.000","1979-09-15T00:00:00.000","2020-11-27T00:00:00.000",,,,,,,,,,,,,,,,,,,,,,,,,,,,"https://opendata.rdw.nl/resource/3huj-srit.json","https://opendata.rdw.nl/resource/8ys7-d773.json","https://opendata.rdw.nl/resource/vezc-m2t6.json","https://opendata.rdw.nl/resource/jhie-znh9.json","https://opendata.rdw.nl/resource/kmfi-hrps.json"
"K665NL","Personenauto","PORSCHE","911 SC TARGA","20250420","20210112",,"coupe","4","GRIJS","Niet geregistreerd","6","2994","1130","1500","1230","400","800","19780228","20210112","Geen verstrekking in Open Data",,"Ja",,,,,,,"2","4",,,,,,"M1",,,"r. bodemplaat by kofferruimte","1500","911",,,,,,"0.11","227","Nee","Nee",,"Nee",,,,"2023","Geen oordeel","05","Ja","2025-04-20T00:00:00.000","2021-01-12T00:00:00.000","1978-02-28T00:00:00.000","2021-01-12T00:00:00.000",,,,,,,,,,,,,,,,,,,,,,,,,,,,"https://opendata.rdw.nl/resource/3huj-srit.json","https://opendata.rdw.nl/resource/8ys7-d773.json","https://opendata.rdw.nl/resource/vezc-m2t6.json","https://opendata.rdw.nl/resource/jhie-znh9.json","https://opendata.rdw.nl/resource/kmfi-hrps.json"
"KG339N","Personenauto","PORSCHE","911 SC TARGA","20241013","20171020",,"coupe","4","BRUIN","Niet geregistreerd","6","2994","1130","1500","1230","480","800","19780630","20160902","Geen verstrekking in Open Data",,"Ja",,,,,,,"2","4",,,,,,"M1",,,"r. kofferruimte","1500",,,,,,,"0.11","227","Nee","Nee",,"Nee",,,,"2022","Geen oordeel","05","Ja","2024-10-13T00:00:00.000","2017-10-20T00:00:00.000","1978-06-30T00:00:00.000","2016-09-02T00:00:00.000",,,,,,,,,,,,,,,,,,,,,,,,,,,,"https://opendata.rdw.nl/resource/3huj-srit.json","https://opendata.rdw.nl/resource/8ys7-d773.json","https://opendata.rdw.nl/resource/vezc-m2t6.json","https://opendata.rdw.nl/resource/jhie-znh9.json","https://opendata.rdw.nl/resource/kmfi-hrps.json"
"KH749D","Personenauto","PORSCHE","911 SC TARGA","20260412","20201002",,"coupe","4","ZWART","Niet geregistreerd","6","2994","1130","1500","1230","480","800","19820228","20160908","Geen verstrekking in Open Data",,"Ja",,,,,,,"2","4","0","0",,"0","0","M1",,,"r. kofferruimte","1500",,,,,,"0","0.12","227","Nee","Nee",,"Nee","0",,,"2024","Geen oordeel","05","Ja","2026-04-12T00:00:00.000","2020-10-02T00:00:00.000","1982-02-28T00:00:00.000","2016-09-08T00:00:00.000",,,,,,,,,,,,,,,,,,,,,,,,,,,,"https://opendata.rdw.nl/resource/3huj-srit.json","https://opendata.rdw.nl/resource/8ys7-d773.json","https://opendata.rdw.nl/resource/vezc-m2t6.json","https://opendata.rdw.nl/resource/jhie-znh9.json","https://opendata.rdw.nl/resource/kmfi-hrps.json"
"KL673R","Personenauto","PORSCHE","911 SC TARGA","20260310","20200325",,"coupe","4","BRUIN","Niet geregistreerd","6","2994","1130","1500","1230","480","800","19810401","20161018","Geen verstrekking in Open Data",,"Ja",,,,,,,"2","4","0","0",,"0","0","M1",,,"bodemplaat kofferruimte","1500",,,,,,"0","0.12","227","Nee","Nee",,"Nee","0",,,"2024","Geen oordeel","05","Ja","2026-03-10T00:00:00.000","2020-03-25T00:00:00.000","1981-04-01T00:00:00.000","2016-10-18T00:00:00.000",,,,,,,,,,,,,,,,,,,,,,,,,,,,"https://opendata.rdw.nl/resource/3huj-srit.json","https://opendata.rdw.nl/resource/8ys7-d773.json","https://opendata.rdw.nl/resource/vezc-m2t6.json","https://opendata.rdw.nl/resource/jhie-znh9.json","https://opendata.rdw.nl/resource/kmfi-hrps.json"
"NH497D","Personenauto","PORSCHE","911 SC TARGA","20250308","20170303",,"coupe","2","BRUIN","Niet geregistreerd","8","2956","1130","1500","1230",,,"19800403","20170303","Geen verstrekking in Open Data",,"Ja",,,,,,,"2","4","0","0",,"0","0","M1",,,"r. bodemplaat by kofferruimte","1500",,,,,,"0","0.12","227","Nee","Nee",,"Nee","0",,,"2023","Geen oordeel","05","Ja","2025-03-08T00:00:00.000","2017-03-03T00:00:00.000","1980-04-03T00:00:00.000","2017-03-03T00:00:00.000",,,,,,,,,,,,,,,,,,,,,,,,,,,,"https://opendata.rdw.nl/resource/3huj-srit.json","https://opendata.rdw.nl/resource/8ys7-d773.json","https://opendata.rdw.nl/resource/vezc-m2t6.json","https://opendata.rdw.nl/resource/jhie-znh9.json","https://opendata.rdw.nl/resource/kmfi-hrps.json"
"NL210P","Personenauto","PORSCHE","911 SC TARGA","20250221","20170227",,"coupe","4","ZWART","Niet geregistreerd","6","2994","1130","1500","1230",,"800","19780228","20170227","Geen verstrekking in Open Data",,"Ja",,,,,,,"2","4","0","0",,"0","0","M1",,,"r. bodemplaat by kofferruimte","1500","911SC",,,,,"0","0.10","227","Nee","Nee",,"Nee","2300",,,"2023","Geen oordeel","05","Ja","2025-02-21T00:00:00.000","2017-02-27T00:00:00.000","1978-02-28T00:00:00.000","2017-02-27T00:00:00.000",,,,,,,,,,,,,,,,,,,,,,,,,,,,"https://opendata.rdw.nl/resource/3huj-srit.json","https://opendata.rdw.nl/resource/8ys7-d773.json","https://opendata.rdw.nl/resource/vezc-m2t6.json","https://opendata.rdw.nl/resource/jhie-znh9.json","https://opendata.rdw.nl/resource/kmfi-hrps.json"