"kenteken","voertuigsoort","merk","handelsbenaming","vervaldatum_apk","datum_tenaamstelling","bruto_bpm","inrichting","aantal_zitplaatsen","eerste_kleur","tweede_kleur","aantal_cilinders","cilinderinhoud","massa_ledig_voertuig","toegestane_maximum_massa_voertuig","massa_rijklaar","maximum_massa_trekken_ongeremd","maximum_trekken_massa_geremd","datum_eerste_toelating","datum_eerste_tenaamstelling_in_nederland","wacht_op_keuren","catalogusprijs","wam_verzekerd","maximale_constructiesnelheid","laadvermogen","oplegger_geremd","aanhangwagen_autonoom_geremd","aanhangwagen_middenas_geremd","aantal_staanplaatsen","aantal_deuren","aantal_wielen","afstand_hart_koppeling_tot_achterzijde_voertuig","afstand_voorzijde_voertuig_tot_hart_koppeling","afwijkende_maximum_snelheid","lengte","breedte","europese_voertuigcategorie","europese_voertuigcategorie_toevoeging","europese_uitvoeringcategorie_toevoeging","plaats_chassisnummer","technische_max_massa_voertuig","type","type_gasinstallatie","typegoedkeuringsnummer","variant","uitvoering","volgnummer_wijziging_eu_typegoedkeuring","vermogen_massarijklaar","wielbasis","export_indicator","openstaande_terugroepactie_indicator","vervaldatum_tachograaf","taxi_indicator","maximum_massa_samenstelling","aantal_rolstoelplaatsen","maximum_ondersteunende_snelheid","jaar_laatste_registratie_tellerstand","tellerstandoordeel","code_toelichting_tellerstandoordeel","tenaamstellen_mogelijk","vervaldatum_apk_dt","datum_tenaamstelling_dt","datum_eerste_toelating_dt","datum_eerste_tenaamstelling_in_nederland_dt","vervaldatum_tachograaf_dt","maximum_last_onder_de_vooras_sen_tezamen_koppeling","type_remsysteem_voertuig_code","rupsonderstelconfiguratiecode","wielbasis_voertuig_minimum","wielbasis_voertuig_maximum","lengte_voertuig_minimum","lengte_voertuig_maximum","breedte_voertuig_minimum","breedte_voertuig_maximum","hoogte_voertuig","hoogte_voertuig_minimum","hoogte_voertuig_maximum","massa_bedrijfsklaar_minimaal","massa_bedrijfsklaar_maximaal","technisch_toelaatbaar_massa_koppelpunt","maximum_massa_technisch_maximaal","maximum_massa_technisch_minimaal","subcategorie_nederland","verticale_belasting_koppelpunt_getrokken_voertuig","zuinigheidsclassificatie","registratie_datum_goedkeuring_afschrijvingsmoment_bpm","registratie_datum_goedkeuring_afschrijvingsmoment_bpm_dt","gem_lading_wrde","aerodyn_voorz","massa_alt_aandr","verl_cab_ind","api_gekentekende_voertuigen_assen","api_gekentekende_voertuigen_brandstof","api_gekentekende_voertuigen_carrosserie","api_gekentekende_voertuigen_carrosserie_specifiek","api_gekentekende_voertuigen_voertuigklasse"
"G500TZ","Personenauto","PORSCHE","911 TARGA 4 GTS","20260428","20191202","27318","cabriolet","4","GRIJS","Niet geregistreerd","6","2981","1580","2040","1680",,,"20190801","20191202","Geen verstrekking in Open Data","207229","Ja","306",,,,,,"2","4","0","0",,"453","188","M1",,,,"2040","991",,"e13*2007/46*1187*19","TM22","39","1","0.20","245","Nee","Nee",,"Nee","0","0","0.00","2024","Geen oordeel","05","Ja","2026-04-28T00:00:00.000","2019-12-02T00:00:00.000","2019-08-01T00:00:00.000","2019-12-02T00:00:00.000",,,,,,,,,,,"129",,,,,,,,,,,,,,,,,"https://opendata.rdw.nl/resource/3huj-srit.json","https://opendata.rdw.nl/resource/8ys7-d773.json","https://opendata.rdw.nl/resource/vezc-m2t6.json","https://opendata.rdw.nl/resource/jhie-znh9.json","https://opendata.rdw.nl/resource/kmfi-hrps.json"
"GB405G","Personenauto","PORSCHE","911 TARGA 4 GTS","20250404","20150404","27295","cabriolet","4","BLAUW","Niet geregistreerd","6","3800","1555","1980","1655",,,"20150404","20150404","Geen verstrekking in Open Data","185051","Ja",,,,,,,"2","4","0","0",,"0","0","M1",,,"r. bodemplaat by voorzitting","1980","991",,"e13*2007/46*1187*11","TC22","21","0","0.19","245","Nee","Nee",,"Nee","0","0",,"2024","Logisch","00","Ja","2025-04-04T00:00:00.000","2015-04-04T00:00:00.000","2015-04-04T00:00:00.000","2015-04-04T00:00:00.000",,,,,,,,,,,,,,,,,,,,,"G",,,,,,,"https://opendata.rdw.nl/resource/3huj-srit.json","https://opendata.rdw.nl/resource/8ys7-d773.json","https://opendata.rdw.nl/resource/vezc-m2t6.json","https://opendata.rdw.nl/resource/jhie-znh9.json","https://opendata.rdw.nl/resource/kmfi-hrps.json"
"GB715Z","Personenauto","PORSCHE","911 TARGA 4 GTS","20241121","20231124","27295","cabriolet","4","ROOD","Niet geregistreerd","6","3800","1555","1980","1655",,,"20150415","20150415","Geen verstrekking in Open Data","206135","Ja",,,,,,,"2","4","0","0",,"0","0","M1",,,"r. bodemplaat by voorzitting","1980","991",,"e13*2007/46*1187*11","TC22","21","0","0.19","245","Nee","Nee",,"Nee","0","0",,"2023","Logisch","00","Ja","2024-11-21T00:00:00.000","2023-11-24T00:00:00.000","2015-04-15T00:00:00.000","2015-04-15T00:00:00.000",,,,,,,,,,,,,,,,,,,,,"G",,,,,,,"https://opendata.rdw.nl/resource/3huj-srit.json","https://opendata.rdw.nl/resource/8ys7-d773.json","https://opendata.rdw.nl/resource/vezc-m2t6.json","https://opendata.rdw.nl/resource/jhie-znh9.json","https://opendata.rdw.nl/resource/kmfi-hrps.json"
"GD498F","Personenauto","PORSCHE","911 TARGA 4 GTS","20240613","20180420","27295","cabriolet","4","ZWART","Niet geregistreerd","6","3800","1555","1980","1655",,,"20150420","20150420","Geen verstrekking in Open Data","205603","Ja",,,,,,,"2","4","0","0",,"0","0","M1",,,"r. bodemplaat by voorzitting","1980","991",,"e13*2007/46*1187*11","TC22","21","0","0.19","245","Nee","Nee",,"Nee","0","0",,"2023","Logisch","00","Ja","2024-06-13T00:00:00.000","2018-04-20T00:00:00.000","2015-04-20T00:00:00.000","2015-04-20T00:00:00.000",,,,,,,,,,,,,,,,,,,,,"G",,,,,,,"https://opendata.rdw.nl/resource/3huj-srit.json","https://opendata.rdw.nl/resource/8ys7-d773.json","https://opendata.rdw.nl/resource/vezc-m2t6.json","https://opendata.rdw.nl/resource/jhie-znh9.json","https://opendata.rdw.nl/resource/kmfi-hrps.json"
"GD722P","Personenauto","PORSCHE","911 TARGA 4 GTS","20250429","20150428","27295","cabriolet","4","GRIJS","Niet geregistreerd","6","3800","1555","1980","1655",,,"20150428","20150428","Geen verstrekking in Open Data","203086","Ja",,,,,,,"2","4","0","0",,"0","0","M1",,,"r. bodemplaat by voorzitting","1980","991",,"e13*2007/46*1187*11","TC22","21","0","0.19","245","Nee","Nee",,"Nee","0","0",,"2024","Logisch","00","Ja","2025-04-29T00:00:00.000","2015-04-28T00:00:00.000","2015-04-28T00:00:00.000","2015-04-28T00:00:00.000",,,,,,,,,,,,,,,,,,,,,"G",,,,,,,"https://opendata.rdw.nl/resource/3huj-srit.json","https://opendata.rdw.nl/resource/8ys7-d773.json","https://opendata.rdw.nl/resource/vezc-m2t6.json","https://opendata.rdw.nl/resource/jhie-znh9.json","https://opendata.rdw.nl/resource/kmfi-hrps.json"
"GJ437V","Personenauto","PORSCHE","911 TARGA 4 GTS","20240610","20240428","27295","cabriolet","4","BLAUW","Niet geregistreerd","6","3800","1555","1980","1655",,,"20150610","20150610","Geen verstrekking in Open Data","196736","Ja",,,,,,,"2","4","0","0",,"0","0","M1",,,"r. bodemplaat by voorzitting","1980","991",,"e13*2007/46*1187*11","TC22","21","0","0.19","245","Nee","Nee",,"Nee","0","0",,"2023","Logisch","00","Ja","2024-06-10T00:00:00.000","2024-04-28T00:00:00.000","2015-06-10T00:00:00.000","2015-06-10T00:00:00.000",,,,,,,,,,,,,,,,,,,,,"G",,,,,,,"https://opendata.rdw.nl/resource/3huj-srit.json","https://opendata.rdw.nl/resource/8ys7-d773.json","https://opendata.rdw.nl/resource/vezc-m2t6.json","https://opendata.rdw.nl/resource/jhie-znh9.json","https://opendata.rdw.nl/resource/kmfi-hrps.json"
"GL549D","Personenauto","PORSCHE","911 TARGA 4 GTS","20240627","20180425","27295","cabriolet","4","GRIJS","Niet geregistreerd","6","3800","1555","1980","1655",,,"20150626","20150626","Geen verstrekking in Open Data","187111","Ja",,,,,,,"2","4","0","0",,"0","0","M1",,,"r. bodemplaat by voorzitting","1980","991",,"e13*2007/46*1187*11","TC22","21","0","0.19","245","Nee","Nee",,"Nee","0","0",,"2023","Logisch","00","Ja","2024-06-27T00:00:00.000","2018-04-25T00:00:00.000","2015-06-26T00:00:00.000","2015-06-26T00:00:00.000",,,,,,,,,,,,,,,,,,,,,"G",,,,,,,"https://opendata.rdw.nl/resource/3huj-srit.json","https://opendata.rdw.nl/resource/8ys7-d773.json","https://opendata.rdw.nl/resource/vezc-m2t6.json","https://opendata.rdw.nl/resource/jhie-znh9.json","https://opendata.rdw.nl/resource/kmfi-hrps.json"
"GN086P","Personenauto","PORSCHE","911 TARGA 4 GTS","20240703","20170904","27295","cabriolet","4","GRIJS","Niet geregistreerd","6","3800","1555","1980","1655",,,"20150703","20150703","Geen verstrekking in Open Data","196243","Ja",,,,,,,"2","4","0","0",,"0","0","M1",,,"r. bodemplaat by voorzitting","1980","991",,"e13*2007/46*1187*11","TC22","21","0","0.19","245","Nee","Nee",,"Nee","0","0",,"2023","Logisch","00","Ja","2024-07-03T00:00:00.000","2017-09-04T00:00:00.000","2015-07-03T00:00:00.000","2015-07-03T00:00:00.000",,,,,,,,,,,,,,,,,,,,,"G",,,,,,,"https://opendata.rdw.nl/resource/3huj-srit.json","https://opendata.rdw.nl/resource/8ys7-d773.json","https://opendata.rdw.nl/resource/vezc-m2t6.json","https://opendata.rdw.nl/resource/jhie-znh9.json","https://opendata.rdw.nl/resource/kmfi-hrps.json"
"GN591B","Personenauto","PORSCHE","911 TARGA 4 GTS","20240721","20160513","27295","cabriolet","4","ZWART","Niet geregistreerd","6","3800","1555","1980","1655",,,"20150721","20150721","Geen verstrekking in Open Data","191900","Ja",,,,,,,"2","4","0","0",,"0","0","M1",,,"r. bodemplaat by voorzitting","1980","991",,"e13*2007/46*1187*11","TC22","21","0","0.19","245","Nee","Nee",,"Nee","0","0",,"2023","Logisch","00","Ja","2024-07-21T00:00:00.000","2016-05-13T00:00:00.000","2015-07-21T00:00:00.000","2015-07-21T00:00:00.000",,,,,,,,,,,,,,,,,,,,,"G",,,,,,,"https://opendata.rdw.nl/resource/3huj-srit.json","https://opendata.rdw.nl/resource/8ys7-d773.json","https://opendata.rdw.nl/resource/vezc-m2t6.json","https://opendata.rdw.nl/resource/jhie-znh9.json","https://opendata.rdw.nl/resource/kmfi-hrps.json"
"GP635G","Personenauto","PORSCHE","911 TARGA 4 GTS","20240712","20180315","27295","cabriolet","4","ROOD","Niet geregistreerd","6","3800","1555","1980","1655",,,"20150711","20150711","Geen verstrekking in Open Data","200759","Ja",,,,,,,"2","4","0","0",,"0","0","M1",,,"r. bodemplaat by voorzitting","1980","991",,"e13*2007/46*1187*11","TC22","21","0","0.19","245","Nee","Nee",,"Nee","0","0",,"2023","Logisch","00","Ja","2024-07-12T00:00:00.000","2018-03-15T00:00:00.000","2015-07-11T00:00:00.000","2015-07-11T00:00:00.000",,,,,,,,,,,,,,,,,,,,,"G",,,,,,,"https://opendata.rdw.nl/resource/3huj-srit.json","https://opendata.rdw.nl/resource/8ys7-d773.json","https://opendata.rdw.nl/resource/vezc-m2t6.json","https://opendata.rdw.nl/resource/jhie-znh9.json","https://opendata.rdw.nl/resource/kmfi-hrps.json"
"GR322F","Personenauto","PORSCHE","911 TARGA 4 GTS","20250203","20170102","27295","cabriolet","4","ZWART","Niet geregistreerd","6","3800","1555","1980","1655",,,"20150723","20150723","Geen verstrekking in Open Data","198327","Ja",,,,,,,"2","4","0","0",,"0","0","M1",,,"r. bodemplaat by voorzitting","1980","991",,"e13*2007/46*1187*11","TC22","21","0","0.19","245","Nee","Nee",,"Nee","0","0",,"2024","Logisch","00","Ja","2025-02-03T00:00:00.000","2017-01-02T00:00:00.000","2015-07-23T00:00:00.000","2015-07-23T00:00:00.000",,,,,,,,,,,,,,,,,,,,,"G",,,,,,,"https://opendata.rdw.nl/resource/3huj-srit.json","https://opendata.rdw.nl/resource/8ys7-d773.json","https://opendata.rdw.nl/resource/vezc-m2t6.json","https://opendata.rdw.nl/resource/jhie-znh9.json","https://opendata.rdw.nl/resource/kmfi-hrps.json"
"GS269G","Personenauto","PORSCHE","911 TARGA 4 GTS","20250322","20190509","20658","cabriolet","4","ZWART","Niet geregistreerd","6","3800","1555","1980","1655",,,"20150331","20150821","Geen verstrekking in Open Data","197728","Ja",,,,,,,"2","4","0","0",,"0","0","M1",,,"r. bodemplaat by voorzitting","1980","991",,"e13*2007/46*1187*11","TC22","21","0","0.19","245","Nee","Nee",,"Nee","0","0",,"2024","Geen oordeel","05","Ja","2025-03-22T00:00:00.000","2019-05-09T00:00:00.000","2015-03-31T00:00:00.000","2015-08-21T00:00:00.000",,,,,,,,,,,,,,,,,,,,,"G",,,,,,,"https://opendata.rdw.nl/resource/3huj-srit.json","https://opendata.rdw.nl/resource/8ys7-d773.json","https://opendata.rdw.nl/resource/vezc-m2t6.json","https://opendata.rdw.nl/resource/jhie-znh9.json","https://opendata.rdw.nl/resource/kmfi-hrps.json"
"GT091S","Personenauto","PORSCHE","911 TARGA 4 GTS","20240805","20160331","27295","cabriolet","4","GRIJS","Niet geregistreerd","6","3800","1555","1980","1655",,,"20150820","20150820","Geen verstrekking in Open Data","196829","Ja",,,,,,,"2","4","0","0",,"0","0","M1",,,"r. bodemplaat by voorzitting","1980","991",,"e13*2007/46*1187*11","TC22","21","0","0.19","245","Nee","Nee",,"Nee","0","0",,"2022","Logisch","00","Ja","2024-08-05T00:00:00.000","2016-03-31T00:00:00.000","2015-08-20T00:00:00.000","2015-08-20T00:00:00.000",,,,,,,,,,,,,,,,,,,,,"G",,,,,,,"https://opendata.rdw.nl/resource/3huj-srit.json","https://opendata.rdw.nl/resource/8ys7-d773.json","https://opendata.rdw.nl/resource/vezc-m2t6.json","https://opendata.rdw.nl/resource/jhie-znh9.json","https://opendata.rdw.nl/resource/kmfi-hrps.json"
"GX897Z","Personenauto","PORSCHE","911 TARGA 4 GTS","20241205","20190227","27295","cabriolet","4","GRIJS","Niet geregistreerd","6","3800","1555","1980","1655",,,"20150915","20150915","Geen verstrekking in Open Data","207934","Ja",,,,,,,"2","4","0","0",,"0","0","M1",,,"r. bodemplaat by voorzitting","1980","991",,"e13*2007/46*1187*11","TC22","21","0","0.19","245","Nee","Nee",,"Nee","0","0",,"2023","Logisch","00","Ja","2024-12-05T00:00:00.000","2019-02-27T00:00:00.000","2015-09-15T00:00:00.000","2015-09-15T00:00:00.000",,,,,,,,,,,,,,,,,,,,,"G",,,,,,,"https://opendata.rdw.nl/resource/3huj-srit.json","https://opendata.rdw.nl/resource/8ys7-d773.json","https://opendata.rdw.nl/resource/vezc-m2t6.json","https://opendata.rdw.nl/resource/jhie-znh9.json","https://opendata.rdw.nl/resource/kmfi-hrps.json"
"H053KN","Personenauto","PORSCHE","911 TARGA 4 GTS","20260417","20200228","26366","cabriolet","4","GRIJS","Niet geregistreerd","6","2981","1580","2040","1680",,,"20180410","20200228","Geen verstrekking in Open Data","207263","Ja","306",,,,,,"2","4","0","0",,"453","0","M1",,,,"2040","991",,"e13*2007/46*1187*16","TM22","29","0","0.20","245","Nee","Nee",,"Nee","0","0","0.00","2024","Geen oordeel","05","Ja","2026-04-17T00:00:00.000","2020-02-28T00:00:00.000","2018-04-10T00:00:00.000","2020-02-28T00:00:00.000",,,,,,,,,,,"129",,,,,,,,,,"G",,,,,,,"https://opendata.rdw.nl/resource/3huj-srit.json","https://opendata.rdw.nl/resource/8ys7-d773.json","https://opendata.rdw.nl/resource/vezc-m2t6.json","https://opendata.rdw.nl/resource/jhie-znh9.json","https://opendata.rdw.nl/resource/kmfi-hrps.json"
"H612SN","Personenauto","PORSCHE","911 TARGA 4 GTS","20241114","20200501","30915","cabriolet","4","GRIJS","Niet geregistreerd","6","2981","1580","2040","1680",,,"20181114","20200501","Geen verstrekking in Open Data","220237","Ja",,,,,,,"2","4","0","0",,"453","0","M1",,,"r. bodemplaat by voorzitting","2040","991",,"e13*2007/46*1187*19","TM22","39","0","0.20","245","Nee","Nee",,"Nee","0","0","0.00","2022","Geen oordeel","05","Ja","2024-11-14T00:00:00.000","2020-05-01T00:00:00.000","2018-11-14T00:00:00.000","2020-05-01T00:00:00.000",,,,,,,,,,,"129",,,,,,,,,,,,,,,,,"https://opendata.rdw.nl/resource/3huj-srit.json","https://opendata.rdw.nl/resource/8ys7-d773.json","https://opendata.rdw.nl/resource/vezc-m2t6.json","https://opendata.rdw.nl/resource/jhie-znh9.json","https://opendata.rdw.nl/resource/kmfi-hrps.json"
"H796VD","Personenauto","PORSCHE","911 TARGA 4 GTS","20250118","20220929","33240","cabriolet","4","ROOD","Niet geregistreerd","6","2981","1580","2040","1680",,,"20190118","20200527","Geen verstrekking in Open Data","199826","Ja","306",,,,,,"2","4","0","0",,"453","0","M1",,,,"2040","991",,"e13*2007/46*1187*19","TM22","39","1","0.20","245","Nee","Nee",,"Nee","0","0","0.00","2023","Geen oordeel","05","Ja","2025-01-18T00:00:00.000","2022-09-29T00:00:00.000","2019-01-18T00:00:00.000","2020-05-27T00:00:00.000",,,,,,,,,,,"129",,,,,,,,,,,,,,,,,"https://opendata.rdw.nl/resource/3huj-srit.json","https://opendata.rdw.nl/resource/8ys7-d773.json","https://opendata.rdw.nl/resource/vezc-m2t6.json","https://opendata.rdw.nl/resource/jhie-znh9.json","https://opendata.rdw.nl/resource/kmfi-hrps.json"
"H808SP","Personenauto","PORSCHE","911 TARGA 4 GTS","20240623","20200504","26423","cabriolet","4","GRIJS","Niet geregistreerd","6","2981","1580","2040","1680",,,"20180621","20200504","Geen verstrekking in Open Data","198018","Ja",,,,,,,"2","4","0","0",,"453","0","M1",,,"r. bodemplaat by voorzitting","2040","991",,"e13*2007/46*1187*18","TM22","29","0","0.20","245","Nee","Nee",,"Nee","0","0","0.00","2022","Geen oordeel","05","Ja","2024-06-23T00:00:00.000","2020-05-04T00:00:00.000","2018-06-21T00:00:00.000","2020-05-04T00:00:00.000",,,,,,,,,,,"129",,,,,,,,,,"G",,,,,,,"https://opendata.rdw.nl/resource/3huj-srit.json","https://opendata.rdw.nl/resource/8ys7-d773.json","https://opendata.rdw.nl/resource/vezc-m2t6.json","https://opendata.rdw.nl/resource/jhie-znh9.json","https://opendata.rdw.nl/resource/kmfi-hrps.json"
"HB063B","Personenauto","PORSCHE","911 TARGA 4 GTS","20240622","20230405","21979","cabriolet","4","GRIJS","Niet geregistreerd","6","3800","1555","1980","1655",,,"20150528","20150925","Geen verstrekking in Open Data","181107","Ja",,,,,,,"2","4","0","0",,"0","0","M1",,,"r. bodemplaat by voorzitting","1980","991",,"e13*2007/46*1187*11","TC22","21","0","0.19","245","Nee","Nee",,"Nee","0","0",,"2023","Geen oordeel","05","Ja","2024-06-22T00:00:00.000","2023-04-05T00:00:00.000","2015-05-28T00:00:00.000","2015-09-25T00:00:00.000",,,,,,,,,,,,,,,,,,,,,"G",,,,,,,"https://opendata.rdw.nl/resource/3huj-srit.json","https://opendata.rdw.nl/resource/8ys7-d773.json","https://opendata.rdw.nl/resource/vezc-m2t6.json","https://opendata.rdw.nl/resource/jhie-znh9.json","https://opendata.rdw.nl/resource/kmfi-hrps.json"
"HD368B","Personenauto","PORSCHE","911 TARGA 4 GTS","20240720","20200106","27295","cabriolet","4","GROEN","Niet geregistreerd","6","3800","1555","1980","1655",,,"20150930","20150930","Geen verstrekking in Open Data","189865","Ja",,,,,,,"2","4","0","0",,"0","0","M1",,,"r. bodemplaat by voorzitting","1980","991",,"e13*2007/46*1187*11","TC22","21","0","0.19","245","Nee","Nee",,"Nee","0","0",,"2023","Logisch","00","Ja","2024-07-20T00:00:00.000","2020-01-06T00:00:00.000","2015-09-30T00:00:00.000","2015-09-30T00:00:00.000",,,,,,,,,,,,,,,,,,,,,"G",,,,,,,"https://opendata.rdw.nl/resource/3huj-srit.json","https://opendata.rdw.nl/resource/8ys7-d773.json","https://opendata.rdw.nl/resource/vezc-m2t6.json","https://opendata.rdw.nl/resource/jhie-znh9.json","https://opendata.rdw.nl/resource/kmfi-hrps.json"
"HF546B","Personenauto","PORSCHE","911 TARGA 4 GTS","20240706","20151010","27295","cabriolet","4","GRIJS","Niet geregistreerd","6","3800","1555","1980","1655",,,"20151010","20151010","Geen verstrekking in Open Data","196978","Ja",,,,,,,"2","4","0","0",,"449","185","M1",,,"onder r. voorzitting","1980","991",,"e13*2007/46*1187*11","TC22","21","0","0.19","245","Nee","Nee",,"Nee","0","0",,"2023","Logisch","00","Ja","2024-07-06T00:00:00.000","2015-10-10T00:00:00.000","2015-10-10T00:00:00.000","2015-10-10T00:00:00.000",,,,,,,,,,,"129",,,,,,,,,,"G",,,,,,,"https://opendata.rdw.nl/resource/3huj-srit.json","https://opendata.rdw.nl/resource/8ys7-d773.json","https://opendata.rdw.nl/resource/vezc-m2t6.json","https://opendata.rdw.nl/resource/jhie-znh9.json","https://opendata.rdw.nl/resource/kmfi-hrps.json"
"HT212R","Personenauto","PORSCHE","911 TARGA 4 GTS","20240829","20210310","27295","cabriolet","4","BLAUW","Niet geregistreerd","6","3800","1555","1980","1655",,,"20160104","20160104","Geen verstrekking in Open Data","201413","Ja",,,,,,,"2","4","0","0",,"449","185","M1",,,"onder r. voorzitting","1980","991",,"e13*2007/46*1187*11","TC22","21","0","0.19","245","Nee","Nee",,"Nee","0","0",,"2022","Logisch","00","Ja","2024-08-29T00:00:00.000","2021-03-10T00:00:00.000","2016-01-04T00:00:00.000","2016-01-04T00:00:00.000",,,,,,,,,,,"129",,,,,,,,,,"G",,,,,,,"https://opendata.rdw.nl/resource/3huj-srit.json","https://opendata.rdw.nl/resource/8ys7-d773.json","https://opendata.rdw.nl/resource/vezc-m2t6.json","https://opendata.rdw.nl/resource/jhie-znh9.json","https://opendata.rdw.nl/resource/kmfi-hrps.json"
"J016LP","Personenauto","PORSCHE","911 TARGA 4 GTS","20240601","20230809","28165","cabriolet","4","ZWART","Niet geregistreerd","6","2981","1580","2040","1680",,,"20180522","20200904","Geen verstrekking in Open Data","199090","Ja","306",,,,,,"2","4","0","0",,"453","0","M1",,,,"2040","991",,"e13*2007/46*1187*18","TM22","29","2","0.20","245","Nee","Nee",,"Nee","0","0","0.00","2023","Geen oordeel","05","Ja","2024-06-01T00:00:00.000","2023-08-09T00:00:00.000","2018-05-22T00:00:00.000","2020-09-04T00:00:00.000",,,,,,,,,,,"129",,,,,,,,,,"G",,,,,,,"https://opendata.rdw.nl/resource/3huj-srit.json","https://opendata.rdw.nl/resource/8ys7-d773.json","https://opendata.rdw.nl/resource/vezc-m2t6.json","https://opendata.rdw.nl/resource/jhie-znh9.json","https://opendata.rdw.nl/resource/kmfi-hrps.json"
"J063ZK","Personenauto","PORSCHE","911 TARGA 4 GTS","20241109","20201105","27736","cabriolet","4","ZWART","Niet geregistreerd","6","3800","1555","1980","1655",,,"20150909","20201105","Geen verstrekking in Open Data","181680","Ja","301",,,,,,"2","4","0","0",,"0","185","M1",,,,"1980","991",,"e13*2007/46*1187*11","TC22","21","0","0.19","245","Nee","Nee",,"Nee","0","0",,"2023","Geen oordeel","05","Ja","2024-11-09T00:00:00.000","2020-11-05T00:00:00.000","2015-09-09T00:00:00.000","2020-11-05T00:00:00.000",,,,,,,,,,,,,,,,,,,,,"G",,,,,,,"https://opendata.rdw.nl/resource/3huj-srit.json","https://opendata.rdw.nl/resource/8ys7-d773.json","https://opendata.rdw.nl/resource/vezc-m2t6.json","https://opendata.rdw.nl/resource/jhie-znh9.json","https://opendata.rdw.nl/resource/kmfi-hrps.json"
"J302FD","Personenauto","PORSCHE","911 TARGA 4 GTS","20250911","20220701","28910","cabriolet","4","ZWART","Niet geregistreerd","6","2981","1580","2040","1680",,,"20190828","20200817","Geen verstrekking in Open Data","210175","Ja","306",,,,,,"2","4","0","0",,"453","0","M1",,,,"2040","991",,"e13*2007/46*1187*19","TM22","39","1","0.20","245","Nee","Nee",,"Nee","0","0","0.00","2024","Geen oordeel","05","Ja","2025-09-11T00:00:00.000","2022-07-01T00:00:00.000","2019-08-28T00:00:00.000","2020-08-17T00:00:00.000",,,,,,,,,,,"129",,,,,,,,,,,,,,,,,"https://opendata.rdw.nl/resource/3huj-srit.json","https://opendata.rdw.nl/resource/8ys7-d773.json","https://opendata.rdw.nl/resource/vezc-m2t6.json","https://opendata.rdw.nl/resource/jhie-znh9.json","https://opendata.rdw.nl/resource/kmfi-hrps.json"
"J361JB","Personenauto","PORSCHE","911 TARGA 4 GTS","20240731","20200807","27294","cabriolet","4","GRIJS","Niet geregistreerd","6","3800","1555","1980","1655",,,"20160102","20200807","Geen verstrekking in Open Data","203768","Ja","301",,,,,,"2","4",,,,,,"M1",,,"r. onder voorzitting","1980",,,,,,,"0.19","246","Nee","Nee",,"Nee",,,,"2022","Geen oordeel","05","Ja","2024-07-31T00:00:00.000","2020-08-07T00:00:00.000","2016-01-02T00:00:00.000","2020-08-07T00:00:00.000",,,,,,,,,,,,,,,,,,,,,,,,,,,,"https://opendata.rdw.nl/resource/3huj-srit.json","https://opendata.rdw.nl/resource/8ys7-d773.json","https://opendata.rdw.nl/resource/vezc-m2t6.json","https://opendata.rdw.nl/resource/jhie-znh9.json","https://opendata.rdw.nl/resource/kmfi-hrps.json"