"kenteken","voertuigsoort","merk","handelsbenaming","vervaldatum_apk","datum_tenaamstelling","bruto_bpm","inrichting","aantal_zitplaatsen","eerste_kleur","tweede_kleur","aantal_cilinders","cilinderinhoud","massa_ledig_voertuig","toegestane_maximum_massa_voertuig","massa_rijklaar","maximum_massa_trekken_ongeremd","maximum_trekken_massa_geremd","datum_eerste_toelating","datum_eerste_tenaamstelling_in_nederland","wacht_op_keuren","catalogusprijs","wam_verzekerd","maximale_constructiesnelheid","laadvermogen","oplegger_geremd","aanhangwagen_autonoom_geremd","aanhangwagen_middenas_geremd","aantal_staanplaatsen","aantal_deuren","aantal_wielen","afstand_hart_koppeling_tot_achterzijde_voertuig","afstand_voorzijde_voertuig_tot_hart_koppeling","afwijkende_maximum_snelheid","lengte","breedte","europese_voertuigcategorie","europese_voertuigcategorie_toevoeging","europese_uitvoeringcategorie_toevoeging","plaats_chassisnummer","technische_max_massa_voertuig","type","type_gasinstallatie","typegoedkeuringsnummer","variant","uitvoering","volgnummer_wijziging_eu_typegoedkeuring","vermogen_massarijklaar","wielbasis","export_indicator","openstaande_terugroepactie_indicator","vervaldatum_tachograaf","taxi_indicator","maximum_massa_samenstelling","aantal_rolstoelplaatsen","maximum_ondersteunende_snelheid","jaar_laatste_registratie_tellerstand","tellerstandoordeel","code_toelichting_tellerstandoordeel","tenaamstellen_mogelijk","vervaldatum_apk_dt","datum_tenaamstelling_dt","datum_eerste_toelating_dt","datum_eerste_tenaamstelling_in_nederland_dt","vervaldatum_tachograaf_dt","maximum_last_onder_de_vooras_sen_tezamen_koppeling","type_remsysteem_voertuig_code","rupsonderstelconfiguratiecode","wielbasis_voertuig_minimum","wielbasis_voertuig_maximum","lengte_voertuig_minimum","lengte_voertuig_maximum","breedte_voertuig_minimum","breedte_voertuig_maximum","hoogte_voertuig","hoogte_voertuig_minimum","hoogte_voertuig_maximum","massa_bedrijfsklaar_minimaal","massa_bedrijfsklaar_maximaal","technisch_toelaatbaar_massa_koppelpunt","maximum_massa_technisch_maximaal","maximum_massa_technisch_minimaal","subcategorie_nederland","verticale_belasting_koppelpunt_getrokken_voertuig","zuinigheidsclassificatie","registratie_datum_goedkeuring_afschrijvingsmoment_bpm","registratie_datum_goedkeuring_afschrijvingsmoment_bpm_dt","gem_lading_wrde","aerodyn_voorz","massa_alt_aandr","verl_cab_ind","api_gekentekende_voertuigen_assen","api_gekentekende_voertuigen_brandstof","api_gekentekende_voertuigen_carrosserie","api_gekentekende_voertuigen_carrosserie_specifiek","api_gekentekende_voertuigen_voertuigklasse"
"50SKG7","Personenauto","PORSCHE","911 GT2 RS","20241031","20111026","66276","coupe","2","ZWART","Niet geregistreerd","6","3600","1270","1680","1370",,,"20101014","20111026","Geen verstrekking in Open Data","309700","Ja",,,,,,,"2","4",,,,,,"M1",,,"r. schutbord kofferruimte","1680",,,,,,,"0.33","234","Nee","Nee",,"Nee",,,,"2023","Geen oordeel","05","Ja","2024-10-31T00:00:00.000","2011-10-26T00:00:00.000","2010-10-14T00:00:00.000","2011-10-26T00:00:00.000",,"0",,,,,,,,,,,,,,,,,,,,,,,,,,"https://opendata.rdw.nl/resource/3huj-srit.json","https://opendata.rdw.nl/resource/8ys7-d773.json","https://opendata.rdw.nl/resource/vezc-m2t6.json","https://opendata.rdw.nl/resource/jhie-znh9.json","https://opendata.rdw.nl/resource/kmfi-hrps.json"
"62PJB1","Personenauto","PORSCHE","911 GT2 RS","20241103","20160111","68815","coupe","2","ZWART","Niet geregistreerd","6","3600","1345","1680","1445",,,"20110201","20110201","Geen verstrekking in Open Data",,"Ja",,,,,,,"2","4","0","0",,"447","0","M1",,,"r. kofferruimte","1680","997G",,"e13*KS07/46*0001*03","LZ11","01","0","0.32","235","Nee","Nee",,"Nee","0","0",,"2023","Logisch","00","Ja","2024-11-03T00:00:00.000","2016-01-11T00:00:00.000","2011-02-01T00:00:00.000","2011-02-01T00:00:00.000",,,,,,,,,,,,,,,,,,,,,"G",,,,,,,"https://opendata.rdw.nl/resource/3huj-srit.json","https://opendata.rdw.nl/resource/8ys7-d773.json","https://opendata.rdw.nl/resource/vezc-m2t6.json","https://opendata.rdw.nl/resource/jhie-znh9.json","https://opendata.rdw.nl/resource/kmfi-hrps.json"
"H768FF","Personenauto","PORSCHE","911 GT2 RS","20260507","20200114","59838","coupe","2","GRIJS","Niet geregistreerd","6","3800","1445","1830","1545",,,"20180507","20200114","Geen verstrekking in Open Data","352883","Ja","340",,,,,,"2","4","0","0",,"455","188","M1",,,"r. bodemplaat by voorzitting","1830","991G",,"e13*KS07/46*0015*02","CY12","09","0","0.33","245","Nee","Nee",,"Nee","0","0","0.00","2024","Geen oordeel","05","Ja","2026-05-07T00:00:00.000","2020-01-14T00:00:00.000","2018-05-07T00:00:00.000","2020-01-14T00:00:00.000",,,,,,,,,,,"130",,,,,,,,,,"G",,,,,,,"https://opendata.rdw.nl/resource/3huj-srit.json","https://opendata.rdw.nl/resource/8ys7-d773.json","https://opendata.rdw.nl/resource/vezc-m2t6.json","https://opendata.rdw.nl/resource/jhie-znh9.json","https://opendata.rdw.nl/resource/kmfi-hrps.json"
"J264NG","Personenauto","PORSCHE","911 GT2 RS","20260221","20240229","59838","coupe","2","GROEN","Niet geregistreerd","6","3800","1445","1830","1545",,,"20180515","20200909","Geen verstrekking in Open Data","352883","Ja","340",,,,,,"2","4","0","0",,"455","188","M1",,,,"1830","991G",,"e13*KS07/46*0015*02","CY12","09","0","0.33","245","Nee","Nee",,"Nee","0","0","0.00","2024","Geen oordeel","05","Ja","2026-02-21T00:00:00.000","2024-02-29T00:00:00.000","2018-05-15T00:00:00.000","2020-09-09T00:00:00.000",,,,,,,,,,,"130",,,,,,,,,,"G",,,,,,,"https://opendata.rdw.nl/resource/3huj-srit.json","https://opendata.rdw.nl/resource/8ys7-d773.json","https://opendata.rdw.nl/resource/vezc-m2t6.json","https://opendata.rdw.nl/resource/jhie-znh9.json","https://opendata.rdw.nl/resource/kmfi-hrps.json"
"KJ302X","Personenauto","PORSCHE","911 GT2 RS","20200819","20160922","51790","coupe","2","ROOD","Niet geregistreerd","6","3600","1345","1680","1445",,,"20101006","20160922","Geen verstrekking in Open Data","309698","Ja",,,,,,,"2","4","0","0",,"447","0","M1",,,"r. tegen schutbord in kofferruimte","1680","997 TURBO",,"e13*2001/116*0177*08","LZ11","02","0","0.32","235","Nee","Nee",,"Nee","0","0",,"2019","Geen oordeel","05","Ja","2020-08-19T00:00:00.000","2016-09-22T00:00:00.000","2010-10-06T00:00:00.000","2016-09-22T00:00:00.000",,,,,,,,,,,,,,,,,,,,,"G",,,,,,,"https://opendata.rdw.nl/resource/3huj-srit.json","https://opendata.rdw.nl/resource/8ys7-d773.json","https://opendata.rdw.nl/resource/vezc-m2t6.json","https://opendata.rdw.nl/resource/jhie-znh9.json","https://opendata.rdw.nl/resource/kmfi-hrps.json"
"L032RV","Personenauto","PORSCHE","911 GT2 RS","20240721","20210804","59835","coupe","2","GROEN","Niet geregistreerd","6","3800","1445","1830","1545",,,"20180721","20210804","Geen verstrekking in Open Data","352883","Ja","340",,,,,,"2","4","0","0",,"455","188","M1",,,,"1830","991G",,"e13*KS07/46*0015*02","CY12","09","0","0.33","245","Nee","Nee",,"Nee","0","0","0.00","2022","Geen oordeel","05","Ja","2024-07-21T00:00:00.000","2021-08-04T00:00:00.000","2018-07-21T00:00:00.000","2021-08-04T00:00:00.000",,,,,,,,,,,"130",,,,,,,,,,,,,,,,,"https://opendata.rdw.nl/resource/3huj-srit.json","https://opendata.rdw.nl/resource/8ys7-d773.json","https://opendata.rdw.nl/resource/vezc-m2t6.json","https://opendata.rdw.nl/resource/jhie-znh9.json","https://opendata.rdw.nl/resource/kmfi-hrps.json"
"L834RL","Personenauto","PORSCHE","911 GT2 RS","20230714","20210709","51790","coupe","2","WIT","ZWART","6","3600","1345","1680","1445",,,"20120329","20210709","Geen verstrekking in Open Data","239103","Ja","330",,,,,,"2","4","0","0",,"447","185","M1",,,"r. tegen schutbord in kofferruimte","1680","997 TURBO",,"e13*2001/116*0177*08","LZ11","02","0","0.32","235","Nee","Nee",,"Nee","0","0",,"2022","Geen oordeel","05","Ja","2023-07-14T00:00:00.000","2021-07-09T00:00:00.000","2012-03-29T00:00:00.000","2021-07-09T00:00:00.000",,,,,,,,,,,"129",,,,,,,,,,,,,,,,,"https://opendata.rdw.nl/resource/3huj-srit.json","https://opendata.rdw.nl/resource/8ys7-d773.json","https://opendata.rdw.nl/resource/vezc-m2t6.json","https://opendata.rdw.nl/resource/jhie-znh9.json","https://opendata.rdw.nl/resource/kmfi-hrps.json"
"P055DS","Personenauto","PORSCHE","911 GT2 RS","20250117","20220210","59838","coupe","2","BLAUW","ZWART","6","3800","1445","1830","1545",,,"20190115","20220210","Geen verstrekking in Open Data","399759","Ja","340",,,,,,"2","4","0","0",,"455","188","M1",,,,"1830","991G",,"e13*KS07/46*0015*02","CY12","09","0","0.33","245","Nee","Nee",,"Nee","0","0","0.00","2023","Geen oordeel","05","Ja","2025-01-17T00:00:00.000","2022-02-10T00:00:00.000","2019-01-15T00:00:00.000","2022-02-10T00:00:00.000",,,,,,,,,,,"130",,,,,,,,,,,"20220202","2022-02-02T00:00:00.000",,,,,"https://opendata.rdw.nl/resource/3huj-srit.json","https://opendata.rdw.nl/resource/8ys7-d773.json","https://opendata.rdw.nl/resource/vezc-m2t6.json","https://opendata.rdw.nl/resource/jhie-znh9.json","https://opendata.rdw.nl/resource/kmfi-hrps.json"
"P222PG","Personenauto","PORSCHE","911 GT2 RS","20240713","20220517","59838","coupe","2","GROEN","Niet geregistreerd","6","3800","1445","1830","1545",,,"20180713","20220517","Geen verstrekking in Open Data","352883","Ja","340",,,,,,"2","4","0","0",,"455","188","M1",,,,"1830","991G",,"e13*KS07/46*0015*02","CY12","09","0","0.33","245","Nee","Nee",,"Nee","0","0","0.00","2022","Geen oordeel","05","Ja","2024-07-13T00:00:00.000","2022-05-17T00:00:00.000","2018-07-13T00:00:00.000","2022-05-17T00:00:00.000",,,,,,,,,,,"130",,,,,,,,,,,"20220428","2022-04-28T00:00:00.000",,,,,"https://opendata.rdw.nl/resource/3huj-srit.json","https://opendata.rdw.nl/resource/8ys7-d773.json","https://opendata.rdw.nl/resource/vezc-m2t6.json","https://opendata.rdw.nl/resource/jhie-znh9.json","https://opendata.rdw.nl/resource/kmfi-hrps.json"
"P451TF","Personenauto","PORSCHE","911 GT2 RS","20240801","20220721","51790","coupe","2","ZWART","Niet geregistreerd","6","3600","1345","1680","1445",,,"20101122","20220721","Geen verstrekking in Open Data","309698","Ja","330",,,,,,"2","4","0","0",,"447","185","M1",,,,"1680","997G",,"e13*KS07/46*0001*02","LZ11","01","0","0.32","235","Nee","Nee",,"Nee","0","0",,"2023","Geen oordeel","05","Ja","2024-08-01T00:00:00.000","2022-07-21T00:00:00.000","2010-11-22T00:00:00.000","2022-07-21T00:00:00.000",,,,,,,,,,,"129",,,,,,,,,,,"20220530","2022-05-30T00:00:00.000",,,,,"https://opendata.rdw.nl/resource/3huj-srit.json","https://opendata.rdw.nl/resource/8ys7-d773.json","https://opendata.rdw.nl/resource/vezc-m2t6.json","https://opendata.rdw.nl/resource/jhie-znh9.json","https://opendata.rdw.nl/resource/kmfi-hrps.json"
"R102PR","Personenauto","PORSCHE","911 GT2 RS","20250130","20221027","59838","coupe","2","GRIJS","Niet geregistreerd","6","3800","1445","1830","1545",,,"20180607","20221027","Geen verstrekking in Open Data","352883","Ja","340",,,,,,"2","4","0","0",,"455","188","M1",,,,"1830","991G",,"e13*KS07/46*0015*02","CY12","09","0","0.33","245","Nee","Nee",,"Nee","0","0","0.00","2023","Geen oordeel","05","Ja","2025-01-30T00:00:00.000","2022-10-27T00:00:00.000","2018-06-07T00:00:00.000","2022-10-27T00:00:00.000",,,,,,,,,,,"130",,,,,,,,,,,"20221025","2022-10-25T00:00:00.000",,,,,"https://opendata.rdw.nl/resource/3huj-srit.json","https://opendata.rdw.nl/resource/8ys7-d773.json","https://opendata.rdw.nl/resource/vezc-m2t6.json","https://opendata.rdw.nl/resource/jhie-znh9.json","https://opendata.rdw.nl/resource/kmfi-hrps.json"
"RP872P","Personenauto","PORSCHE","911 GT2 RS","20260105","20180105","61440","coupe","2","ZWART","Niet geregistreerd","6","3800","1445","1830","1545",,,"20180105","20180105","Geen verstrekking in Open Data","396687","Ja",,,,,,,"2","4","0","0",,"455","188","M1",,,"onder r. voorzitting","1830","991G",,"e13*KS07/46*0015*02","CY12","09","0","0.33","245","Nee","Nee",,"Nee","0","0","0.00","2023","Logisch","00","Ja","2026-01-05T00:00:00.000","2018-01-05T00:00:00.000","2018-01-05T00:00:00.000","2018-01-05T00:00:00.000",,,,,,,,,,,"130",,,,,,,,,,"G",,,,,,,"https://opendata.rdw.nl/resource/3huj-srit.json","https://opendata.rdw.nl/resource/8ys7-d773.json","https://opendata.rdw.nl/resource/vezc-m2t6.json","https://opendata.rdw.nl/resource/jhie-znh9.json","https://opendata.rdw.nl/resource/kmfi-hrps.json"
"RR101B","Personenauto","PORSCHE","911 GT2 RS","20260116","20180106","61440","coupe","2","GRIJS","Niet geregistreerd","6","3800","1445","1830","1545",,,"20180106","20180106","Geen verstrekking in Open Data","406167","Ja",,,,,,,"2","4","0","0",,"455","188","M1",,,"onder r. voorzitting","1830","991G",,"e13*KS07/46*0015*02","CY12","09","0","0.33","245","Nee","Nee",,"Nee","0","0","0.00","2024","Logisch","00","Ja","2026-01-16T00:00:00.000","2018-01-06T00:00:00.000","2018-01-06T00:00:00.000","2018-01-06T00:00:00.000",,,,,,,,,,,"130",,,,,,,,,,"G",,,,,,,"https://opendata.rdw.nl/resource/3huj-srit.json","https://opendata.rdw.nl/resource/8ys7-d773.json","https://opendata.rdw.nl/resource/vezc-m2t6.json","https://opendata.rdw.nl/resource/jhie-znh9.json","https://opendata.rdw.nl/resource/kmfi-hrps.json"
"RS789Z","Personenauto","PORSCHE","911 GT2 RS","20260206","20231003","61599","coupe","2","ROOD","Niet geregistreerd","6","3800","1445","1830","1545",,,"20180126","20180126","Geen verstrekking in Open Data","398327","Ja",,,,,,,"2","4","0","0",,"455","188","M1",,,"onder r. voorzitting","1830","991G",,"e13*KS07/46*0015*02","CY12","09","0","0.33","245","Nee","Nee",,"Nee","0","0","0.00","2024","Logisch","00","Ja","2026-02-06T00:00:00.000","2023-10-03T00:00:00.000","2018-01-26T00:00:00.000","2018-01-26T00:00:00.000",,,,,,,,,,,"130",,,,,,,,,,"G",,,,,,,"https://opendata.rdw.nl/resource/3huj-srit.json","https://opendata.rdw.nl/resource/8ys7-d773.json","https://opendata.rdw.nl/resource/vezc-m2t6.json","https://opendata.rdw.nl/resource/jhie-znh9.json","https://opendata.rdw.nl/resource/kmfi-hrps.json"
"RT290R","Personenauto","PORSCHE","911 GT2 RS","20251025","20230420","61599","coupe","2","GRIJS","Niet geregistreerd","6","3800","1445","1830","1545",,,"20180131","20180131","Geen verstrekking in Open Data","409793","Ja",,,,,,,"2","4","0","0",,"455","188","M1",,,"onder r. voorzitting","1830","991G",,"e13*KS07/46*0015*02","CY12","09","0","0.33","245","Nee","Nee",,"Nee","0","0","0.00","2023","Logisch","00","Ja","2025-10-25T00:00:00.000","2023-04-20T00:00:00.000","2018-01-31T00:00:00.000","2018-01-31T00:00:00.000",,,,,,,,,,,"130",,,,,,,,,,"G",,,,,,,"https://opendata.rdw.nl/resource/3huj-srit.json","https://opendata.rdw.nl/resource/8ys7-d773.json","https://opendata.rdw.nl/resource/vezc-m2t6.json","https://opendata.rdw.nl/resource/jhie-znh9.json","https://opendata.rdw.nl/resource/kmfi-hrps.json"
"RV142V","Personenauto","PORSCHE","911 GT2 RS","20250908","20180511","61599","coupe","2","ROOD","Niet geregistreerd","6","3800","1445","1830","1545",,,"20180214","20180214","Geen verstrekking in Open Data","400726","Ja",,,,,,,"2","4","0","0",,"455","188","M1",,,"onder r. voorzitting","1830","991G",,"e13*KS07/46*0015*02","CY12","09","0","0.33","245","Nee","Nee",,"Nee","0","0","0.00","2023","Logisch","00","Ja","2025-09-08T00:00:00.000","2018-05-11T00:00:00.000","2018-02-14T00:00:00.000","2018-02-14T00:00:00.000",,,,,,,,,,,"130",,,,,,,,,,"G",,,,,,,"https://opendata.rdw.nl/resource/3huj-srit.json","https://opendata.rdw.nl/resource/8ys7-d773.json","https://opendata.rdw.nl/resource/vezc-m2t6.json","https://opendata.rdw.nl/resource/jhie-znh9.json","https://opendata.rdw.nl/resource/kmfi-hrps.json"
"RX894L","Personenauto","PORSCHE","911 GT2 RS","20251128","20240130","61599","coupe","2","GRIJS","Niet geregistreerd","6","3800","1445","1830","1545",,,"20180303","20180303","Geen verstrekking in Open Data","402108","Ja",,,,,,,"2","4","0","0",,"455","188","M1",,,"onder r. voorzitting","1830","991G",,"e13*KS07/46*0015*02","CY12","09","0","0.33","245","Nee","Nee",,"Nee","0","0","0.00","2024","Logisch","00","Ja","2025-11-28T00:00:00.000","2024-01-30T00:00:00.000","2018-03-03T00:00:00.000","2018-03-03T00:00:00.000",,,,,,,,,,,"130",,,,,,,,,,"G",,,,,,,"https://opendata.rdw.nl/resource/3huj-srit.json","https://opendata.rdw.nl/resource/8ys7-d773.json","https://opendata.rdw.nl/resource/vezc-m2t6.json","https://opendata.rdw.nl/resource/jhie-znh9.json","https://opendata.rdw.nl/resource/kmfi-hrps.json"
"S051GV","Personenauto","PORSCHE","911 GT2 RS","20250116","20231020","59838","coupe","2","ROOD","Niet geregistreerd","6","3800","1445","1830","1545",,,"20180619","20230901","Geen verstrekking in Open Data","402745","Ja","340",,,,,,"2","4","0","0",,"455","188","M1",,,,"1830","991G",,"e13*KS07/46*0015*02","CY12","09","0","0.33","245","Nee","Nee",,"Nee","0","0","0.00","2023","Geen oordeel","05","Ja","2025-01-16T00:00:00.000","2023-10-20T00:00:00.000","2018-06-19T00:00:00.000","2023-09-01T00:00:00.000",,,,,,,,,,,"130",,,,,,,,,,,"20230111","2023-01-11T00:00:00.000",,,,,"https://opendata.rdw.nl/resource/3huj-srit.json","https://opendata.rdw.nl/resource/8ys7-d773.json","https://opendata.rdw.nl/resource/vezc-m2t6.json","https://opendata.rdw.nl/resource/jhie-znh9.json","https://opendata.rdw.nl/resource/kmfi-hrps.json"
"S684PV","Personenauto","PORSCHE","911 GT2 RS","20250317","20230317","59833","coupe","2","GRIJS","Niet geregistreerd","6","3800","1445","1830","1545",,,"20180321","20230317","Geen verstrekking in Open Data","384297","Ja","340",,,,,,"2","4","0","0",,"455","188","M1",,,,"1830","991G",,"e13*KS07/46*0015*02","CY12","09","0","0.33","245","Nee","Nee",,"Nee","0","0","0.00","2023","Geen oordeel","05","Ja","2025-03-17T00:00:00.000","2023-03-17T00:00:00.000","2018-03-21T00:00:00.000","2023-03-17T00:00:00.000",,,,,,,,,,,"130",,,,,,,,,,,"20230315","2023-03-15T00:00:00.000",,,,,"https://opendata.rdw.nl/resource/3huj-srit.json","https://opendata.rdw.nl/resource/8ys7-d773.json","https://opendata.rdw.nl/resource/vezc-m2t6.json","https://opendata.rdw.nl/resource/jhie-znh9.json","https://opendata.rdw.nl/resource/kmfi-hrps.json"
"SK297N","Personenauto","PORSCHE","911 GT2 RS","20260418","20180822","61599","coupe","2","GRIJS","Niet geregistreerd","6","3800","1445","1830","1545",,,"20180822","20180822","Geen verstrekking in Open Data","408715","Ja",,,,,,,"2","4","0","0",,"455","188","M1",,,,"1830","991G",,"e13*KS07/46*0015*02","CY12","09","0","0.33","245","Nee","Nee",,"Nee","0","0","0.00","2024","Logisch","00","Ja","2026-04-18T00:00:00.000","2018-08-22T00:00:00.000","2018-08-22T00:00:00.000","2018-08-22T00:00:00.000",,,,,,,,,,,"130",,,,,,,,,,"G",,,,,,,"https://opendata.rdw.nl/resource/3huj-srit.json","https://opendata.rdw.nl/resource/8ys7-d773.json","https://opendata.rdw.nl/resource/vezc-m2t6.json","https://opendata.rdw.nl/resource/jhie-znh9.json","https://opendata.rdw.nl/resource/kmfi-hrps.json"
"SN017S","Personenauto","PORSCHE","911 GT2 RS","20241014","20221027","59838","coupe","2","GRIJS","Niet geregistreerd","6","3800","1445","1830","1545",,,"20180509","20180509","Geen verstrekking in Open Data","352883","Ja","340",,,,,,"2","4","0","0",,"455","0","M1",,,,"1830","991G",,"e13*KS07/46*0015*02","CY12","09","0","0.33","245","Nee","Nee",,"Nee","0","0","0.00","2022","Geen oordeel","05","Ja","2024-10-14T00:00:00.000","2022-10-27T00:00:00.000","2018-05-09T00:00:00.000","2018-05-09T00:00:00.000",,,,,,,,,,,,,,,,,,,,,"G",,,,,,,"https://opendata.rdw.nl/resource/3huj-srit.json","https://opendata.rdw.nl/resource/8ys7-d773.json","https://opendata.rdw.nl/resource/vezc-m2t6.json","https://opendata.rdw.nl/resource/jhie-znh9.json","https://opendata.rdw.nl/resource/kmfi-hrps.json"
"SN018S","Personenauto","PORSCHE","911 GT2 RS","20240531","20221021","61599","coupe","2","BLAUW","Niet geregistreerd","6","3800","1445","1830","1545",,,"20180509","20180509","Geen verstrekking in Open Data","399760","Ja",,,,,,,"2","4","0","0",,"455","188","M1",,,,"1830","991G",,"e13*KS07/46*0015*02","CY12","09","0","0.33","245","Nee","Nee",,"Nee","0","0","0.00","2022","Logisch","00","Ja","2024-05-31T00:00:00.000","2022-10-21T00:00:00.000","2018-05-09T00:00:00.000","2018-05-09T00:00:00.000",,,,,,,,,,,"130",,,,,,,,,,"G",,,,,,,"https://opendata.rdw.nl/resource/3huj-srit.json","https://opendata.rdw.nl/resource/8ys7-d773.json","https://opendata.rdw.nl/resource/vezc-m2t6.json","https://opendata.rdw.nl/resource/jhie-znh9.json","https://opendata.rdw.nl/resource/kmfi-hrps.json"
"SN761H","Personenauto","PORSCHE","911 GT2 RS","20240607","20180509","61599","coupe","2","ROOD","Niet geregistreerd","6","3800","1445","1830","1545",,,"20180509","20180509","Geen verstrekking in Open Data","402634","Ja",,,,,,,"2","4","0","0",,"455","188","M1",,,,"1830","991G",,"e13*KS07/46*0015*02","CY12","09","0","0.33","245","Nee","Nee",,"Nee","0","0","0.00","2022","Logisch","00","Ja","2024-06-07T00:00:00.000","2018-05-09T00:00:00.000","2018-05-09T00:00:00.000","2018-05-09T00:00:00.000",,,,,,,,,,,"130",,,,,,,,,,"G",,,,,,,"https://opendata.rdw.nl/resource/3huj-srit.json","https://opendata.rdw.nl/resource/8ys7-d773.json","https://opendata.rdw.nl/resource/vezc-m2t6.json","https://opendata.rdw.nl/resource/jhie-znh9.json","https://opendata.rdw.nl/resource/kmfi-hrps.json"
"SP461L","Personenauto","PORSCHE","911 GT2 RS","20240519","20180519","61599","coupe","2","BLAUW","Niet geregistreerd","6","3800","1445","1830","1545",,,"20180519","20180519","Geen verstrekking in Open Data","412172","Ja",,,,,,,"2","4","0","0",,"455","188","M1",,,,"1830","991G",,"e13*KS07/46*0015*02","CY12","09","0","0.33","245","Nee","Nee",,"Nee","0","0","0.00","2022","Logisch","00","Ja","2024-05-19T00:00:00.000","2018-05-19T00:00:00.000","2018-05-19T00:00:00.000","2018-05-19T00:00:00.000",,,,,,,,,,,"130",,,,,,,,,,"G",,,,,,,"https://opendata.rdw.nl/resource/3huj-srit.json","https://opendata.rdw.nl/resource/8ys7-d773.json","https://opendata.rdw.nl/resource/vezc-m2t6.json","https://opendata.rdw.nl/resource/jhie-znh9.json","https://opendata.rdw.nl/resource/kmfi-hrps.json"
"SP865H","Personenauto","PORSCHE","911 GT2 RS","20240619","20220714","61599","coupe","2","BLAUW","Niet geregistreerd","6","3800","1445","1830","1545",,,"20180619","20180619","Geen verstrekking in Open Data","410080","Ja",,,,,,,"2","4","0","0",,"455","188","M1",,,,"1830","991G",,"e13*KS07/46*0015*02","CY12","09","0","0.33","245","Nee","Nee",,"Nee","0","0","0.00","2022","Logisch","00","Ja","2024-06-19T00:00:00.000","2022-07-14T00:00:00.000","2018-06-19T00:00:00.000","2018-06-19T00:00:00.000",,,,,,,,,,,"130",,,,,,,,,,"G",,,,,,,"https://opendata.rdw.nl/resource/3huj-srit.json","https://opendata.rdw.nl/resource/8ys7-d773.json","https://opendata.rdw.nl/resource/vezc-m2t6.json","https://opendata.rdw.nl/resource/jhie-znh9.json","https://opendata.rdw.nl/resource/kmfi-hrps.json"
"SP934H","Personenauto","PORSCHE","911 GT2 RS","20240604","20180604","61599","coupe","2","GRIJS","Niet geregistreerd","6","3800","1445","1830","1545",,,"20180604","20180604","Geen verstrekking in Open Data","399736","Ja",,,,,,,"2","4","0","0",,"455","188","M1",,,,"1830","991G",,"e13*KS07/46*0015*02","CY12","09","0","0.33","245","Nee","Nee",,"Nee","0","0","0.00","2022","Logisch","00","Ja","2024-06-04T00:00:00.000","2018-06-04T00:00:00.000","2018-06-04T00:00:00.000","2018-06-04T00:00:00.000",,,,,,,,,,,"130",,,,,,,,,,"G",,,,,,,"https://opendata.rdw.nl/resource/3huj-srit.json","https://opendata.rdw.nl/resource/8ys7-d773.json","https://opendata.rdw.nl/resource/vezc-m2t6.json","https://opendata.rdw.nl/resource/jhie-znh9.json","https://opendata.rdw.nl/resource/kmfi-hrps.json"