"kenteken","voertuigsoort","merk","handelsbenaming","vervaldatum_apk","datum_tenaamstelling","bruto_bpm","inrichting","aantal_zitplaatsen","eerste_kleur","tweede_kleur","aantal_cilinders","cilinderinhoud","massa_ledig_voertuig","toegestane_maximum_massa_voertuig","massa_rijklaar","maximum_massa_trekken_ongeremd","maximum_trekken_massa_geremd","datum_eerste_toelating","datum_eerste_tenaamstelling_in_nederland","wacht_op_keuren","catalogusprijs","wam_verzekerd","maximale_constructiesnelheid","laadvermogen","oplegger_geremd","aanhangwagen_autonoom_geremd","aanhangwagen_middenas_geremd","aantal_staanplaatsen","aantal_deuren","aantal_wielen","afstand_hart_koppeling_tot_achterzijde_voertuig","afstand_voorzijde_voertuig_tot_hart_koppeling","afwijkende_maximum_snelheid","lengte","breedte","europese_voertuigcategorie","europese_voertuigcategorie_toevoeging","europese_uitvoeringcategorie_toevoeging","plaats_chassisnummer","technische_max_massa_voertuig","type","type_gasinstallatie","typegoedkeuringsnummer","variant","uitvoering","volgnummer_wijziging_eu_typegoedkeuring","vermogen_massarijklaar","wielbasis","export_indicator","openstaande_terugroepactie_indicator","vervaldatum_tachograaf","taxi_indicator","maximum_massa_samenstelling","aantal_rolstoelplaatsen","maximum_ondersteunende_snelheid","jaar_laatste_registratie_tellerstand","tellerstandoordeel","code_toelichting_tellerstandoordeel","tenaamstellen_mogelijk","vervaldatum_apk_dt","datum_tenaamstelling_dt","datum_eerste_toelating_dt","datum_eerste_tenaamstelling_in_nederland_dt","vervaldatum_tachograaf_dt","maximum_last_onder_de_vooras_sen_tezamen_koppeling","type_remsysteem_voertuig_code","rupsonderstelconfiguratiecode","wielbasis_voertuig_minimum","wielbasis_voertuig_maximum","lengte_voertuig_minimum","lengte_voertuig_maximum","breedte_voertuig_minimum","breedte_voertuig_maximum","hoogte_voertuig","hoogte_voertuig_minimum","hoogte_voertuig_maximum","massa_bedrijfsklaar_minimaal","massa_bedrijfsklaar_maximaal","technisch_toelaatbaar_massa_koppelpunt","maximum_massa_technisch_maximaal","maximum_massa_technisch_minimaal","subcategorie_nederland","verticale_belasting_koppelpunt_getrokken_voertuig","zuinigheidsclassificatie","registratie_datum_goedkeuring_afschrijvingsmoment_bpm","registratie_datum_goedkeuring_afschrijvingsmoment_bpm_dt","gem_lading_wrde","aerodyn_voorz","massa_alt_aandr","verl_cab_ind","api_gekentekende_voertuigen_assen","api_gekentekende_voertuigen_brandstof","api_gekentekende_voertuigen_carrosserie","api_gekentekende_voertuigen_carrosserie_specifiek","api_gekentekende_voertuigen_voertuigklasse"
"5XVN53","Personenauto","PEUGEOT","5008 PREMIUM HDI","20250516","20180302","11300","stationwagen","7","GRIJS","Niet geregistreerd","4","1560","1477","2250","1577","700","1000","20100407","20141103","Geen verstrekking in Open Data","36792","Ja",,,,,,,"4","4",,,,,,"M1",,,"r. voorwielscherm","2250",,,,,,,"0.05","273","Nee","Nee",,"Nee",,,,"2024","Geen oordeel","05","Ja","2025-05-16T00:00:00.000","2018-03-02T00:00:00.000","2010-04-07T00:00:00.000","2014-11-03T00:00:00.000",,"0",,,,,,,,,,,,,,,,,,,,,,,,,,"https://opendata.rdw.nl/resource/3huj-srit.json","https://opendata.rdw.nl/resource/8ys7-d773.json","https://opendata.rdw.nl/resource/vezc-m2t6.json","https://opendata.rdw.nl/resource/jhie-znh9.json","https://opendata.rdw.nl/resource/kmfi-hrps.json"
"61ZFR6","Personenauto","PEUGEOT","5008","20250321","20240321","11119","stationwagen","7","GRIJS","Niet geregistreerd","4","1598","1540","2225","1640","750","1200","20111210","20121023","Geen verstrekking in Open Data","31800","Ja",,,,,,,"4","4",,,,,,"M1",,,"r. schroefveerkoker","2225",,,,,,,"0.07","273","Nee","Nee",,"Nee","4310",,,"2024","Geen oordeel","05","Nee","2025-03-21T00:00:00.000","2024-03-21T00:00:00.000","2011-12-10T00:00:00.000","2012-10-23T00:00:00.000",,"0",,,,,,,,,,,,,,,,,,,,,,,,,,"https://opendata.rdw.nl/resource/3huj-srit.json","https://opendata.rdw.nl/resource/8ys7-d773.json","https://opendata.rdw.nl/resource/vezc-m2t6.json","https://opendata.rdw.nl/resource/jhie-znh9.json","https://opendata.rdw.nl/resource/kmfi-hrps.json"
"9XTN30","Personenauto","PEUGEOT","5008","20241108","20240504","4877","stationwagen","7","GRIJS","Niet geregistreerd","4","1997","1630","2330","1730","750","1500","20110830","20150130","Geen verstrekking in Open Data","44095","Ja",,,,,,,"4","4",,,,,,"M1",,,"r. schroefveerkoker","2330",,,,,,,"0.07","273","Nee","Nee",,"Nee","3530",,,"2024","Geen oordeel","05","Ja","2024-11-08T00:00:00.000","2024-05-04T00:00:00.000","2011-08-30T00:00:00.000","2015-01-30T00:00:00.000",,"0",,,,,,,,,,,,,,,,,,,,,,,,,,"https://opendata.rdw.nl/resource/3huj-srit.json","https://opendata.rdw.nl/resource/8ys7-d773.json","https://opendata.rdw.nl/resource/vezc-m2t6.json","https://opendata.rdw.nl/resource/jhie-znh9.json","https://opendata.rdw.nl/resource/kmfi-hrps.json"
"G571NG","Personenauto","PEUGEOT","5008","20240917","20200921","1820","stationwagen","5","GRIJS","Niet geregistreerd","3","1199","1395","2040","1495","745","1400","20150713","20200921","Geen verstrekking in Open Data","31479","Ja","201",,,,,,"4","4","0","0",,"453","184","M1",,,,"2040","0",,"e2*2007/46*0004*19","AHNY","M/2S","0","0.06","273","Nee","Nee",,"Nee","3140","0","0.00","2023","Geen oordeel","05","Ja","2024-09-17T00:00:00.000","2020-09-21T00:00:00.000","2015-07-13T00:00:00.000","2020-09-21T00:00:00.000",,,,,,,,,,,,,,,,,,,,,"A",,,,,,,"https://opendata.rdw.nl/resource/3huj-srit.json","https://opendata.rdw.nl/resource/8ys7-d773.json","https://opendata.rdw.nl/resource/vezc-m2t6.json","https://opendata.rdw.nl/resource/jhie-znh9.json","https://opendata.rdw.nl/resource/kmfi-hrps.json"
"GF687H","Personenauto","PEUGEOT","5008","20240614","20230616","3943","stationwagen","5","GRIJS","Niet geregistreerd","4","1199","1395","2040","1495","745","1400","20150518","20150518","Geen verstrekking in Open Data","9700305","Ja",,,,,,,"4","4","0","0",,"453","0","M1",,,"r. by schroefveerkoker","2040","0",,"e2*2007/46*0004*18","AHNY","M/2S","0","0.06","273","Nee","Nee",,"Nee","3140","0","0.00","2023","Logisch","00","Ja","2024-06-14T00:00:00.000","2023-06-16T00:00:00.000","2015-05-18T00:00:00.000","2015-05-18T00:00:00.000",,,,,,,,,,,,,,,,,,,,,"A",,,,,,,"https://opendata.rdw.nl/resource/3huj-srit.json","https://opendata.rdw.nl/resource/8ys7-d773.json","https://opendata.rdw.nl/resource/vezc-m2t6.json","https://opendata.rdw.nl/resource/jhie-znh9.json","https://opendata.rdw.nl/resource/kmfi-hrps.json"
"GG260K","Personenauto","PEUGEOT","5008","20240519","20190503","3943","stationwagen","5","BLAUW","Niet geregistreerd","3","1199","1395","2040","1495","745","1400","20150519","20150519","Geen verstrekking in Open Data","31290","Ja",,,,,,,"4","4","0","0",,"453","0","M1",,,"r. by schroefveerkoker","2040","0",,"e2*2007/46*0004*18","AHNY","M/2S","0","0.06","273","Nee","Nee",,"Nee","3140","0","0.00","2023","Logisch","00","Ja","2024-05-19T00:00:00.000","2019-05-03T00:00:00.000","2015-05-19T00:00:00.000","2015-05-19T00:00:00.000",,,,,,,,,,,,,,,,,,,,,"A",,,,,,,"https://opendata.rdw.nl/resource/3huj-srit.json","https://opendata.rdw.nl/resource/8ys7-d773.json","https://opendata.rdw.nl/resource/vezc-m2t6.json","https://opendata.rdw.nl/resource/jhie-znh9.json","https://opendata.rdw.nl/resource/kmfi-hrps.json"
"GH249L","Personenauto","PEUGEOT","5008","20240719","20210721","3495","stationwagen","5","BLAUW","Niet geregistreerd","3","1199","1395","2040","1495","745","1400","20150528","20150528","Geen verstrekking in Open Data","31840","Ja",,,,,,,"4","4","0","0",,"453","0","M1",,,"r. by schroefveerkoker","2040","0",,"e2*2007/46*0004*19","AHNY","M/2S","0","0.06","273","Nee","Nee",,"Nee","3140","0","0.00","2023","Logisch","00","Ja","2024-07-19T00:00:00.000","2021-07-21T00:00:00.000","2015-05-28T00:00:00.000","2015-05-28T00:00:00.000",,,,,,,,,,,,,,,,,,,,,"A",,,,,,,"https://opendata.rdw.nl/resource/3huj-srit.json","https://opendata.rdw.nl/resource/8ys7-d773.json","https://opendata.rdw.nl/resource/vezc-m2t6.json","https://opendata.rdw.nl/resource/jhie-znh9.json","https://opendata.rdw.nl/resource/kmfi-hrps.json"
"GJ557Z","Personenauto","PEUGEOT","5008","20240625","20220610","3495","stationwagen","5","GRIJS","Niet geregistreerd","3","1199","1395","2040","1495","745","1400","20150625","20150625","Geen verstrekking in Open Data","30590","Ja",,,,,,,"4","4","0","0",,"453","0","M1",,,"r. by schroefveerkoker","2040","0",,"e2*2007/46*0004*19","AHNY","M/2S","0","0.06","273","Nee","Nee",,"Nee","3140","0","0.00","2023","Logisch","00","Ja","2024-06-25T00:00:00.000","2022-06-10T00:00:00.000","2015-06-25T00:00:00.000","2015-06-25T00:00:00.000",,,,,,,,,,,,,,,,,,,,,"A",,,,,,,"https://opendata.rdw.nl/resource/3huj-srit.json","https://opendata.rdw.nl/resource/8ys7-d773.json","https://opendata.rdw.nl/resource/vezc-m2t6.json","https://opendata.rdw.nl/resource/jhie-znh9.json","https://opendata.rdw.nl/resource/kmfi-hrps.json"
"GK710Z","Personenauto","PEUGEOT","5008","20250127","20220107","3495","stationwagen","5","GRIJS","Niet geregistreerd","3","1199","1395","2040","1495","745","1400","20150626","20150626","Geen verstrekking in Open Data","31290","Ja",,,,,,,"4","4","0","0",,"453","0","M1",,,"r. by schroefveerkoker","2040","0",,"e2*2007/46*0004*19","AHNY","M/2S","0","0.06","273","Nee","Nee",,"Nee","3140","0","0.00","2024","Logisch","00","Ja","2025-01-27T00:00:00.000","2022-01-07T00:00:00.000","2015-06-26T00:00:00.000","2015-06-26T00:00:00.000",,,,,,,,,,,,,,,,,,,,,"A",,,,,,,"https://opendata.rdw.nl/resource/3huj-srit.json","https://opendata.rdw.nl/resource/8ys7-d773.json","https://opendata.rdw.nl/resource/vezc-m2t6.json","https://opendata.rdw.nl/resource/jhie-znh9.json","https://opendata.rdw.nl/resource/kmfi-hrps.json"
"GK738D","Personenauto","PEUGEOT","5008","20240915","20200919","3495","stationwagen","5","GRIJS","Niet geregistreerd","3","1199","1395","2040","1495","745","1400","20150612","20150612","Geen verstrekking in Open Data","30840","Ja",,,,,,,"4","4","0","0",,"453","0","M1",,,"r. by schroefveerkoker","2040","0",,"e2*2007/46*0004*19","AHNY","M/2S","0","0.06","273","Nee","Nee",,"Nee","3140","0","0.00","2023","Logisch","00","Ja","2024-09-15T00:00:00.000","2020-09-19T00:00:00.000","2015-06-12T00:00:00.000","2015-06-12T00:00:00.000",,,,,,,,,,,,,,,,,,,,,"A",,,,,,,"https://opendata.rdw.nl/resource/3huj-srit.json","https://opendata.rdw.nl/resource/8ys7-d773.json","https://opendata.rdw.nl/resource/vezc-m2t6.json","https://opendata.rdw.nl/resource/jhie-znh9.json","https://opendata.rdw.nl/resource/kmfi-hrps.json"
"GK872V","Personenauto","PEUGEOT","5008","20250217","20240217","3495","stationwagen","5","GRIJS","Niet geregistreerd","3","1199","1395","2040","1495","745","1400","20150624","20150624","Geen verstrekking in Open Data","30590","Ja",,,,,,,"4","4","0","0",,"453","0","M1",,,"r. by schroefveerkoker","2040","0",,"e2*2007/46*0004*19","AHNY","M/2S","0","0.06","273","Nee","Nee",,"Nee","3140","0","0.00","2024","Logisch","00","Ja","2025-02-17T00:00:00.000","2024-02-17T00:00:00.000","2015-06-24T00:00:00.000","2015-06-24T00:00:00.000",,,,,,,,,,,,,,,,,,,,,"A",,,,,,,"https://opendata.rdw.nl/resource/3huj-srit.json","https://opendata.rdw.nl/resource/8ys7-d773.json","https://opendata.rdw.nl/resource/vezc-m2t6.json","https://opendata.rdw.nl/resource/jhie-znh9.json","https://opendata.rdw.nl/resource/kmfi-hrps.json"
"GK924K","Personenauto","PEUGEOT","5008","20240709","20240115","3495","stationwagen","5","ZWART","Niet geregistreerd","3","1199","1395","2040","1495","745","1400","20150630","20150630","Geen verstrekking in Open Data","30420","Ja",,,,,,,"4","4","0","0",,"453","0","M1",,,"r. by schroefveerkoker","2040","0",,"e2*2007/46*0004*19","AHNY","M/2S","0","0.06","273","Nee","Nee",,"Nee","3140","0","0.00","2024","Logisch","00","Ja","2024-07-09T00:00:00.000","2024-01-15T00:00:00.000","2015-06-30T00:00:00.000","2015-06-30T00:00:00.000",,,,,,,,,,,,,,,,,,,,,"A",,,,,,,"https://opendata.rdw.nl/resource/3huj-srit.json","https://opendata.rdw.nl/resource/8ys7-d773.json","https://opendata.rdw.nl/resource/vezc-m2t6.json","https://opendata.rdw.nl/resource/jhie-znh9.json","https://opendata.rdw.nl/resource/kmfi-hrps.json"
"GL362H","Personenauto","PEUGEOT","5008","20240626","20220527","3495","stationwagen","5","BLAUW","Niet geregistreerd","3","1199","1395","2040","1495","745","1400","20150626","20150626","Geen verstrekking in Open Data","32290","Ja",,,,,,,"4","4","0","0",,"453","0","M1",,,"r. by schroefveerkoker","2040","0",,"e2*2007/46*0004*19","AHNY","M/2S","0","0.06","273","Nee","Nee",,"Nee","3140","0","0.00","2023","Logisch","00","Ja","2024-06-26T00:00:00.000","2022-05-27T00:00:00.000","2015-06-26T00:00:00.000","2015-06-26T00:00:00.000",,,,,,,,,,,,,,,,,,,,,"A",,,,,,,"https://opendata.rdw.nl/resource/3huj-srit.json","https://opendata.rdw.nl/resource/8ys7-d773.json","https://opendata.rdw.nl/resource/vezc-m2t6.json","https://opendata.rdw.nl/resource/jhie-znh9.json","https://opendata.rdw.nl/resource/kmfi-hrps.json"
"GL398V","Personenauto","PEUGEOT","5008","20240812","20220813","3495","stationwagen","5","BLAUW","Niet geregistreerd","3","1199","1395","2040","1495","745","1400","20150708","20150708","Geen verstrekking in Open Data","31290","Ja",,,,,,,"4","4","0","0",,"453","0","M1",,,"r. by schroefveerkoker","2040","0",,"e2*2007/46*0004*19","AHNY","M/2S","0","0.06","273","Nee","Nee",,"Nee","3140","0","0.00","2023","Logisch","00","Ja","2024-08-12T00:00:00.000","2022-08-13T00:00:00.000","2015-07-08T00:00:00.000","2015-07-08T00:00:00.000",,,,,,,,,,,,,,,,,,,,,"A",,,,,,,"https://opendata.rdw.nl/resource/3huj-srit.json","https://opendata.rdw.nl/resource/8ys7-d773.json","https://opendata.rdw.nl/resource/vezc-m2t6.json","https://opendata.rdw.nl/resource/jhie-znh9.json","https://opendata.rdw.nl/resource/kmfi-hrps.json"
"GL399V","Personenauto","PEUGEOT","5008","20240713","20230706","3495","stationwagen","5","GRIJS","Niet geregistreerd","3","1199","1395","2040","1495","745","1400","20150629","20150629","Geen verstrekking in Open Data","31290","Ja",,,,,,,"4","4","0","0",,"453","0","M1",,,"r. by schroefveerkoker","2040","0",,"e2*2007/46*0004*19","AHNY","M/2S","0","0.06","273","Nee","Nee",,"Nee","3140","0","0.00","2023","Logisch","00","Ja","2024-07-13T00:00:00.000","2023-07-06T00:00:00.000","2015-06-29T00:00:00.000","2015-06-29T00:00:00.000",,,,,,,,,,,,,,,,,,,,,"A",,,,,,,"https://opendata.rdw.nl/resource/3huj-srit.json","https://opendata.rdw.nl/resource/8ys7-d773.json","https://opendata.rdw.nl/resource/vezc-m2t6.json","https://opendata.rdw.nl/resource/jhie-znh9.json","https://opendata.rdw.nl/resource/kmfi-hrps.json"
"GP217B","Personenauto","PEUGEOT","5008","20240728","20191129","3495","stationwagen","5","BRUIN","Niet geregistreerd","3","1199","1395","2040","1495","745","1400","20150728","20150728","Geen verstrekking in Open Data","31290","Ja",,,,,,,"4","4","0","0",,"453","0","M1",,,"r. by schroefveerkoker","2040","0",,"e2*2007/46*0004*19","AHNY","M/2S","0","0.06","273","Nee","Nee",,"Nee","3140","0","0.00","2023","Logisch","00","Ja","2024-07-28T00:00:00.000","2019-11-29T00:00:00.000","2015-07-28T00:00:00.000","2015-07-28T00:00:00.000",,,,,,,,,,,,,,,,,,,,,"A",,,,,,,"https://opendata.rdw.nl/resource/3huj-srit.json","https://opendata.rdw.nl/resource/8ys7-d773.json","https://opendata.rdw.nl/resource/vezc-m2t6.json","https://opendata.rdw.nl/resource/jhie-znh9.json","https://opendata.rdw.nl/resource/kmfi-hrps.json"
"GP779J","Personenauto","PEUGEOT","5008","20250328","20220318","3495","stationwagen","5","BLAUW","Niet geregistreerd","3","1199","1395","2040","1495","745","1400","20150717","20150717","Geen verstrekking in Open Data","30590","Ja",,,,,,,"4","4","0","0",,"453","184","M1",,,"in motorruimte r.","2040","0",,"e2*2007/46*0004*19","AHNY","M/2S","0","0.06","273","Nee","Ja",,"Nee","3140","0","0.00","2024","Logisch","00","Ja","2025-03-28T00:00:00.000","2022-03-18T00:00:00.000","2015-07-17T00:00:00.000","2015-07-17T00:00:00.000",,,,,,,,,,,"165",,,,,,,,,,"A",,,,,,,"https://opendata.rdw.nl/resource/3huj-srit.json","https://opendata.rdw.nl/resource/8ys7-d773.json","https://opendata.rdw.nl/resource/vezc-m2t6.json","https://opendata.rdw.nl/resource/jhie-znh9.json","https://opendata.rdw.nl/resource/kmfi-hrps.json"
"GR141R","Personenauto","PEUGEOT","5008","20240804","20150731","3495","stationwagen","5","GRIJS","Niet geregistreerd","3","1199","1395","2040","1495","745","1400","20150731","20150731","Geen verstrekking in Open Data","31290","Ja",,,,,,,"4","4","0","0",,"453","184","M1",,,"in motorruimte r.","2040","0",,"e2*2007/46*0004*19","AHNY","M/2S","0","0.06","273","Nee","Nee",,"Nee","3140","0","0.00","2023","Logisch","00","Ja","2024-08-04T00:00:00.000","2015-07-31T00:00:00.000","2015-07-31T00:00:00.000","2015-07-31T00:00:00.000",,,,,,,,,,,"165",,,,,,,,,,"A",,,,,,,"https://opendata.rdw.nl/resource/3huj-srit.json","https://opendata.rdw.nl/resource/8ys7-d773.json","https://opendata.rdw.nl/resource/vezc-m2t6.json","https://opendata.rdw.nl/resource/jhie-znh9.json","https://opendata.rdw.nl/resource/kmfi-hrps.json"
"GS185F","Personenauto","PEUGEOT","5008","20241005","20221014","3495","stationwagen","5","ZWART","Niet geregistreerd","3","1199","1395","2040","1495","745","1400","20150731","20150731","Geen verstrekking in Open Data","30840","Ja",,,,,,,"4","4","0","0",,"453","184","M1",,,"in motorruimte r.","2040","0",,"e2*2007/46*0004*19","AHNY","M/2S","0","0.06","273","Nee","Nee",,"Nee","3140","0","0.00","2023","Logisch","00","Ja","2024-10-05T00:00:00.000","2022-10-14T00:00:00.000","2015-07-31T00:00:00.000","2015-07-31T00:00:00.000",,,,,,,,,,,"165",,,,,,,,,,"A",,,,,,,"https://opendata.rdw.nl/resource/3huj-srit.json","https://opendata.rdw.nl/resource/8ys7-d773.json","https://opendata.rdw.nl/resource/vezc-m2t6.json","https://opendata.rdw.nl/resource/jhie-znh9.json","https://opendata.rdw.nl/resource/kmfi-hrps.json"
"GS839S","Personenauto","PEUGEOT","5008","20240908","20240202","3495","stationwagen","5","GRIJS","Niet geregistreerd","3","1199","1395","2040","1495","745","1400","20150806","20150806","Geen verstrekking in Open Data","30590","Ja",,,,,,,"4","4","0","0",,"453","184","M1",,,"in motorruimte r.","2040","0",,"e2*2007/46*0004*19","AHNY","M/2S","0","0.06","273","Nee","Nee",,"Nee","3140","0","0.00","2023","Logisch","00","Ja","2024-09-08T00:00:00.000","2024-02-02T00:00:00.000","2015-08-06T00:00:00.000","2015-08-06T00:00:00.000",,,,,,,,,,,"165",,,,,,,,,,"A",,,,,,,"https://opendata.rdw.nl/resource/3huj-srit.json","https://opendata.rdw.nl/resource/8ys7-d773.json","https://opendata.rdw.nl/resource/vezc-m2t6.json","https://opendata.rdw.nl/resource/jhie-znh9.json","https://opendata.rdw.nl/resource/kmfi-hrps.json"
"GS916L","Personenauto","PEUGEOT","5008","20240530","20230601","3495","stationwagen","5","BLAUW","Niet geregistreerd","3","1199","1395","2040","1495","745","1400","20150827","20150827","Geen verstrekking in Open Data","30590","Ja",,,,,,,"4","4","0","0",,"453","184","M1",,,"in motorruimte r.","2040","0",,"e2*2007/46*0004*19","AHNY","M/2S","0","0.06","273","Nee","Nee",,"Nee","3140","0","0.00","2023","Logisch","00","Ja","2024-05-30T00:00:00.000","2023-06-01T00:00:00.000","2015-08-27T00:00:00.000","2015-08-27T00:00:00.000",,,,,,,,,,,"165",,,,,,,,,,"A",,,,,,,"https://opendata.rdw.nl/resource/3huj-srit.json","https://opendata.rdw.nl/resource/8ys7-d773.json","https://opendata.rdw.nl/resource/vezc-m2t6.json","https://opendata.rdw.nl/resource/jhie-znh9.json","https://opendata.rdw.nl/resource/kmfi-hrps.json"
"GT226S","Personenauto","PEUGEOT","5008","20240625","20240115","3495","stationwagen","5","GRIJS","Niet geregistreerd","3","1199","1395","2040","1495","745","1400","20150917","20150917","Geen verstrekking in Open Data","30170","Ja",,,,,,,"4","4","0","0",,"453","184","M1",,,"in motorruimte r.","2040","0",,"e2*2007/46*0004*19","AHNY","M/2S","0","0.06","273","Nee","Nee",,"Nee","3140","0","0.00","2023","Logisch","00","Ja","2024-06-25T00:00:00.000","2024-01-15T00:00:00.000","2015-09-17T00:00:00.000","2015-09-17T00:00:00.000",,,,,,,,,,,"165",,,,,,,,,,"A",,,,,,,"https://opendata.rdw.nl/resource/3huj-srit.json","https://opendata.rdw.nl/resource/8ys7-d773.json","https://opendata.rdw.nl/resource/vezc-m2t6.json","https://opendata.rdw.nl/resource/jhie-znh9.json","https://opendata.rdw.nl/resource/kmfi-hrps.json"
"GZ192Z","Personenauto","PEUGEOT","5008","20240928","20230927","3495","stationwagen","5","BLAUW","Niet geregistreerd","3","1199","1395","2040","1495","745","1400","20150928","20150928","Geen verstrekking in Open Data","30590","Ja",,,,,,,"4","4","0","0",,"453","184","M1",,,"in motorruimte r.","2040","0",,"e2*2007/46*0004*19","AHNY","M/2S","0","0.06","273","Nee","Nee",,"Nee","3140","0","0.00","2023","Logisch","00","Ja","2024-09-28T00:00:00.000","2023-09-27T00:00:00.000","2015-09-28T00:00:00.000","2015-09-28T00:00:00.000",,,,,,,,,,,"165",,,,,,,,,,"A",,,,,,,"https://opendata.rdw.nl/resource/3huj-srit.json","https://opendata.rdw.nl/resource/8ys7-d773.json","https://opendata.rdw.nl/resource/vezc-m2t6.json","https://opendata.rdw.nl/resource/jhie-znh9.json","https://opendata.rdw.nl/resource/kmfi-hrps.json"
"GZ294T","Personenauto","PEUGEOT","5008","20250424","20230424","3495","stationwagen","5","BLAUW","Niet geregistreerd","3","1199","1395","2040","1495","745","1400","20150930","20150930","Geen verstrekking in Open Data","30840","Ja",,,,,,,"4","4","0","0",,"453","184","M1",,,"in motorruimte r.","2040","0",,"e2*2007/46*0004*19","AHNY","M/2S","0","0.06","273","Nee","Nee",,"Nee","3140","0","0.00","2024","Logisch","00","Ja","2025-04-24T00:00:00.000","2023-04-24T00:00:00.000","2015-09-30T00:00:00.000","2015-09-30T00:00:00.000",,,,,,,,,,,"165",,,,,,,,,,"A",,,,,,,"https://opendata.rdw.nl/resource/3huj-srit.json","https://opendata.rdw.nl/resource/8ys7-d773.json","https://opendata.rdw.nl/resource/vezc-m2t6.json","https://opendata.rdw.nl/resource/jhie-znh9.json","https://opendata.rdw.nl/resource/kmfi-hrps.json"
"GZ295T","Personenauto","PEUGEOT","5008","20240807","20200808","3495","stationwagen","5","WIT","Niet geregistreerd","3","1199","1395","2040","1495","745","1400","20150925","20150925","Geen verstrekking in Open Data","29920","Ja",,,,,,,"4","4","0","0",,"453","184","M1",,,"in motorruimte r.","2040","0",,"e2*2007/46*0004*19","AHNY","M/2S","0","0.06","273","Nee","Nee",,"Nee","3140","0","0.00","2022","Logisch","00","Ja","2024-08-07T00:00:00.000","2020-08-08T00:00:00.000","2015-09-25T00:00:00.000","2015-09-25T00:00:00.000",,,,,,,,,,,"165",,,,,,,,,,"A",,,,,,,"https://opendata.rdw.nl/resource/3huj-srit.json","https://opendata.rdw.nl/resource/8ys7-d773.json","https://opendata.rdw.nl/resource/vezc-m2t6.json","https://opendata.rdw.nl/resource/jhie-znh9.json","https://opendata.rdw.nl/resource/kmfi-hrps.json"
"H087JP","Personenauto","PEUGEOT","5008","20240611","20200612","1982","stationwagen","5","BLAUW","Niet geregistreerd","3","1199","1438","2040","1538","745","1400","20160104","20200313","Geen verstrekking in Open Data","31871","Ja","201",,,,,,"4","4",,,,"453","184","M1",,,,"2040","0","115R gasinstallatie",,,,,"0.06","273","Nee","Nee",,"Nee","3140",,,"2024","Geen oordeel","05","Ja","2024-06-11T00:00:00.000","2020-06-12T00:00:00.000","2016-01-04T00:00:00.000","2020-03-13T00:00:00.000",,,,,,,,,,,,,,,,,,,,,"B",,,,,,,"https://opendata.rdw.nl/resource/3huj-srit.json","https://opendata.rdw.nl/resource/8ys7-d773.json","https://opendata.rdw.nl/resource/vezc-m2t6.json","https://opendata.rdw.nl/resource/jhie-znh9.json","https://opendata.rdw.nl/resource/kmfi-hrps.json"