"kenteken","voertuigsoort","merk","handelsbenaming","vervaldatum_apk","datum_tenaamstelling","bruto_bpm","inrichting","aantal_zitplaatsen","eerste_kleur","tweede_kleur","aantal_cilinders","cilinderinhoud","massa_ledig_voertuig","toegestane_maximum_massa_voertuig","massa_rijklaar","maximum_massa_trekken_ongeremd","maximum_trekken_massa_geremd","datum_eerste_toelating","datum_eerste_tenaamstelling_in_nederland","wacht_op_keuren","catalogusprijs","wam_verzekerd","maximale_constructiesnelheid","laadvermogen","oplegger_geremd","aanhangwagen_autonoom_geremd","aanhangwagen_middenas_geremd","aantal_staanplaatsen","aantal_deuren","aantal_wielen","afstand_hart_koppeling_tot_achterzijde_voertuig","afstand_voorzijde_voertuig_tot_hart_koppeling","afwijkende_maximum_snelheid","lengte","breedte","europese_voertuigcategorie","europese_voertuigcategorie_toevoeging","europese_uitvoeringcategorie_toevoeging","plaats_chassisnummer","technische_max_massa_voertuig","type","type_gasinstallatie","typegoedkeuringsnummer","variant","uitvoering","volgnummer_wijziging_eu_typegoedkeuring","vermogen_massarijklaar","wielbasis","export_indicator","openstaande_terugroepactie_indicator","vervaldatum_tachograaf","taxi_indicator","maximum_massa_samenstelling","aantal_rolstoelplaatsen","maximum_ondersteunende_snelheid","jaar_laatste_registratie_tellerstand","tellerstandoordeel","code_toelichting_tellerstandoordeel","tenaamstellen_mogelijk","vervaldatum_apk_dt","datum_tenaamstelling_dt","datum_eerste_toelating_dt","datum_eerste_tenaamstelling_in_nederland_dt","vervaldatum_tachograaf_dt","maximum_last_onder_de_vooras_sen_tezamen_koppeling","type_remsysteem_voertuig_code","rupsonderstelconfiguratiecode","wielbasis_voertuig_minimum","wielbasis_voertuig_maximum","lengte_voertuig_minimum","lengte_voertuig_maximum","breedte_voertuig_minimum","breedte_voertuig_maximum","hoogte_voertuig","hoogte_voertuig_minimum","hoogte_voertuig_maximum","massa_bedrijfsklaar_minimaal","massa_bedrijfsklaar_maximaal","technisch_toelaatbaar_massa_koppelpunt","maximum_massa_technisch_maximaal","maximum_massa_technisch_minimaal","subcategorie_nederland","verticale_belasting_koppelpunt_getrokken_voertuig","zuinigheidsclassificatie","registratie_datum_goedkeuring_afschrijvingsmoment_bpm","registratie_datum_goedkeuring_afschrijvingsmoment_bpm_dt","gem_lading_wrde","aerodyn_voorz","massa_alt_aandr","verl_cab_ind","api_gekentekende_voertuigen_assen","api_gekentekende_voertuigen_brandstof","api_gekentekende_voertuigen_carrosserie","api_gekentekende_voertuigen_carrosserie_specifiek","api_gekentekende_voertuigen_voertuigklasse"
"01LFR9","Personenauto","PEUGEOT","207 CC","20240708","20230510","4672","cabriolet","4","ZWART","Niet geregistreerd","4","1598","1327","1720","1427",,,"20070315","20100330","Geen verstrekking in Open Data",,"Ja",,,,,,,"2","4",,,,,,"M1",,,"r. schutbord","1720",,,,,,,"0.06","254","Nee","Nee",,"Nee",,,,"2023","Geen oordeel","05","Ja","2024-07-08T00:00:00.000","2023-05-10T00:00:00.000","2007-03-15T00:00:00.000","2010-03-30T00:00:00.000",,"0",,,,,,,,,,,,,,,,,,,,,,,,,,"https://opendata.rdw.nl/resource/3huj-srit.json","https://opendata.rdw.nl/resource/8ys7-d773.json","https://opendata.rdw.nl/resource/vezc-m2t6.json","https://opendata.rdw.nl/resource/jhie-znh9.json","https://opendata.rdw.nl/resource/kmfi-hrps.json"
"11KHL4","Personenauto","PEUGEOT","207 CC","20240720","20200702","4946","cabriolet","4","GRIJS","Niet geregistreerd","4","1598","1327","1720","1427","713","850","20080103","20091118","Geen verstrekking in Open Data",,"Ja",,,,,,,"2","4",,,,,,"M1",,,"r. schutbord motorruimte","1720",,,,,,,"0.06","254","Nee","Nee",,"Nee","2570",,,"2024","Geen oordeel","05","Ja","2024-07-20T00:00:00.000","2020-07-02T00:00:00.000","2008-01-03T00:00:00.000","2009-11-18T00:00:00.000",,"0",,,,,,,,,,,,,,,,,,,,,,,,,,"https://opendata.rdw.nl/resource/3huj-srit.json","https://opendata.rdw.nl/resource/8ys7-d773.json","https://opendata.rdw.nl/resource/vezc-m2t6.json","https://opendata.rdw.nl/resource/jhie-znh9.json","https://opendata.rdw.nl/resource/kmfi-hrps.json"
"15PZF4","Personenauto","PEUGEOT","207 CC","20250430","20110415","6255","cabriolet","4","GRIJS","Niet geregistreerd","4","1598","1358","1765","1458","729","880","20090930","20110415","Geen verstrekking in Open Data",,"Ja",,,,,,,"2","4",,,,,,"M1",,,"r. schutbord motorruimte","1765",,,,,,,"0.06","254","Nee","Nee",,"Nee","2645",,,"2024","Geen oordeel","05","Ja","2025-04-30T00:00:00.000","2011-04-15T00:00:00.000","2009-09-30T00:00:00.000","2011-04-15T00:00:00.000",,"0",,,,,,,,,,,,,,,,,,,,,,,,,,"https://opendata.rdw.nl/resource/3huj-srit.json","https://opendata.rdw.nl/resource/8ys7-d773.json","https://opendata.rdw.nl/resource/vezc-m2t6.json","https://opendata.rdw.nl/resource/jhie-znh9.json","https://opendata.rdw.nl/resource/kmfi-hrps.json"
"41TRT4","Personenauto","PEUGEOT","207 CC 1.6 120","20241021","20180706","4466","cabriolet","4","ZWART","Niet geregistreerd","4","1598","1317","1709","1417","600","1040","20110405","20120331","Geen verstrekking in Open Data","29650","Ja",,,,,,,"2","4",,,,,,"M1",,,"r. schutbord","1709",,,,,,,"0.06","254","Nee","Nee",,"Nee",,,,"2023","Geen oordeel","05","Ja","2024-10-21T00:00:00.000","2018-07-06T00:00:00.000","2011-04-05T00:00:00.000","2012-03-31T00:00:00.000",,"0",,,,,,,,,,,,,,,,,,,,,,,,,,"https://opendata.rdw.nl/resource/3huj-srit.json","https://opendata.rdw.nl/resource/8ys7-d773.json","https://opendata.rdw.nl/resource/vezc-m2t6.json","https://opendata.rdw.nl/resource/jhie-znh9.json","https://opendata.rdw.nl/resource/kmfi-hrps.json"
"6SXK43","Personenauto","PEUGEOT","207 CC","20250129","20190311","3351","cabriolet","4","GRIJS","Niet geregistreerd","4","1598","1385","1760","1485","600","1070","20090402","20140111","Geen verstrekking in Open Data","30500","Ja",,,,,,,"2","4",,,,,,"M1",,,"r. schutbord motorruimte","1760","W***",,,,,,"0.07","254","Nee","Nee",,"Nee","2830",,,"2024","Geen oordeel","05","Ja","2025-01-29T00:00:00.000","2019-03-11T00:00:00.000","2009-04-02T00:00:00.000","2014-01-11T00:00:00.000",,"0",,,,,,,,,,,,,,,,,,,,,,,,,,"https://opendata.rdw.nl/resource/3huj-srit.json","https://opendata.rdw.nl/resource/8ys7-d773.json","https://opendata.rdw.nl/resource/vezc-m2t6.json","https://opendata.rdw.nl/resource/jhie-znh9.json","https://opendata.rdw.nl/resource/kmfi-hrps.json"
"6ZKZ46","Personenauto","PEUGEOT","207 CC","20250405","20220722","6965","cabriolet","4","ZWART","Niet geregistreerd","4","1598","1339","1709","1439",,,"20091007","20150106","Geen verstrekking in Open Data",,"Ja",,,,,,,"2","4",,,,,,"M1",,,"r. op schutbord onder motorkap","1709",,,,,,,"0.06","254","Nee","Nee",,"Nee","2559",,,"2024","Geen oordeel","05","Ja","2025-04-05T00:00:00.000","2022-07-22T00:00:00.000","2009-10-07T00:00:00.000","2015-01-06T00:00:00.000",,"0",,,,,,,,,,,,,,,,,,,,,,,,,,"https://opendata.rdw.nl/resource/3huj-srit.json","https://opendata.rdw.nl/resource/8ys7-d773.json","https://opendata.rdw.nl/resource/vezc-m2t6.json","https://opendata.rdw.nl/resource/jhie-znh9.json","https://opendata.rdw.nl/resource/kmfi-hrps.json"
"98JKP6","Personenauto","PEUGEOT","207 CC 1.6","20240601","20200519","5427","cabriolet","4","ROOD","Niet geregistreerd","4","1598","1327","1720","1427",,,"20081021","20090618","Geen verstrekking in Open Data",,"Ja",,,,,,,"2","4",,,,,,"M1",,,"r. schutbord","1720",,,,,,,"0.06","254","Nee","Nee",,"Nee",,,,"2023","Geen oordeel","05","Ja","2024-06-01T00:00:00.000","2020-05-19T00:00:00.000","2008-10-21T00:00:00.000","2009-06-18T00:00:00.000",,"0",,,,,,,,,,,,,,,,,,,,,,,,,,"https://opendata.rdw.nl/resource/3huj-srit.json","https://opendata.rdw.nl/resource/8ys7-d773.json","https://opendata.rdw.nl/resource/vezc-m2t6.json","https://opendata.rdw.nl/resource/jhie-znh9.json","https://opendata.rdw.nl/resource/kmfi-hrps.json"
"GD402G","Personenauto","PEUGEOT","207 CC","20241018","20201009","6063","cabriolet","4","BLAUW","Niet geregistreerd","4","1598","1327","1720","1427",,,"20070515","20150414","Geen verstrekking in Open Data",,"Ja",,,,,,,"2","4",,,,,,"M1",,,"by schutbord r. motorruimte","1720",,,,,,,"0.06","256","Nee","Nee",,"Nee","2570",,,"2024","Geen oordeel","05","Ja","2024-10-18T00:00:00.000","2020-10-09T00:00:00.000","2007-05-15T00:00:00.000","2015-04-14T00:00:00.000",,,,,,,,,,,,,,,,,,,,,,,,,,,,"https://opendata.rdw.nl/resource/3huj-srit.json","https://opendata.rdw.nl/resource/8ys7-d773.json","https://opendata.rdw.nl/resource/vezc-m2t6.json","https://opendata.rdw.nl/resource/jhie-znh9.json","https://opendata.rdw.nl/resource/kmfi-hrps.json"
"GF481K","Personenauto","PEUGEOT","207 CC","20250513","20191206","8732","cabriolet","4","ROOD","Niet geregistreerd","4","1598","1390","1767","1490",,"880","20111009","20150428","Geen verstrekking in Open Data","29190","Ja",,,,,,,"2","4",,,,,,"M1",,,"schutbord r.","1767",,,,,,,"0.06","255","Nee","Nee",,"Nee","2647",,,"2024","Geen oordeel","05","Ja","2025-05-13T00:00:00.000","2019-12-06T00:00:00.000","2011-10-09T00:00:00.000","2015-04-28T00:00:00.000",,,,,,,,,,,,,,,,,,,,,,,,,,,,"https://opendata.rdw.nl/resource/3huj-srit.json","https://opendata.rdw.nl/resource/8ys7-d773.json","https://opendata.rdw.nl/resource/vezc-m2t6.json","https://opendata.rdw.nl/resource/jhie-znh9.json","https://opendata.rdw.nl/resource/kmfi-hrps.json"
"GJ596T","Personenauto","PEUGEOT","207 CC","20240903","20210904","9180","cabriolet","4","GRIJS","Niet geregistreerd","4","1598","1386","1767","1486",,"880","20110408","20150604","Geen verstrekking in Open Data","32445","Ja",,,,,,,"2","4",,,,,,"M1",,,"r. schutbord","1767",,,,,,,"0.06","255","Nee","Nee",,"Nee","2647",,,"2024","Geen oordeel","05","Ja","2024-09-03T00:00:00.000","2021-09-04T00:00:00.000","2011-04-08T00:00:00.000","2015-06-04T00:00:00.000",,,,,,,,,,,,,,,,,,,,,,,,,,,,"https://opendata.rdw.nl/resource/3huj-srit.json","https://opendata.rdw.nl/resource/8ys7-d773.json","https://opendata.rdw.nl/resource/vezc-m2t6.json","https://opendata.rdw.nl/resource/jhie-znh9.json","https://opendata.rdw.nl/resource/kmfi-hrps.json"
"GK009N","Personenauto","PEUGEOT","207 CC 1.6 120","20250408","20210409","3291","cabriolet","4","ROOD","Niet geregistreerd","4","1598","1360","1709","1460","600","1040","20100421","20150910","Geen verstrekking in Open Data","25940","Ja",,,,,,,"2","4",,,,,,"M1",,,"schutbord by motorruimte","1709",,"G3 gasinstallatie",,,,,"0.06","256","Nee","Nee",,"Nee",,,,"2024","Geen oordeel","05","Ja","2025-04-08T00:00:00.000","2021-04-09T00:00:00.000","2010-04-21T00:00:00.000","2015-09-10T00:00:00.000",,,,,,,,,,,,,,,,,,,,,,,,,,,,"https://opendata.rdw.nl/resource/3huj-srit.json","https://opendata.rdw.nl/resource/8ys7-d773.json","https://opendata.rdw.nl/resource/vezc-m2t6.json","https://opendata.rdw.nl/resource/jhie-znh9.json","https://opendata.rdw.nl/resource/kmfi-hrps.json"
"GT444N","Personenauto","PEUGEOT","207 CC 1.6 120","20240719","20220719","2019","cabriolet","4","WIT","Niet geregistreerd","4","1598","1317","1709","1417","600","1040","20101119","20150819","Geen verstrekking in Open Data","25791","Ja",,,,,,,"2","4",,,,,,"M1",,,"r. schutbord by motorruimte","1709",,,,,,,"0.06","254","Nee","Nee",,"Nee","2559",,,"2023","Geen oordeel","05","Ja","2024-07-19T00:00:00.000","2022-07-19T00:00:00.000","2010-11-19T00:00:00.000","2015-08-19T00:00:00.000",,,,,,,,,,,,,,,,,,,,,,,,,,,,"https://opendata.rdw.nl/resource/3huj-srit.json","https://opendata.rdw.nl/resource/8ys7-d773.json","https://opendata.rdw.nl/resource/vezc-m2t6.json","https://opendata.rdw.nl/resource/jhie-znh9.json","https://opendata.rdw.nl/resource/kmfi-hrps.json"
"K452ZD","Personenauto","PEUGEOT","207 CC","20240601","20220601","6177","cabriolet","4","BLAUW","Niet geregistreerd","4","1598","1339","1709","1439",,"850","20120927","20210430","Geen verstrekking in Open Data","29219","Ja",,,,,,,"2","4",,,,,,"M1",,,,"1709",,,,,,,"0.06","254","Nee","Nee",,"Nee","2559",,,"2023","Geen oordeel","05","Ja","2024-06-01T00:00:00.000","2022-06-01T00:00:00.000","2012-09-27T00:00:00.000","2021-04-30T00:00:00.000",,,,,,,,,,,,,,,,,,,,,,,,,,,,"https://opendata.rdw.nl/resource/3huj-srit.json","https://opendata.rdw.nl/resource/8ys7-d773.json","https://opendata.rdw.nl/resource/vezc-m2t6.json","https://opendata.rdw.nl/resource/jhie-znh9.json","https://opendata.rdw.nl/resource/kmfi-hrps.json"
"PD091R","Personenauto","PEUGEOT","207 CC","20240721","20200907","5516","cabriolet","4","ZWART","Niet geregistreerd","4","1598","1393","1760","1493","600","1070","20080731","20170531","Geen verstrekking in Open Data",,"Ja",,,,,,,"2","4",,,,,,"M1",,,"r. by motorruimte","1760",,,,,,,"0.07","254","Nee","Nee",,"Nee",,,,"2023","Geen oordeel","05","Ja","2024-07-21T00:00:00.000","2020-09-07T00:00:00.000","2008-07-31T00:00:00.000","2017-05-31T00:00:00.000",,,,,,,,,,,,,,,,,,,,,,,,,,,,"https://opendata.rdw.nl/resource/3huj-srit.json","https://opendata.rdw.nl/resource/8ys7-d773.json","https://opendata.rdw.nl/resource/vezc-m2t6.json","https://opendata.rdw.nl/resource/jhie-znh9.json","https://opendata.rdw.nl/resource/kmfi-hrps.json"
"PD429K","Personenauto","PEUGEOT","207","20240630","20170909","818","cabriolet","4","GRIJS","Niet geregistreerd","4","1598","1393","1760","1493","600","1070","20090326","20170530","Geen verstrekking in Open Data","30500","Ja",,,,,,,"2","4","0","0",,"404","0","M1",,,"r. op schutbord onder motorkap","1760","207 CC",,"e2*2001/116*0340*06","B5FX","C","0","0.07","254","Nee","Nee",,"Nee","2650","0","0.00","2023","Geen oordeel","05","Ja","2024-06-30T00:00:00.000","2017-09-09T00:00:00.000","2009-03-26T00:00:00.000","2017-05-30T00:00:00.000",,,,,,,,,,,,,,,,,,,,,"D",,,,,,,"https://opendata.rdw.nl/resource/3huj-srit.json","https://opendata.rdw.nl/resource/8ys7-d773.json","https://opendata.rdw.nl/resource/vezc-m2t6.json","https://opendata.rdw.nl/resource/jhie-znh9.json","https://opendata.rdw.nl/resource/kmfi-hrps.json"
"PP407J","Personenauto","PEUGEOT","207 CC","20240606","20230608","570","cabriolet","4","ZWART","Niet geregistreerd","4","1598","1339","1709","1439",,,"20120510","20170811","Geen verstrekking in Open Data","28255","Ja",,,,,,,"2","4",,,,,,"M1",,,"r. schutbord","1709",,,,,,,"0.06","254","Nee","Nee",,"Nee",,,,"2023","Geen oordeel","05","Ja","2024-06-06T00:00:00.000","2023-06-08T00:00:00.000","2012-05-10T00:00:00.000","2017-08-11T00:00:00.000",,,,,,,,,,,,,,,,,,,,,,,,,,,,"https://opendata.rdw.nl/resource/3huj-srit.json","https://opendata.rdw.nl/resource/8ys7-d773.json","https://opendata.rdw.nl/resource/vezc-m2t6.json","https://opendata.rdw.nl/resource/jhie-znh9.json","https://opendata.rdw.nl/resource/kmfi-hrps.json"
"RN560G","Personenauto","PEUGEOT","207 CC","20250330","20180331","4234","cabriolet","4","GRIJS","Niet geregistreerd","4","1598","1386","1767","1486",,,"20100430","20180331","Geen verstrekking in Open Data","29585","Ja",,,,,,,"2","4",,,,,,"M1",,,,"1767",,,,,,,"0.06","254","Nee","Nee",,"Nee",,,,"2024","Geen oordeel","05","Ja","2025-03-30T00:00:00.000","2018-03-31T00:00:00.000","2010-04-30T00:00:00.000","2018-03-31T00:00:00.000",,,,,,,,,,,,,,,,,,,,,,,,,,,,"https://opendata.rdw.nl/resource/3huj-srit.json","https://opendata.rdw.nl/resource/8ys7-d773.json","https://opendata.rdw.nl/resource/vezc-m2t6.json","https://opendata.rdw.nl/resource/jhie-znh9.json","https://opendata.rdw.nl/resource/kmfi-hrps.json"
"RV199K","Personenauto","PEUGEOT","207 CC 1.6 I 16V","20250122","20180206","6124","cabriolet","4","WIT","Niet geregistreerd","4","1598","1386","1767","1486",,,"20110608","20180206","Geen verstrekking in Open Data","27100","Ja",,,,,,,"2","4",,,,,,"M1",,,"r. schutbord","1767",,,,,,,"0.06","254","Nee","Nee",,"Nee",,,,"2024","Geen oordeel","05","Ja","2025-01-22T00:00:00.000","2018-02-06T00:00:00.000","2011-06-08T00:00:00.000","2018-02-06T00:00:00.000",,,,,,,,,,,,,,,,,,,,,,,,,,,,"https://opendata.rdw.nl/resource/3huj-srit.json","https://opendata.rdw.nl/resource/8ys7-d773.json","https://opendata.rdw.nl/resource/vezc-m2t6.json","https://opendata.rdw.nl/resource/jhie-znh9.json","https://opendata.rdw.nl/resource/kmfi-hrps.json"
"S368PS","Personenauto","PEUGEOT","207 CC","20250112","20240112","840","cabriolet","4","GRIJS","Niet geregistreerd","4","1598","1384","1774","1484",,,"20100628","20240112","Geen verstrekking in Open Data","30011","Ja",,,,,,,"3","4",,,,,,"M1",,,,"1774",,,,,,,"0.08","254","Nee","Nee",,"Nee","2664",,,"2024","Geen oordeel","05","Ja","2025-01-12T00:00:00.000","2024-01-12T00:00:00.000","2010-06-28T00:00:00.000","2024-01-12T00:00:00.000",,,,,,,,,,,,,,,,,,,,,,"20230302","2023-03-02T00:00:00.000",,,,,"https://opendata.rdw.nl/resource/3huj-srit.json","https://opendata.rdw.nl/resource/8ys7-d773.json","https://opendata.rdw.nl/resource/vezc-m2t6.json","https://opendata.rdw.nl/resource/jhie-znh9.json","https://opendata.rdw.nl/resource/kmfi-hrps.json"
"XR528T","Personenauto","PEUGEOT","207 CC","20250327","20190409","4693","cabriolet","4","ZWART","Niet geregistreerd","4","1598","1165","1720","1265",,,"20080606","20190409","Geen verstrekking in Open Data",,"Ja",,,,,,,"2","4",,,,,,"M1",,,,"1720","5FW",,,,,,"0.07","254","Nee","Nee",,"Nee","2570",,,"2024","Geen oordeel","05","Ja","2025-03-27T00:00:00.000","2019-04-09T00:00:00.000","2008-06-06T00:00:00.000","2019-04-09T00:00:00.000",,,,,,,,,,,,,,,,,,,,,,,,,,,,"https://opendata.rdw.nl/resource/3huj-srit.json","https://opendata.rdw.nl/resource/8ys7-d773.json","https://opendata.rdw.nl/resource/vezc-m2t6.json","https://opendata.rdw.nl/resource/jhie-znh9.json","https://opendata.rdw.nl/resource/kmfi-hrps.json"
"ZF263N","Personenauto","PEUGEOT","207 CC 1,6I 16V","20240728","20230822","1003","cabriolet","4","GRIJS","Niet geregistreerd","4","1598","1339","1709","1439",,,"20111011","20190627","Geen verstrekking in Open Data","84025","Ja",,,,,,,"2","4",,,,,,"M1",,,,"1709","1PA7 32",,,,,,"0.06","254","Nee","Nee",,"Nee",,,,"2024","Geen oordeel","05","Ja","2024-07-28T00:00:00.000","2023-08-22T00:00:00.000","2011-10-11T00:00:00.000","2019-06-27T00:00:00.000",,,,,,,,,,,,,,,,,,,,,,,,,,,,"https://opendata.rdw.nl/resource/3huj-srit.json","https://opendata.rdw.nl/resource/8ys7-d773.json","https://opendata.rdw.nl/resource/vezc-m2t6.json","https://opendata.rdw.nl/resource/jhie-znh9.json","https://opendata.rdw.nl/resource/kmfi-hrps.json"
