"kenteken","voertuigsoort","merk","handelsbenaming","vervaldatum_apk","datum_tenaamstelling","bruto_bpm","inrichting","aantal_zitplaatsen","eerste_kleur","tweede_kleur","aantal_cilinders","cilinderinhoud","massa_ledig_voertuig","toegestane_maximum_massa_voertuig","massa_rijklaar","maximum_massa_trekken_ongeremd","maximum_trekken_massa_geremd","datum_eerste_toelating","datum_eerste_tenaamstelling_in_nederland","wacht_op_keuren","catalogusprijs","wam_verzekerd","maximale_constructiesnelheid","laadvermogen","oplegger_geremd","aanhangwagen_autonoom_geremd","aanhangwagen_middenas_geremd","aantal_staanplaatsen","aantal_deuren","aantal_wielen","afstand_hart_koppeling_tot_achterzijde_voertuig","afstand_voorzijde_voertuig_tot_hart_koppeling","afwijkende_maximum_snelheid","lengte","breedte","europese_voertuigcategorie","europese_voertuigcategorie_toevoeging","europese_uitvoeringcategorie_toevoeging","plaats_chassisnummer","technische_max_massa_voertuig","type","type_gasinstallatie","typegoedkeuringsnummer","variant","uitvoering","volgnummer_wijziging_eu_typegoedkeuring","vermogen_massarijklaar","wielbasis","export_indicator","openstaande_terugroepactie_indicator","vervaldatum_tachograaf","taxi_indicator","maximum_massa_samenstelling","aantal_rolstoelplaatsen","maximum_ondersteunende_snelheid","jaar_laatste_registratie_tellerstand","tellerstandoordeel","code_toelichting_tellerstandoordeel","tenaamstellen_mogelijk","vervaldatum_apk_dt","datum_tenaamstelling_dt","datum_eerste_toelating_dt","datum_eerste_tenaamstelling_in_nederland_dt","vervaldatum_tachograaf_dt","maximum_last_onder_de_vooras_sen_tezamen_koppeling","type_remsysteem_voertuig_code","rupsonderstelconfiguratiecode","wielbasis_voertuig_minimum","wielbasis_voertuig_maximum","lengte_voertuig_minimum","lengte_voertuig_maximum","breedte_voertuig_minimum","breedte_voertuig_maximum","hoogte_voertuig","hoogte_voertuig_minimum","hoogte_voertuig_maximum","massa_bedrijfsklaar_minimaal","massa_bedrijfsklaar_maximaal","technisch_toelaatbaar_massa_koppelpunt","maximum_massa_technisch_maximaal","maximum_massa_technisch_minimaal","subcategorie_nederland","verticale_belasting_koppelpunt_getrokken_voertuig","zuinigheidsclassificatie","registratie_datum_goedkeuring_afschrijvingsmoment_bpm","registratie_datum_goedkeuring_afschrijvingsmoment_bpm_dt","gem_lading_wrde","aerodyn_voorz","massa_alt_aandr","verl_cab_ind","api_gekentekende_voertuigen_assen","api_gekentekende_voertuigen_brandstof","api_gekentekende_voertuigen_carrosserie","api_gekentekende_voertuigen_carrosserie_specifiek","api_gekentekende_voertuigen_voertuigklasse"
"01DNKG","Personenauto","OPEL","ASTRA-G-CARAVAN","20250111","20080514","3990","stationwagen","5","GROEN","Niet geregistreerd","4","1598","1109","1720","1209","600","850","19991015","19991015","Geen verstrekking in Open Data",,"Ja",,,,,,,"4","4","0","0",,"429","0","M1",,,"op bodemplaat by r. voorzitting","1720",,,"e1*98/14*0087*05","FC11","2A02BE12FDB5","1","0.05","261","Nee","Nee",,"Nee","2570","0",,"2024","Geen oordeel","07","Ja","2025-01-11T00:00:00.000","2008-05-14T00:00:00.000","1999-10-15T00:00:00.000","1999-10-15T00:00:00.000",,,,,,,,,,,,,,,,,,,,,,,,,,,,"https://opendata.rdw.nl/resource/3huj-srit.json","https://opendata.rdw.nl/resource/8ys7-d773.json","https://opendata.rdw.nl/resource/vezc-m2t6.json","https://opendata.rdw.nl/resource/jhie-znh9.json","https://opendata.rdw.nl/resource/kmfi-hrps.json"
"01DPLH","Personenauto","OPEL","ASTRA-G-CARAVAN","20250124","20190326","4758","stationwagen","5","GRIJS","Niet geregistreerd","4","1796","1169","1750","1269","625","1200","19991015","19991015","Geen verstrekking in Open Data",,"Ja",,,,,,,"4","4","0","0",,"429","0","M1",,,"op bodemplaat by r. voorzitting","1750",,,"e1*98/14*0087*05","EF11","2A08AU16FDG5","1","0.07","261","Nee","Nee",,"Nee","2950","0",,"2024","Logisch","00","Ja","2025-01-24T00:00:00.000","2019-03-26T00:00:00.000","1999-10-15T00:00:00.000","1999-10-15T00:00:00.000",,,,,,,,,,,,,,,,,,,,,,,,,,,,"https://opendata.rdw.nl/resource/3huj-srit.json","https://opendata.rdw.nl/resource/8ys7-d773.json","https://opendata.rdw.nl/resource/vezc-m2t6.json","https://opendata.rdw.nl/resource/jhie-znh9.json","https://opendata.rdw.nl/resource/kmfi-hrps.json"
"01FNPF","Personenauto","OPEL","ASTRA-G-CARAVAN","20250602","20080909","4274","stationwagen","5","ROOD","Niet geregistreerd","4","1598","1110","1740","1210","600","1050","20000503","20000503","Geen verstrekking in Open Data",,"Ja",,,,,,,"4","4","0","0",,"429","0","M1",,,"op bodemplaat by r. voorzitting","1740",,,"e1*97/27*0087*02","FD11","2A18AS16FDH5","1","0.06","261","Nee","Nee",,"Nee","2790","0",,"2024","Logisch","00","Ja","2025-06-02T00:00:00.000","2008-09-09T00:00:00.000","2000-05-03T00:00:00.000","2000-05-03T00:00:00.000",,,,,,,,,,,,,,,,,,,,,,,,,,,,"https://opendata.rdw.nl/resource/3huj-srit.json","https://opendata.rdw.nl/resource/8ys7-d773.json","https://opendata.rdw.nl/resource/vezc-m2t6.json","https://opendata.rdw.nl/resource/jhie-znh9.json","https://opendata.rdw.nl/resource/kmfi-hrps.json"
"01GTRJ","Personenauto","OPEL","ASTRA-G-CARAVAN","20250323","20100116","3877","stationwagen","5","GROEN","Niet geregistreerd","4","1598","1135","1730","1235","570","1000","20010323","20010323","Geen verstrekking in Open Data",,"Ja",,,,,,,"4","4","0","0",,"429","0","M1",,,"op bodemplaat by r. voorzitting","1730",,,"e1*98/14*0087*09","FR11","2A16AP12FDD5","1","0.05","261","Nee","Nee",,"Nee","2730","0",,"2024","Geen oordeel","07","Ja","2025-03-23T00:00:00.000","2010-01-16T00:00:00.000","2001-03-23T00:00:00.000","2001-03-23T00:00:00.000",,,,,,,,,,,,,,,,,,,,,"C",,,,,,,"https://opendata.rdw.nl/resource/3huj-srit.json","https://opendata.rdw.nl/resource/8ys7-d773.json","https://opendata.rdw.nl/resource/vezc-m2t6.json","https://opendata.rdw.nl/resource/jhie-znh9.json","https://opendata.rdw.nl/resource/kmfi-hrps.json"
"01GZFB","Personenauto","OPEL","ASTRA-G-CARAVAN","20241117","20181208","3877","stationwagen","5","GRIJS","Niet geregistreerd","4","1598","1135","1730","1235","570","1000","20010426","20010426","Geen verstrekking in Open Data",,"Ja",,,,,,,"4","4","0","0",,"429","0","M1",,,"op bodemplaat by r. voorzitting","1730",,,"e1*98/14*0087*09","FR11","2A16AP12FDD5","1","0.05","261","Nee","Nee",,"Nee","2730","0",,"2023","Logisch","00","Ja","2024-11-17T00:00:00.000","2018-12-08T00:00:00.000","2001-04-26T00:00:00.000","2001-04-26T00:00:00.000",,,,,,,,,,,,,,,,,,,,,"C",,,,,,,"https://opendata.rdw.nl/resource/3huj-srit.json","https://opendata.rdw.nl/resource/8ys7-d773.json","https://opendata.rdw.nl/resource/vezc-m2t6.json","https://opendata.rdw.nl/resource/jhie-znh9.json","https://opendata.rdw.nl/resource/kmfi-hrps.json"
"01GZTS","Personenauto","OPEL","ASTRA-G-CARAVAN","20240510","20020118","4022","stationwagen","5","GRIJS","Niet geregistreerd","4","1598","1145","1740","1245","570","1100","20010507","20010507","Geen verstrekking in Open Data",,"Ja",,,,,,,"4","4","0","0",,"429","0","M1",,,"op bodemplaat by r. voorzitting","1740",,,"e1*98/14*0087*09","FS11","2A18AS14FDH5","1","0.06","261","Nee","Nee",,"Nee","2840","0",,"2023","Geen oordeel","07","Ja","2024-05-10T00:00:00.000","2002-01-18T00:00:00.000","2001-05-07T00:00:00.000","2001-05-07T00:00:00.000",,,,,,,,,,,,,,,,,,,,,"C",,,,,,,"https://opendata.rdw.nl/resource/3huj-srit.json","https://opendata.rdw.nl/resource/8ys7-d773.json","https://opendata.rdw.nl/resource/vezc-m2t6.json","https://opendata.rdw.nl/resource/jhie-znh9.json","https://opendata.rdw.nl/resource/kmfi-hrps.json"
"01HXRF","Personenauto","OPEL","ASTRA-G-CARAVAN","20250220","20240123","3738","stationwagen","5","BLAUW","Niet geregistreerd","4","1598","1135","1730","1235","570","1000","20020117","20020117","Geen verstrekking in Open Data",,"Ja",,,,,,,"4","4","0","0",,"429","0","M1",,,"op bodemplaat by r. voorzitting","1730",,,"e1*98/14*0087*10","FR11","2A16AP12FDD5","0","0.05","261","Nee","Nee",,"Nee","2730","0",,"2024","Logisch","00","Ja","2025-02-20T00:00:00.000","2024-01-23T00:00:00.000","2002-01-17T00:00:00.000","2002-01-17T00:00:00.000",,,,,,,,,,,,,,,,,,,,,"C",,,,,,,"https://opendata.rdw.nl/resource/3huj-srit.json","https://opendata.rdw.nl/resource/8ys7-d773.json","https://opendata.rdw.nl/resource/vezc-m2t6.json","https://opendata.rdw.nl/resource/jhie-znh9.json","https://opendata.rdw.nl/resource/kmfi-hrps.json"
"01HZFF","Personenauto","OPEL","ASTRA-G-CABRIO","20250424","20140426","8395","cabriolet","4","GROEN","Niet geregistreerd","4","2198","1293","1785","1393",,,"20020114","20020114","Geen verstrekking in Open Data",,"Ja",,,,,,,"2","4","0","0",,"427","0","M1",,,"op bodemplaat by r. voorzitting","1785",,,"e1*98/14*0132*07","SM11","2A07AS15JJA4","0","0.08","261","Nee","Nee",,"Nee","0","0",,"2024","Geen oordeel","07","Ja","2025-04-24T00:00:00.000","2014-04-26T00:00:00.000","2002-01-14T00:00:00.000","2002-01-14T00:00:00.000",,,,,,,,,,,,,,,,,,,,,"E",,,,,,,"https://opendata.rdw.nl/resource/3huj-srit.json","https://opendata.rdw.nl/resource/8ys7-d773.json","https://opendata.rdw.nl/resource/vezc-m2t6.json","https://opendata.rdw.nl/resource/jhie-znh9.json","https://opendata.rdw.nl/resource/kmfi-hrps.json"
"01HZHR","Personenauto","OPEL","ASTRA-G-CARAVAN","20240714","20230121","4151","stationwagen","5","GRIJS","Niet geregistreerd","4","1598","1145","1740","1245","570","1100","20020116","20020116","Geen verstrekking in Open Data",,"Ja",,,,,,,"4","4","0","0",,"429","0","M1",,,"op bodemplaat by r. voorzitting","1740",,,"e1*98/14*0087*10","FS11","2A18AS14FDH5","0","0.06","261","Nee","Nee",,"Nee","2840","0",,"2023","Logisch","00","Ja","2024-07-14T00:00:00.000","2023-01-21T00:00:00.000","2002-01-16T00:00:00.000","2002-01-16T00:00:00.000",,,,,,,,,,,,,,,,,,,,,"C",,,,,,,"https://opendata.rdw.nl/resource/3huj-srit.json","https://opendata.rdw.nl/resource/8ys7-d773.json","https://opendata.rdw.nl/resource/vezc-m2t6.json","https://opendata.rdw.nl/resource/jhie-znh9.json","https://opendata.rdw.nl/resource/kmfi-hrps.json"
"01JJDK","Personenauto","OPEL","ASTRA-G-CABRIO","20240608","20230113","7213","cabriolet","4","GRIJS","Niet geregistreerd","4","1598","1250","1715","1350","570","1150","20020418","20020418","Geen verstrekking in Open Data",,"Ja",,,,,,,"2","4","0","0",,"427","0","M1",,,"op bodemplaat by r. voorzitting","1715",,,"e1*98/14*0132*08","SS11","2A04AM06FDC4","0","0.05","261","Nee","Nee",,"Nee","2745","0",,"2023","Logisch","00","Ja","2024-06-08T00:00:00.000","2023-01-13T00:00:00.000","2002-04-18T00:00:00.000","2002-04-18T00:00:00.000",,,,,,,,,,,,,,,,,,,,,"C",,,,,,,"https://opendata.rdw.nl/resource/3huj-srit.json","https://opendata.rdw.nl/resource/8ys7-d773.json","https://opendata.rdw.nl/resource/vezc-m2t6.json","https://opendata.rdw.nl/resource/jhie-znh9.json","https://opendata.rdw.nl/resource/kmfi-hrps.json"
"01JJVL","Personenauto","OPEL","ASTRA-G-CABRIO","20250331","20220312","7042","cabriolet","4","GROEN","Niet geregistreerd","4","1796","1280","1745","1380","630","1300","20020502","20020502","Geen verstrekking in Open Data",,"Ja",,,,,,,"2","4","0","0",,"427","0","M1",,,"op bodemplaat by r. voorzitting","1745",,,"e1*98/14*0132*08","ST11","2A06AP09FDA4","0","0.07","261","Nee","Nee",,"Nee","3045","0",,"2024","Logisch","00","Ja","2025-03-31T00:00:00.000","2022-03-12T00:00:00.000","2002-05-02T00:00:00.000","2002-05-02T00:00:00.000",,,,,,,,,,,,,,,,,,,,,"D",,,,,,,"https://opendata.rdw.nl/resource/3huj-srit.json","https://opendata.rdw.nl/resource/8ys7-d773.json","https://opendata.rdw.nl/resource/vezc-m2t6.json","https://opendata.rdw.nl/resource/jhie-znh9.json","https://opendata.rdw.nl/resource/kmfi-hrps.json"
"01JKFD","Personenauto","OPEL","ASTRA-G-CARAVAN","20240616","20190612","3738","stationwagen","5","GRIJS","Niet geregistreerd","4","1598","1135","1730","1235","570","1000","20020503","20020503","Geen verstrekking in Open Data",,"Ja",,,,,,,"4","4","0","0",,"429","0","M1",,,"op bodemplaat by r. voorzitting","1730",,,"e1*98/14*0087*11","FR11","2A16AP12FDD5","0","0.05","261","Nee","Nee",,"Nee","2730","0",,"2023","Logisch","00","Ja","2024-06-16T00:00:00.000","2019-06-12T00:00:00.000","2002-05-03T00:00:00.000","2002-05-03T00:00:00.000",,,,,,,,,,,,,,,,,,,,,"C",,,,,,,"https://opendata.rdw.nl/resource/3huj-srit.json","https://opendata.rdw.nl/resource/8ys7-d773.json","https://opendata.rdw.nl/resource/vezc-m2t6.json","https://opendata.rdw.nl/resource/jhie-znh9.json","https://opendata.rdw.nl/resource/kmfi-hrps.json"
"01JTS8","Personenauto","OPEL","ASTRA-G-CABRIO","20250301","20191114","6905","cabriolet","4","GRIJS","Niet geregistreerd","4","2198","1313","1805","1413","675","1400","20020205","20090831","Geen verstrekking in Open Data",,"Ja",,,,,,,"2","4","0","0",,"427","0","M1",,,"op bodemplaat by r. voorzitting","1805",,,"e1*98/14*0132*08","SM11","2A08AT16LBA4","0","0.08","261","Nee","Nee",,"Nee","3205","0",,"2024","Geen oordeel","05","Ja","2025-03-01T00:00:00.000","2019-11-14T00:00:00.000","2002-02-05T00:00:00.000","2009-08-31T00:00:00.000",,"0",,,,,,,,,,,,,,,,,,,"E",,,,,,,"https://opendata.rdw.nl/resource/3huj-srit.json","https://opendata.rdw.nl/resource/8ys7-d773.json","https://opendata.rdw.nl/resource/vezc-m2t6.json","https://opendata.rdw.nl/resource/jhie-znh9.json","https://opendata.rdw.nl/resource/kmfi-hrps.json"
"01LLHZ","Personenauto","OPEL","ASTRA-G-CARAVAN","20240713","20160623","4314","stationwagen","5","ZWART","Niet geregistreerd","4","1598","1145","1740","1245","570","1100","20030219","20030219","Geen verstrekking in Open Data",,"Ja",,,,,,,"4","4","0","0",,"429","0","M1",,,"op bodemplaat by r. voorzitting","1740",,,"e1*98/14*0087*14","FS11","5A18AS14FDM5","0","0.06","261","Nee","Nee",,"Nee","2840","0",,"2023","Logisch","00","Ja","2024-07-13T00:00:00.000","2016-06-23T00:00:00.000","2003-02-19T00:00:00.000","2003-02-19T00:00:00.000",,,,,,,,,,,,,,,,,,,,,"C",,,,,,,"https://opendata.rdw.nl/resource/3huj-srit.json","https://opendata.rdw.nl/resource/8ys7-d773.json","https://opendata.rdw.nl/resource/vezc-m2t6.json","https://opendata.rdw.nl/resource/jhie-znh9.json","https://opendata.rdw.nl/resource/kmfi-hrps.json"
"01LNJZ","Personenauto","OPEL","ASTRA-G-CARAVAN","20250312","20031204","3681","stationwagen","5","ZWART","Niet geregistreerd","4","1598","1135","1730","1235","570","1000","20030311","20030311","Geen verstrekking in Open Data",,"Ja",,,,,,,"4","4","0","0",,"429","0","M1",,,"op bodemplaat by r. voorzitting","1730",,,"e1*98/14*0087*13","FR11","2A16AP12FDD5","0","0.05","261","Nee","Nee",,"Nee","2730","0",,"2024","Logisch","00","Ja","2025-03-12T00:00:00.000","2003-12-04T00:00:00.000","2003-03-11T00:00:00.000","2003-03-11T00:00:00.000",,,,,,,,,,,,,,,,,,,,,"D",,,,,,,"https://opendata.rdw.nl/resource/3huj-srit.json","https://opendata.rdw.nl/resource/8ys7-d773.json","https://opendata.rdw.nl/resource/vezc-m2t6.json","https://opendata.rdw.nl/resource/jhie-znh9.json","https://opendata.rdw.nl/resource/kmfi-hrps.json"
"01LXBJ","Personenauto","OPEL","ASTRA-G-CARAVAN","20241020","20191108","4011","stationwagen","5","GRIJS","Niet geregistreerd","4","1598","1145","1740","1245","570","1100","20030613","20030613","Geen verstrekking in Open Data",,"Ja",,,,,,,"4","4","0","0",,"429","0","M1",,,"op bodemplaat by r. voorzitting","1740",,,"e1*98/14*0087*15","FS11","5A18AS14FDM5","0","0.06","261","Nee","Nee",,"Nee","2840","0",,"2023","Logisch","00","Ja","2024-10-20T00:00:00.000","2019-11-08T00:00:00.000","2003-06-13T00:00:00.000","2003-06-13T00:00:00.000",,,,,,,,,,,,,,,,,,,,,"C",,,,,,,"https://opendata.rdw.nl/resource/3huj-srit.json","https://opendata.rdw.nl/resource/8ys7-d773.json","https://opendata.rdw.nl/resource/vezc-m2t6.json","https://opendata.rdw.nl/resource/jhie-znh9.json","https://opendata.rdw.nl/resource/kmfi-hrps.json"
"01LZNL","Personenauto","OPEL","ASTRA-G-CARAVAN","20241213","20101214","4011","stationwagen","5","ZWART","Niet geregistreerd","4","1598","1145","1740","1245","570","1100","20030630","20030630","Geen verstrekking in Open Data",,"Ja",,,,,,,"4","4","0","0",,"429","0","M1",,,"op bodemplaat by r. voorzitting","1740",,,"e1*98/14*0087*15","FS11","5A18AS14FDM5","0","0.06","261","Nee","Nee",,"Nee","2840","0",,"2023","Logisch","00","Ja","2024-12-13T00:00:00.000","2010-12-14T00:00:00.000","2003-06-30T00:00:00.000","2003-06-30T00:00:00.000",,,,,,,,,,,,,,,,,,,,,"C",,,,,,,"https://opendata.rdw.nl/resource/3huj-srit.json","https://opendata.rdw.nl/resource/8ys7-d773.json","https://opendata.rdw.nl/resource/vezc-m2t6.json","https://opendata.rdw.nl/resource/jhie-znh9.json","https://opendata.rdw.nl/resource/kmfi-hrps.json"
"01LZRF","Personenauto","OPEL","ASTRA-G-CARAVAN","20240702","20110701","4011","stationwagen","5","GRIJS","Niet geregistreerd","4","1598","1145","1740","1245","570","1100","20030630","20030630","Geen verstrekking in Open Data",,"Ja",,,,,,,"4","4","0","0",,"429","0","M1",,,"op bodemplaat by r. voorzitting","1740",,,"e1*98/14*0087*15","FS11","5A18AS14FDM5","0","0.06","261","Nee","Nee",,"Nee","2840","0",,"2023","Geen oordeel","07","Ja","2024-07-02T00:00:00.000","2011-07-01T00:00:00.000","2003-06-30T00:00:00.000","2003-06-30T00:00:00.000",,,,,,,,,,,,,,,,,,,,,"C",,,,,,,"https://opendata.rdw.nl/resource/3huj-srit.json","https://opendata.rdw.nl/resource/8ys7-d773.json","https://opendata.rdw.nl/resource/vezc-m2t6.json","https://opendata.rdw.nl/resource/jhie-znh9.json","https://opendata.rdw.nl/resource/kmfi-hrps.json"
"01NBHJ","Personenauto","OPEL","ASTRA-G-CARAVAN","20250208","20150121","4974","stationwagen","5","BLAUW","Niet geregistreerd","4","2198","1178","1810","1278","630","1400","20030709","20030709","Geen verstrekking in Open Data",,"Ja",,,,,,,"4","4","0","0",,"429","0","M1",,,"op bodemplaat by r. voorzitting","1810",,,"e1*98/14*0087*15","FM11","2A10A223JJP5","0","0.08","261","Nee","Nee",,"Nee","3210","0",,"2024","Logisch","00","Ja","2025-02-08T00:00:00.000","2015-01-21T00:00:00.000","2003-07-09T00:00:00.000","2003-07-09T00:00:00.000",,,,,,,,,,,,,,,,,,,,,"E",,,,,,,"https://opendata.rdw.nl/resource/3huj-srit.json","https://opendata.rdw.nl/resource/8ys7-d773.json","https://opendata.rdw.nl/resource/vezc-m2t6.json","https://opendata.rdw.nl/resource/jhie-znh9.json","https://opendata.rdw.nl/resource/kmfi-hrps.json"
"01NBLG","Personenauto","OPEL","ASTRA-G-CARAVAN","20241014","20190831","3763","stationwagen","5","GRIJS","Niet geregistreerd","4","1598","1135","1730","1235","570","1000","20030718","20030718","Geen verstrekking in Open Data",,"Ja",,,,,,,"4","4","0","0",,"429","0","M1",,,"op bodemplaat by r. voorzitting","1730",,,"e1*98/14*0087*15","FR11","5A16AP12FDM5","0","0.05","261","Nee","Nee",,"Nee","2730","0",,"2023","Logisch","00","Ja","2024-10-14T00:00:00.000","2019-08-31T00:00:00.000","2003-07-18T00:00:00.000","2003-07-18T00:00:00.000",,,,,,,,,,,,,,,,,,,,,"C",,,,,,,"https://opendata.rdw.nl/resource/3huj-srit.json","https://opendata.rdw.nl/resource/8ys7-d773.json","https://opendata.rdw.nl/resource/vezc-m2t6.json","https://opendata.rdw.nl/resource/jhie-znh9.json","https://opendata.rdw.nl/resource/kmfi-hrps.json"
"01NBZB","Personenauto","OPEL","ASTRA-G-CARAVAN","20240722","20220603","4176","stationwagen","5","ZWART","Niet geregistreerd","4","1598","1145","1740","1245","570","1100","20030722","20030722","Geen verstrekking in Open Data",,"Ja",,,,,,,"4","4","0","0",,"429","0","M1",,,"op bodemplaat by r. voorzitting","1740",,,"e1*98/14*0087*15","FS11","5A18AS14FDM5","0","0.06","261","Nee","Nee",,"Nee","2840","0",,"2023","Onlogisch","04","Ja","2024-07-22T00:00:00.000","2022-06-03T00:00:00.000","2003-07-22T00:00:00.000","2003-07-22T00:00:00.000",,,,,,,,,,,,,,,,,,,,,"C",,,,,,,"https://opendata.rdw.nl/resource/3huj-srit.json","https://opendata.rdw.nl/resource/8ys7-d773.json","https://opendata.rdw.nl/resource/vezc-m2t6.json","https://opendata.rdw.nl/resource/jhie-znh9.json","https://opendata.rdw.nl/resource/kmfi-hrps.json"
"01NDPV","Personenauto","OPEL","ASTRA-G-CARAVAN","20241020","20050106","4011","stationwagen","5","GRIJS","Niet geregistreerd","4","1598","1145","1740","1245","570","1100","20030731","20030731","Geen verstrekking in Open Data",,"Ja",,,,,,,"4","4","0","0",,"429","0","M1",,,"op bodemplaat by r. voorzitting","1740",,,"e1*98/14*0087*15","FS11","5A18AS14FDM5","0","0.06","261","Nee","Nee",,"Nee","2840","0",,"2023","Logisch","00","Ja","2024-10-20T00:00:00.000","2005-01-06T00:00:00.000","2003-07-31T00:00:00.000","2003-07-31T00:00:00.000",,,,,,,,,,,,,,,,,,,,,"C",,,,,,,"https://opendata.rdw.nl/resource/3huj-srit.json","https://opendata.rdw.nl/resource/8ys7-d773.json","https://opendata.rdw.nl/resource/vezc-m2t6.json","https://opendata.rdw.nl/resource/jhie-znh9.json","https://opendata.rdw.nl/resource/kmfi-hrps.json"
"01NLFD","Personenauto","OPEL","ASTRA-G-CARAVAN","20250307","20190309","4114","stationwagen","5","GRIJS","Niet geregistreerd","4","1598","1145","1740","1245","570","1100","20031128","20031128","Geen verstrekking in Open Data",,"Ja",,,,,,,"4","4","0","0",,"429","0","M1",,,"op bodemplaat by r. voorzitting","1740",,,"e1*98/14*0087*15","FS11","5A18AS14FDM5","0","0.06","261","Nee","Nee",,"Nee","2840","0",,"2024","Logisch","00","Ja","2025-03-07T00:00:00.000","2019-03-09T00:00:00.000","2003-11-28T00:00:00.000","2003-11-28T00:00:00.000",,,,,,,,,,,,,,,,,,,,,"C",,,,,,,"https://opendata.rdw.nl/resource/3huj-srit.json","https://opendata.rdw.nl/resource/8ys7-d773.json","https://opendata.rdw.nl/resource/vezc-m2t6.json","https://opendata.rdw.nl/resource/jhie-znh9.json","https://opendata.rdw.nl/resource/kmfi-hrps.json"
"01NLJB","Personenauto","OPEL","ASTRA-G-CABRIO","20250224","20060227","7955","cabriolet","4","GRIJS","Niet geregistreerd","4","1598","1250","1715","1350","570","1150","20031120","20031120","Geen verstrekking in Open Data",,"Ja",,,,,,,"2","4","0","0",,"427","0","M1",,,"op bodemplaat by r. voorzitting","1715",,,"e1*98/14*0132*12","SY11","2A04AM06FDC4","0","0.06","261","Nee","Nee",,"Nee","2745","0",,"2024","Logisch","00","Ja","2025-02-24T00:00:00.000","2006-02-27T00:00:00.000","2003-11-20T00:00:00.000","2003-11-20T00:00:00.000",,,,,,,,,,,,,,,,,,,,,"C",,,,,,,"https://opendata.rdw.nl/resource/3huj-srit.json","https://opendata.rdw.nl/resource/8ys7-d773.json","https://opendata.rdw.nl/resource/vezc-m2t6.json","https://opendata.rdw.nl/resource/jhie-znh9.json","https://opendata.rdw.nl/resource/kmfi-hrps.json"
"01RRR5","Personenauto","OPEL","ASTRA-G-CABRIO","20240623","20240217","7721","cabriolet","4","BLAUW","Niet geregistreerd","4","1796","1280","1745","1380","630","1300","20030129","20110708","Geen verstrekking in Open Data",,"Ja",,,,,,,"2","4","0","0",,"427","0","M1",,,"op bodemplaat by r. voorzitting","1745",,,"e1*98/14*0132*10","ST11","1A06AP09FDD4","0","0.07","261","Nee","Nee",,"Nee","3045","0",,"2023","Geen oordeel","05","Ja","2024-06-23T00:00:00.000","2024-02-17T00:00:00.000","2003-01-29T00:00:00.000","2011-07-08T00:00:00.000",,,,,,,,,,,,,,,,,,,,,"D",,,,,,,"https://opendata.rdw.nl/resource/3huj-srit.json","https://opendata.rdw.nl/resource/8ys7-d773.json","https://opendata.rdw.nl/resource/vezc-m2t6.json","https://opendata.rdw.nl/resource/jhie-znh9.json","https://opendata.rdw.nl/resource/kmfi-hrps.json"
"01STGF","Personenauto","OPEL","ASTRA-G-CABRIO","20240626","20180213","8002","cabriolet","4","GRIJS","Niet geregistreerd","4","1796","1280","1745","1380","630","1300","20020823","20060420","Geen verstrekking in Open Data",,"Ja",,,,,,,"2","4","0","0",,"427","0","M1",,,"op bodemplaat by r. voorzitting","1745",,,"e1*98/14*0132*08","ST11","2A06AP09FDA4","0","0.07","261","Nee","Nee",,"Nee","3045","0",,"2023","Geen oordeel","05","Nee","2024-06-26T00:00:00.000","2018-02-13T00:00:00.000","2002-08-23T00:00:00.000","2006-04-20T00:00:00.000",,,,,,,,,,,,,,,,,,,,,"D",,,,,,,"https://opendata.rdw.nl/resource/3huj-srit.json","https://opendata.rdw.nl/resource/8ys7-d773.json","https://opendata.rdw.nl/resource/vezc-m2t6.json","https://opendata.rdw.nl/resource/jhie-znh9.json","https://opendata.rdw.nl/resource/kmfi-hrps.json"