"kenteken","voertuigsoort","merk","handelsbenaming","vervaldatum_apk","datum_tenaamstelling","bruto_bpm","inrichting","aantal_zitplaatsen","eerste_kleur","tweede_kleur","aantal_cilinders","cilinderinhoud","massa_ledig_voertuig","toegestane_maximum_massa_voertuig","massa_rijklaar","maximum_massa_trekken_ongeremd","maximum_trekken_massa_geremd","datum_eerste_toelating","datum_eerste_tenaamstelling_in_nederland","wacht_op_keuren","catalogusprijs","wam_verzekerd","maximale_constructiesnelheid","laadvermogen","oplegger_geremd","aanhangwagen_autonoom_geremd","aanhangwagen_middenas_geremd","aantal_staanplaatsen","aantal_deuren","aantal_wielen","afstand_hart_koppeling_tot_achterzijde_voertuig","afstand_voorzijde_voertuig_tot_hart_koppeling","afwijkende_maximum_snelheid","lengte","breedte","europese_voertuigcategorie","europese_voertuigcategorie_toevoeging","europese_uitvoeringcategorie_toevoeging","plaats_chassisnummer","technische_max_massa_voertuig","type","type_gasinstallatie","typegoedkeuringsnummer","variant","uitvoering","volgnummer_wijziging_eu_typegoedkeuring","vermogen_massarijklaar","wielbasis","export_indicator","openstaande_terugroepactie_indicator","vervaldatum_tachograaf","taxi_indicator","maximum_massa_samenstelling","aantal_rolstoelplaatsen","maximum_ondersteunende_snelheid","jaar_laatste_registratie_tellerstand","tellerstandoordeel","code_toelichting_tellerstandoordeel","tenaamstellen_mogelijk","vervaldatum_apk_dt","datum_tenaamstelling_dt","datum_eerste_toelating_dt","datum_eerste_tenaamstelling_in_nederland_dt","vervaldatum_tachograaf_dt","maximum_last_onder_de_vooras_sen_tezamen_koppeling","type_remsysteem_voertuig_code","rupsonderstelconfiguratiecode","wielbasis_voertuig_minimum","wielbasis_voertuig_maximum","lengte_voertuig_minimum","lengte_voertuig_maximum","breedte_voertuig_minimum","breedte_voertuig_maximum","hoogte_voertuig","hoogte_voertuig_minimum","hoogte_voertuig_maximum","massa_bedrijfsklaar_minimaal","massa_bedrijfsklaar_maximaal","technisch_toelaatbaar_massa_koppelpunt","maximum_massa_technisch_maximaal","maximum_massa_technisch_minimaal","subcategorie_nederland","verticale_belasting_koppelpunt_getrokken_voertuig","zuinigheidsclassificatie","registratie_datum_goedkeuring_afschrijvingsmoment_bpm","registratie_datum_goedkeuring_afschrijvingsmoment_bpm_dt","gem_lading_wrde","aerodyn_voorz","massa_alt_aandr","verl_cab_ind","api_gekentekende_voertuigen_assen","api_gekentekende_voertuigen_brandstof","api_gekentekende_voertuigen_carrosserie","api_gekentekende_voertuigen_carrosserie_specifiek","api_gekentekende_voertuigen_voertuigklasse"
"G009BN","Personenauto","NISSAN","NISSAN LEAF 30KWH","20250414","20220110",,"MPV","5","GRIJS","Niet geregistreerd",,,"1425","1970","1525",,,"20170414","20190823","Geen verstrekking in Open Data","36240","Ja","144",,,,,,"4","4","0","0",,"445","177","M1",,,,"1970","ZE0",,"e11*2007/46*0230*11","A","A03","0","0.05","270","Nee","Nee",,"Nee","1970","0","0.00","2023","Geen oordeel","05","Ja","2025-04-14T00:00:00.000","2022-01-10T00:00:00.000","2017-04-14T00:00:00.000","2019-08-23T00:00:00.000",,,,,,,,,,,"155",,,,,,,,,,,,,,,,,"https://opendata.rdw.nl/resource/3huj-srit.json","https://opendata.rdw.nl/resource/8ys7-d773.json","https://opendata.rdw.nl/resource/vezc-m2t6.json","https://opendata.rdw.nl/resource/jhie-znh9.json","https://opendata.rdw.nl/resource/kmfi-hrps.json"
"G714BL","Personenauto","NISSAN","NISSAN LEAF 30KWH","20250509","20230907",,"MPV","5","WIT","Niet geregistreerd",,,"1445","1970","1545",,,"20160509","20190913","Geen verstrekking in Open Data","35289","Ja","144",,,,,,"4","4","0","0",,"445","177","M1",,,,"1970","ZE0",,"e11*2007/46*0230*10","A","A03","0","0.05","270","Nee","Nee",,"Nee","1970","0","0.00","2024","Geen oordeel","05","Ja","2025-05-09T00:00:00.000","2023-09-07T00:00:00.000","2016-05-09T00:00:00.000","2019-09-13T00:00:00.000",,,,,,,,,,,"155",,,,,,,,,,,,,,,,,"https://opendata.rdw.nl/resource/3huj-srit.json","https://opendata.rdw.nl/resource/8ys7-d773.json","https://opendata.rdw.nl/resource/vezc-m2t6.json","https://opendata.rdw.nl/resource/jhie-znh9.json","https://opendata.rdw.nl/resource/kmfi-hrps.json"
"H020GL","Personenauto","NISSAN","NISSAN LEAF 30KWH","20241109","20220504",,"MPV","5","BRUIN","Niet geregistreerd",,,"1445","1970","1545",,,"20161027","20200122","Geen verstrekking in Open Data","46276","Ja","144",,,,,,"4","4","0","0",,"445","177","M1",,,"r. schutbord","1970","ZE0",,"e11*2007/46*0230*10","A","A03","0","0.05","270","Nee","Nee",,"Nee","1970","0","0.00","2022","Geen oordeel","05","Ja","2024-11-09T00:00:00.000","2022-05-04T00:00:00.000","2016-10-27T00:00:00.000","2020-01-22T00:00:00.000",,,,,,,,,,,"155",,,,,,,,,,,,,,,,,"https://opendata.rdw.nl/resource/3huj-srit.json","https://opendata.rdw.nl/resource/8ys7-d773.json","https://opendata.rdw.nl/resource/vezc-m2t6.json","https://opendata.rdw.nl/resource/jhie-znh9.json","https://opendata.rdw.nl/resource/kmfi-hrps.json"
"H281VT","Personenauto","NISSAN","NISSAN LEAF 30KWH","20240630","20200606",,"MPV","5","ROOD","Niet geregistreerd",,,"1445","1970","1545",,,"20160630","20200606","Geen verstrekking in Open Data","35289","Ja","144",,,,,,"4","4","0","0",,"445","177","M1",,,,"1970","ZE0",,"e11*2007/46*0230*10","A","A03","0","0.05","270","Nee","Nee",,"Nee","1970","0","0.00","2023","Geen oordeel","05","Ja","2024-06-30T00:00:00.000","2020-06-06T00:00:00.000","2016-06-30T00:00:00.000","2020-06-06T00:00:00.000",,,,,,,,,,,"155",,,,,,,,,,,,,,,,,"https://opendata.rdw.nl/resource/3huj-srit.json","https://opendata.rdw.nl/resource/8ys7-d773.json","https://opendata.rdw.nl/resource/vezc-m2t6.json","https://opendata.rdw.nl/resource/jhie-znh9.json","https://opendata.rdw.nl/resource/kmfi-hrps.json"
"H321TK","Personenauto","NISSAN","NISSAN LEAF 30KWH","20250131","20200519",,"MPV","5","WIT","Niet geregistreerd",,,"1505","1970","1605",,,"20160127","20200519","Geen verstrekking in Open Data","35244","Ja",,,,,,,"4","4",,,,"445","177","M1",,,"r. schutbord","1970","ZE0",,,,,,"0.05","270","Nee","Nee",,"Nee",,,,"2023","Geen oordeel","05","Ja","2025-01-31T00:00:00.000","2020-05-19T00:00:00.000","2016-01-27T00:00:00.000","2020-05-19T00:00:00.000",,,,,,,,,,,"155",,,,,,,,,,,,,,,,,"https://opendata.rdw.nl/resource/3huj-srit.json","https://opendata.rdw.nl/resource/8ys7-d773.json","https://opendata.rdw.nl/resource/vezc-m2t6.json","https://opendata.rdw.nl/resource/jhie-znh9.json","https://opendata.rdw.nl/resource/kmfi-hrps.json"
"H466NZ","Personenauto","NISSAN","NISSAN LEAF 30KWH","20240728","20200729",,"MPV","5","GRIJS","Niet geregistreerd",,,"1460","1970","1560",,,"20170331","20200318","Geen verstrekking in Open Data","38640","Ja","144",,,,,,"4","4","0","0",,"445","177","M1",,,,"1970","ZE0",,"e11*2007/46*0230*11","A","A03","0","0.05","270","Nee","Nee",,"Nee","1970","0","0.00","2022","Geen oordeel","05","Ja","2024-07-28T00:00:00.000","2020-07-29T00:00:00.000","2017-03-31T00:00:00.000","2020-03-18T00:00:00.000",,,,,,,,,,,"155",,,,,,,,,,,,,,,,,"https://opendata.rdw.nl/resource/3huj-srit.json","https://opendata.rdw.nl/resource/8ys7-d773.json","https://opendata.rdw.nl/resource/vezc-m2t6.json","https://opendata.rdw.nl/resource/jhie-znh9.json","https://opendata.rdw.nl/resource/kmfi-hrps.json"
"H495RR","Personenauto","NISSAN","NISSAN LEAF 30KWH","20240623","20230624",,"MPV","5","WIT","Niet geregistreerd",,,"1495","1970","1595",,,"20161108","20200610","Geen verstrekking in Open Data","35289","Ja",,,,,,,"4","4","0","0",,"445","177","M1",,,"r. schutbord","1970","ZE0",,"e11*2007/46*0230*10","A","A03","0","0.05","270","Nee","Nee",,"Nee","1970","0","0.00","2023","Geen oordeel","05","Ja","2024-06-23T00:00:00.000","2023-06-24T00:00:00.000","2016-11-08T00:00:00.000","2020-06-10T00:00:00.000",,,,,,,,,,,"155",,,,,,,,,,,,,,,,,"https://opendata.rdw.nl/resource/3huj-srit.json","https://opendata.rdw.nl/resource/8ys7-d773.json","https://opendata.rdw.nl/resource/vezc-m2t6.json","https://opendata.rdw.nl/resource/jhie-znh9.json","https://opendata.rdw.nl/resource/kmfi-hrps.json"
"H504TT","Personenauto","NISSAN","NISSAN LEAF 30KWH","20250608","20200608",,"MPV","5","WIT","Niet geregistreerd",,,"1445","1970","1545",,,"20161014","20200608","Geen verstrekking in Open Data","35289","Ja",,,,,,,"4","4","0","0",,"445","177","M1",,,"r. schutbord","1970","ZE0",,"e11*2007/46*0230*10","A","A03","0","0.05","270","Nee","Nee",,"Nee","1970","0","0.00","2024","Geen oordeel","05","Ja","2025-06-08T00:00:00.000","2020-06-08T00:00:00.000","2016-10-14T00:00:00.000","2020-06-08T00:00:00.000",,,,,,,,,,,"155",,,,,,,,,,,,,,,,,"https://opendata.rdw.nl/resource/3huj-srit.json","https://opendata.rdw.nl/resource/8ys7-d773.json","https://opendata.rdw.nl/resource/vezc-m2t6.json","https://opendata.rdw.nl/resource/jhie-znh9.json","https://opendata.rdw.nl/resource/kmfi-hrps.json"
"H522SR","Personenauto","NISSAN","NISSAN LEAF 30KWH","20240610","20200612",,"MPV","5","GRIJS","Niet geregistreerd",,,"1445","1970","1545",,,"20160311","20200612","Geen verstrekking in Open Data","35845","Ja","144",,,,,,"4","4","0","0",,"445","177","M1",,,"r. schutbord","1970","ZE0",,"e11*2007/46*0230*10","A","A03","0","0.05","270","Nee","Nee",,"Nee","1970","0","0.00","2023","Geen oordeel","05","Ja","2024-06-10T00:00:00.000","2020-06-12T00:00:00.000","2016-03-11T00:00:00.000","2020-06-12T00:00:00.000",,,,,,,,,,,"155",,,,,,,,,,,,,,,,,"https://opendata.rdw.nl/resource/3huj-srit.json","https://opendata.rdw.nl/resource/8ys7-d773.json","https://opendata.rdw.nl/resource/vezc-m2t6.json","https://opendata.rdw.nl/resource/jhie-znh9.json","https://opendata.rdw.nl/resource/kmfi-hrps.json"
"H597JD","Personenauto","NISSAN","NISSAN LEAF 30KWH","20240715","20200714",,"MPV","5","ZWART","Niet geregistreerd",,,"1445","1970","1545",,,"20160531","20200714","Geen verstrekking in Open Data","29389","Ja","144",,,,,,"4","4","0","0",,"445","177","M1",,,,"1970","ZE0",,"e11*2007/46*0230*10","A","A03","0","0.05","270","Nee","Nee",,"Nee","1970","0","0.00","2022","Geen oordeel","05","Ja","2024-07-15T00:00:00.000","2020-07-14T00:00:00.000","2016-05-31T00:00:00.000","2020-07-14T00:00:00.000",,,,,,,,,,,"155",,,,,,,,,,,,,,,,,"https://opendata.rdw.nl/resource/3huj-srit.json","https://opendata.rdw.nl/resource/8ys7-d773.json","https://opendata.rdw.nl/resource/vezc-m2t6.json","https://opendata.rdw.nl/resource/jhie-znh9.json","https://opendata.rdw.nl/resource/kmfi-hrps.json"
"H618LR","Personenauto","NISSAN","NISSAN LEAF 30KWH","20241011","20200305",,"MPV","5","BRUIN","Niet geregistreerd",,,"1445","1970","1545",,,"20161011","20200305","Geen verstrekking in Open Data","38315","Ja","144",,,,,,"4","4","0","0",,"445","177","M1",,,"r. schutbord","1970","ZE0",,"e11*2007/46*0230*10","A","A03","0","0.05","270","Nee","Nee",,"Nee","1970","0","0.00","2023","Geen oordeel","05","Ja","2024-10-11T00:00:00.000","2020-03-05T00:00:00.000","2016-10-11T00:00:00.000","2020-03-05T00:00:00.000",,,,,,,,,,,"155",,,,,,,,,,,,,,,,,"https://opendata.rdw.nl/resource/3huj-srit.json","https://opendata.rdw.nl/resource/8ys7-d773.json","https://opendata.rdw.nl/resource/vezc-m2t6.json","https://opendata.rdw.nl/resource/jhie-znh9.json","https://opendata.rdw.nl/resource/kmfi-hrps.json"
"H710ND","Personenauto","NISSAN","NISSAN LEAF 30KWH","20241027","20211105",,"MPV","5","GRIJS","Niet geregistreerd",,,"1425","1970","1525",,,"20170321","20211105","Geen verstrekking in Open Data","35540","Ja",,,,,,,"4","4","0","0",,"445","177","M1",,,"r. schutbord","1970","ZE0",,"e11*2007/46*0230*11","A","A03","0","0.05","270","Nee","Nee",,"Nee","1970","0","0.00","2023","Geen oordeel","05","Ja","2024-10-27T00:00:00.000","2021-11-05T00:00:00.000","2017-03-21T00:00:00.000","2021-11-05T00:00:00.000",,,,,,,,,,,"155",,,,,,,,,,,,,,,,,"https://opendata.rdw.nl/resource/3huj-srit.json","https://opendata.rdw.nl/resource/8ys7-d773.json","https://opendata.rdw.nl/resource/vezc-m2t6.json","https://opendata.rdw.nl/resource/jhie-znh9.json","https://opendata.rdw.nl/resource/kmfi-hrps.json"
"H745KV","Personenauto","NISSAN","NISSAN LEAF 30KWH","20250331","20220104",,"MPV","5","WIT","Niet geregistreerd",,,"1470","1970","1570",,,"20160331","20200303","Geen verstrekking in Open Data","35244","Ja","144",,,,,,"4","4","0","0",,"445","177","M1",,,"r. schutbord","1970","ZE0",,"e11*2007/46*0230*10","A","A03","0","0.05","270","Nee","Nee",,"Nee","1970","0","0.00","2024","Geen oordeel","05","Ja","2025-03-31T00:00:00.000","2022-01-04T00:00:00.000","2016-03-31T00:00:00.000","2020-03-03T00:00:00.000",,,,,,,,,,,"155",,,,,,,,,,,,,,,,,"https://opendata.rdw.nl/resource/3huj-srit.json","https://opendata.rdw.nl/resource/8ys7-d773.json","https://opendata.rdw.nl/resource/vezc-m2t6.json","https://opendata.rdw.nl/resource/jhie-znh9.json","https://opendata.rdw.nl/resource/kmfi-hrps.json"
"H843PB","Personenauto","NISSAN","NISSAN LEAF 30KWH","20250224","20200701",,"MPV","5","GRIJS","Niet geregistreerd",,,"1445","1970","1545",,,"20160224","20200701","Geen verstrekking in Open Data","31745","Ja","144",,,,,,"4","4","0","0",,"445","177","M1",,,,"1970","ZE0",,"e11*2007/46*0230*10","A","A03","0","0.05","270","Nee","Nee",,"Nee","1970","0","0.00","2024","Geen oordeel","05","Ja","2025-02-24T00:00:00.000","2020-07-01T00:00:00.000","2016-02-24T00:00:00.000","2020-07-01T00:00:00.000",,,,,,,,,,,"155",,,,,,,,,,,,,,,,,"https://opendata.rdw.nl/resource/3huj-srit.json","https://opendata.rdw.nl/resource/8ys7-d773.json","https://opendata.rdw.nl/resource/vezc-m2t6.json","https://opendata.rdw.nl/resource/jhie-znh9.json","https://opendata.rdw.nl/resource/kmfi-hrps.json"
"H990JZ","Personenauto","NISSAN","NISSAN LEAF 30KWH","20240708","20240405",,"MPV","5","GRIJS","Niet geregistreerd",,,"1460","1970","1560",,,"20170331","20200710","Geen verstrekking in Open Data","38640","Ja","144",,,,,,"4","4","0","0",,"445","177","M1",,,,"1970","ZE0",,"e11*2007/46*0230*11","A","A03","0","0.05","270","Nee","Nee",,"Nee","1970","0","0.00","2024","Geen oordeel","05","Ja","2024-07-08T00:00:00.000","2024-04-05T00:00:00.000","2017-03-31T00:00:00.000","2020-07-10T00:00:00.000",,,,,,,,,,,"155",,,,,,,,,,,,,,,,,"https://opendata.rdw.nl/resource/3huj-srit.json","https://opendata.rdw.nl/resource/8ys7-d773.json","https://opendata.rdw.nl/resource/vezc-m2t6.json","https://opendata.rdw.nl/resource/jhie-znh9.json","https://opendata.rdw.nl/resource/kmfi-hrps.json"
"HZ109P","Personenauto","NISSAN","NISSAN LEAF 30KWH","20240719","20210722",,"MPV","5","WIT","Niet geregistreerd",,,"1445","1970","1545",,,"20160121","20160121","Geen verstrekking in Open Data","36475","Ja",,,,,,,"4","4","0","0",,"445","177","M1",,,"in motorruimte r.","1970","ZE0",,"e11*2007/46*0230*10","A","A03","0","0.05","270","Nee","Nee",,"Nee","1970","0","0.00","2023","Logisch","00","Ja","2024-07-19T00:00:00.000","2021-07-22T00:00:00.000","2016-01-21T00:00:00.000","2016-01-21T00:00:00.000",,,,,,,,,,,"155",,,,,,,,,,,,,,,,,"https://opendata.rdw.nl/resource/3huj-srit.json","https://opendata.rdw.nl/resource/8ys7-d773.json","https://opendata.rdw.nl/resource/vezc-m2t6.json","https://opendata.rdw.nl/resource/jhie-znh9.json","https://opendata.rdw.nl/resource/kmfi-hrps.json"
"HZ110P","Personenauto","NISSAN","NISSAN LEAF 30KWH","20240911","20230930",,"MPV","5","GRIJS","Niet geregistreerd",,,"1445","1970","1545",,,"20160225","20160225","Geen verstrekking in Open Data","38545","Ja",,,,,,,"4","4","0","0",,"445","177","M1",,,"in motorruimte r.","1970","ZE0",,"e11*2007/46*0230*10","A","A03","0","0.05","270","Nee","Nee",,"Nee","1970","0","0.00","2023","Logisch","00","Ja","2024-09-11T00:00:00.000","2023-09-30T00:00:00.000","2016-02-25T00:00:00.000","2016-02-25T00:00:00.000",,,,,,,,,,,"155",,,,,,,,,,,,,,,,,"https://opendata.rdw.nl/resource/3huj-srit.json","https://opendata.rdw.nl/resource/8ys7-d773.json","https://opendata.rdw.nl/resource/vezc-m2t6.json","https://opendata.rdw.nl/resource/jhie-znh9.json","https://opendata.rdw.nl/resource/kmfi-hrps.json"
"HZ114P","Personenauto","NISSAN","NISSAN LEAF 30KWH","20250201","20220523",,"MPV","5","WIT","Niet geregistreerd",,,"1445","1970","1545",,,"20160130","20160130","Geen verstrekking in Open Data","36475","Ja",,,,,,,"4","4","0","0",,"445","177","M1",,,"in motorruimte r.","1970","ZE0",,"e11*2007/46*0230*10","A","A03","0","0.05","270","Nee","Nee",,"Nee","1970","0","0.00","2024","Onlogisch","04","Ja","2025-02-01T00:00:00.000","2022-05-23T00:00:00.000","2016-01-30T00:00:00.000","2016-01-30T00:00:00.000",,,,,,,,,,,"155",,,,,,,,,,,,,,,,,"https://opendata.rdw.nl/resource/3huj-srit.json","https://opendata.rdw.nl/resource/8ys7-d773.json","https://opendata.rdw.nl/resource/vezc-m2t6.json","https://opendata.rdw.nl/resource/jhie-znh9.json","https://opendata.rdw.nl/resource/kmfi-hrps.json"
"HZ116P","Personenauto","NISSAN","NISSAN LEAF 30KWH","20250121","20170622",,"MPV","5","WIT","Niet geregistreerd",,,"1445","1970","1545",,,"20160121","20160121","Geen verstrekking in Open Data","36475","Ja",,,,,,,"4","4","0","0",,"445","177","M1",,,"in motorruimte r.","1970","ZE0",,"e11*2007/46*0230*10","A","A03","0","0.05","270","Nee","Nee",,"Nee","1970","0","0.00","2024","Logisch","00","Ja","2025-01-21T00:00:00.000","2017-06-22T00:00:00.000","2016-01-21T00:00:00.000","2016-01-21T00:00:00.000",,,,,,,,,,,"155",,,,,,,,,,,,,,,,,"https://opendata.rdw.nl/resource/3huj-srit.json","https://opendata.rdw.nl/resource/8ys7-d773.json","https://opendata.rdw.nl/resource/vezc-m2t6.json","https://opendata.rdw.nl/resource/jhie-znh9.json","https://opendata.rdw.nl/resource/kmfi-hrps.json"
"HZ117P","Personenauto","NISSAN","NISSAN LEAF 30KWH","20240630","20240108",,"MPV","5","WIT","Niet geregistreerd",,,"1445","1970","1545",,,"20160120","20160120","Geen verstrekking in Open Data","36475","Ja",,,,,,,"4","4","0","0",,"445","177","M1",,,"in motorruimte r.","1970","ZE0",,"e11*2007/46*0230*10","A","A03","0","0.05","270","Nee","Nee",,"Nee","1970","0","0.00","2024","Logisch","00","Ja","2024-06-30T00:00:00.000","2024-01-08T00:00:00.000","2016-01-20T00:00:00.000","2016-01-20T00:00:00.000",,,,,,,,,,,"155",,,,,,,,,,,,,,,,,"https://opendata.rdw.nl/resource/3huj-srit.json","https://opendata.rdw.nl/resource/8ys7-d773.json","https://opendata.rdw.nl/resource/vezc-m2t6.json","https://opendata.rdw.nl/resource/jhie-znh9.json","https://opendata.rdw.nl/resource/kmfi-hrps.json"
"HZ118P","Personenauto","NISSAN","NISSAN LEAF 30KWH","20250311","20210315",,"MPV","5","GRIJS","Niet geregistreerd",,,"1445","1970","1545",,,"20160122","20160122","Geen verstrekking in Open Data","36475","Ja",,,,,,,"4","4","0","0",,"445","177","M1",,,"in motorruimte r.","1970","ZE0",,"e11*2007/46*0230*10","A","A03","0","0.05","270","Nee","Nee",,"Nee","1970","0","0.00","2024","Logisch","00","Ja","2025-03-11T00:00:00.000","2021-03-15T00:00:00.000","2016-01-22T00:00:00.000","2016-01-22T00:00:00.000",,,,,,,,,,,"155",,,,,,,,,,,,,,,,,"https://opendata.rdw.nl/resource/3huj-srit.json","https://opendata.rdw.nl/resource/8ys7-d773.json","https://opendata.rdw.nl/resource/vezc-m2t6.json","https://opendata.rdw.nl/resource/jhie-znh9.json","https://opendata.rdw.nl/resource/kmfi-hrps.json"
"HZ119P","Personenauto","NISSAN","NISSAN LEAF 30KWH","20250120","20160610",,"MPV","5","GRIJS","Niet geregistreerd",,,"1445","1970","1545",,,"20160120","20160120","Geen verstrekking in Open Data","38545","Ja",,,,,,,"4","4","0","0",,"445","177","M1",,,"in motorruimte r.","1970","ZE0",,"e11*2007/46*0230*10","A","A03","0","0.05","270","Nee","Nee",,"Nee","1970","0","0.00","2024","Logisch","00","Ja","2025-01-20T00:00:00.000","2016-06-10T00:00:00.000","2016-01-20T00:00:00.000","2016-01-20T00:00:00.000",,,,,,,,,,,"155",,,,,,,,,,,,,,,,,"https://opendata.rdw.nl/resource/3huj-srit.json","https://opendata.rdw.nl/resource/8ys7-d773.json","https://opendata.rdw.nl/resource/vezc-m2t6.json","https://opendata.rdw.nl/resource/jhie-znh9.json","https://opendata.rdw.nl/resource/kmfi-hrps.json"
"HZ121P","Personenauto","NISSAN","NISSAN LEAF 30KWH","20250125","20220817",,"MPV","5","WIT","Niet geregistreerd",,,"1445","1970","1545",,,"20160125","20160125","Geen verstrekking in Open Data","36475","Ja",,,,,,,"4","4","0","0",,"445","177","M1",,,"in motorruimte r.","1970","ZE0",,"e11*2007/46*0230*10","A","A03","0","0.05","270","Nee","Nee",,"Nee","1970","0","0.00","2024","Logisch","00","Ja","2025-01-25T00:00:00.000","2022-08-17T00:00:00.000","2016-01-25T00:00:00.000","2016-01-25T00:00:00.000",,,,,,,,,,,"155",,,,,,,,,,,,,,,,,"https://opendata.rdw.nl/resource/3huj-srit.json","https://opendata.rdw.nl/resource/8ys7-d773.json","https://opendata.rdw.nl/resource/vezc-m2t6.json","https://opendata.rdw.nl/resource/jhie-znh9.json","https://opendata.rdw.nl/resource/kmfi-hrps.json"
"HZ123P","Personenauto","NISSAN","NISSAN LEAF 30KWH","20241201","20240410",,"MPV","5","GRIJS","Niet geregistreerd",,,"1445","1970","1545",,,"20160122","20160122","Geen verstrekking in Open Data","38545","Nee",,,,,,,"4","4","0","0",,"445","177","M1",,,"in motorruimte r.","1970","ZE0",,"e11*2007/46*0230*10","A","A03","0","0.05","270","Nee","Nee",,"Nee","1970","0","0.00","2024","Logisch","00","Ja","2024-12-01T00:00:00.000","2024-04-10T00:00:00.000","2016-01-22T00:00:00.000","2016-01-22T00:00:00.000",,,,,,,,,,,"155",,,,,,,,,,,,,,,,,"https://opendata.rdw.nl/resource/3huj-srit.json","https://opendata.rdw.nl/resource/8ys7-d773.json","https://opendata.rdw.nl/resource/vezc-m2t6.json","https://opendata.rdw.nl/resource/jhie-znh9.json","https://opendata.rdw.nl/resource/kmfi-hrps.json"
"HZ126P","Personenauto","NISSAN","NISSAN LEAF 30KWH","20250119","20190321",,"MPV","5","ZWART","Niet geregistreerd",,,"1445","1970","1545",,,"20160119","20160119","Geen verstrekking in Open Data","38545","Ja",,,,,,,"4","4","0","0",,"445","177","M1",,,"in motorruimte r.","1970","ZE0",,"e11*2007/46*0230*10","A","A03","0","0.05","270","Nee","Nee",,"Nee","1970","0","0.00","2024","Logisch","00","Ja","2025-01-19T00:00:00.000","2019-03-21T00:00:00.000","2016-01-19T00:00:00.000","2016-01-19T00:00:00.000",,,,,,,,,,,"155",,,,,,,,,,,,,,,,,"https://opendata.rdw.nl/resource/3huj-srit.json","https://opendata.rdw.nl/resource/8ys7-d773.json","https://opendata.rdw.nl/resource/vezc-m2t6.json","https://opendata.rdw.nl/resource/jhie-znh9.json","https://opendata.rdw.nl/resource/kmfi-hrps.json"
"HZ127P","Personenauto","NISSAN","NISSAN LEAF 30KWH","20250127","20190326",,"MPV","5","GRIJS","Niet geregistreerd",,,"1445","1970","1545",,,"20160127","20160127","Geen verstrekking in Open Data","38245","Ja",,,,,,,"4","4","0","0",,"445","177","M1",,,"in motorruimte r.","1970","ZE0",,"e11*2007/46*0230*10","A","A03","0","0.05","270","Nee","Nee",,"Nee","1970","0","0.00","2024","Logisch","00","Ja","2025-01-27T00:00:00.000","2019-03-26T00:00:00.000","2016-01-27T00:00:00.000","2016-01-27T00:00:00.000",,,,,,,,,,,"155",,,,,,,,,,,,,,,,,"https://opendata.rdw.nl/resource/3huj-srit.json","https://opendata.rdw.nl/resource/8ys7-d773.json","https://opendata.rdw.nl/resource/vezc-m2t6.json","https://opendata.rdw.nl/resource/jhie-znh9.json","https://opendata.rdw.nl/resource/kmfi-hrps.json"
"HZ175N","Personenauto","NISSAN","NISSAN LEAF 30KWH","20250201","20220309",,"MPV","5","GRIJS","Niet geregistreerd",,,"1445","1970","1545",,,"20160119","20160119","Geen verstrekking in Open Data","36475","Ja",,,,,,,"4","4","0","0",,"445","177","M1",,,"in motorruimte r.","1970","ZE0",,"e11*2007/46*0230*10","A","A03","0","0.05","270","Nee","Nee",,"Nee","1970","0","0.00","2024","Logisch","00","Nee","2025-02-01T00:00:00.000","2022-03-09T00:00:00.000","2016-01-19T00:00:00.000","2016-01-19T00:00:00.000",,,,,,,,,,,"155",,,,,,,,,,,,,,,,,"https://opendata.rdw.nl/resource/3huj-srit.json","https://opendata.rdw.nl/resource/8ys7-d773.json","https://opendata.rdw.nl/resource/vezc-m2t6.json","https://opendata.rdw.nl/resource/jhie-znh9.json","https://opendata.rdw.nl/resource/kmfi-hrps.json"