"kenteken","voertuigsoort","merk","handelsbenaming","vervaldatum_apk","datum_tenaamstelling","bruto_bpm","inrichting","aantal_zitplaatsen","eerste_kleur","tweede_kleur","aantal_cilinders","cilinderinhoud","massa_ledig_voertuig","toegestane_maximum_massa_voertuig","massa_rijklaar","maximum_massa_trekken_ongeremd","maximum_trekken_massa_geremd","datum_eerste_toelating","datum_eerste_tenaamstelling_in_nederland","wacht_op_keuren","catalogusprijs","wam_verzekerd","maximale_constructiesnelheid","laadvermogen","oplegger_geremd","aanhangwagen_autonoom_geremd","aanhangwagen_middenas_geremd","aantal_staanplaatsen","aantal_deuren","aantal_wielen","afstand_hart_koppeling_tot_achterzijde_voertuig","afstand_voorzijde_voertuig_tot_hart_koppeling","afwijkende_maximum_snelheid","lengte","breedte","europese_voertuigcategorie","europese_voertuigcategorie_toevoeging","europese_uitvoeringcategorie_toevoeging","plaats_chassisnummer","technische_max_massa_voertuig","type","type_gasinstallatie","typegoedkeuringsnummer","variant","uitvoering","volgnummer_wijziging_eu_typegoedkeuring","vermogen_massarijklaar","wielbasis","export_indicator","openstaande_terugroepactie_indicator","vervaldatum_tachograaf","taxi_indicator","maximum_massa_samenstelling","aantal_rolstoelplaatsen","maximum_ondersteunende_snelheid","jaar_laatste_registratie_tellerstand","tellerstandoordeel","code_toelichting_tellerstandoordeel","tenaamstellen_mogelijk","vervaldatum_apk_dt","datum_tenaamstelling_dt","datum_eerste_toelating_dt","datum_eerste_tenaamstelling_in_nederland_dt","vervaldatum_tachograaf_dt","maximum_last_onder_de_vooras_sen_tezamen_koppeling","type_remsysteem_voertuig_code","rupsonderstelconfiguratiecode","wielbasis_voertuig_minimum","wielbasis_voertuig_maximum","lengte_voertuig_minimum","lengte_voertuig_maximum","breedte_voertuig_minimum","breedte_voertuig_maximum","hoogte_voertuig","hoogte_voertuig_minimum","hoogte_voertuig_maximum","massa_bedrijfsklaar_minimaal","massa_bedrijfsklaar_maximaal","technisch_toelaatbaar_massa_koppelpunt","maximum_massa_technisch_maximaal","maximum_massa_technisch_minimaal","subcategorie_nederland","verticale_belasting_koppelpunt_getrokken_voertuig","zuinigheidsclassificatie","registratie_datum_goedkeuring_afschrijvingsmoment_bpm","registratie_datum_goedkeuring_afschrijvingsmoment_bpm_dt","gem_lading_wrde","aerodyn_voorz","massa_alt_aandr","verl_cab_ind","api_gekentekende_voertuigen_assen","api_gekentekende_voertuigen_brandstof","api_gekentekende_voertuigen_carrosserie","api_gekentekende_voertuigen_carrosserie_specifiek","api_gekentekende_voertuigen_voertuigklasse"
"3VBK80","Bedrijfsauto","MITSUBISHI","CANTER 3C13","20250516","20090424","9846","afneembare bovenbouw","3","N.v.t.","N.v.t.","4","2977","2290","3500","2390","750",,"20090423","20090423","Geen verstrekking in Open Data",,"Ja",,"1210",,"3500","3500",,"0","4","0","0",,"0","216","N1",,,"r. balk by vooras","3500","F",,"nl*2001/116*0053*07","FB83BVI","E4SL2","0","0.04","335","Nee","Nee",,"Nee","7000","0",,"2024","Logisch","00","Ja","2025-05-16T00:00:00.000","2009-04-24T00:00:00.000","2009-04-23T00:00:00.000","2009-04-23T00:00:00.000",,"0",,,,,,,,,,,,,,,,,,,,,,,,,,"https://opendata.rdw.nl/resource/3huj-srit.json","https://opendata.rdw.nl/resource/8ys7-d773.json","https://opendata.rdw.nl/resource/vezc-m2t6.json","https://opendata.rdw.nl/resource/jhie-znh9.json","https://opendata.rdw.nl/resource/kmfi-hrps.json"
"49VJLD","Bedrijfsauto","MITSUBISHI","L300-2.5D","20241010",,,"afneembare bovenbouw",,"N.v.t.","N.v.t.","4",,"1680","2700","1780",,,"19990820","19990820","Geen verstrekking in Open Data",,"Ja",,"1020",,,,,,"4",,,,,"182","N1",,,"tegen r. balk v. vooras","2700",,,,,,,"0.04","244","Nee","Nee",,"Nee",,,,"2023","Logisch","00","Ja","2024-10-10T00:00:00.000",,"1999-08-20T00:00:00.000","1999-08-20T00:00:00.000",,"0",,,,,,,,,,,,,,,,,,,,,,,,,,"https://opendata.rdw.nl/resource/3huj-srit.json","https://opendata.rdw.nl/resource/8ys7-d773.json","https://opendata.rdw.nl/resource/vezc-m2t6.json","https://opendata.rdw.nl/resource/jhie-znh9.json","https://opendata.rdw.nl/resource/kmfi-hrps.json"
"84BZXD","Bedrijfsauto","MITSUBISHI","FE84P","20241127","20060918","13341","afneembare bovenbouw","3","N.v.t.","N.v.t.","4","3908","3080","3500","3180",,,"20060918","20060918","Geen verstrekking in Open Data",,"Ja",,"420",,"3500","3500",,,"4",,,,,"206","N1",,,"tegen r. balk t.p.v. vooras","3500",,,,,,,"0.03","335","Nee","Nee",,"Nee","7000",,,"2023","Logisch","00","Ja","2024-11-27T00:00:00.000","2006-09-18T00:00:00.000","2006-09-18T00:00:00.000","2006-09-18T00:00:00.000",,"0",,,,,,,,,,,,,,,,,,,,,,,,,,"https://opendata.rdw.nl/resource/3huj-srit.json","https://opendata.rdw.nl/resource/8ys7-d773.json","https://opendata.rdw.nl/resource/vezc-m2t6.json","https://opendata.rdw.nl/resource/jhie-znh9.json","https://opendata.rdw.nl/resource/kmfi-hrps.json"
"94VXZJ","Bedrijfsauto","MITSUBISHI","FB631","20250217","20230118",,"afneembare bovenbouw",,"N.v.t.","N.v.t.","4",,"2410","3500","2510","750",,"20010904","20010904","Geen verstrekking in Open Data",,"Ja",,"1090",,"3000","3000",,,"4",,,,,"205","N1",,,"tegen r. balk tussen vooras en 2e veerh.","3500",,,,,,,"0.03","335","Nee","Nee","20031003","Nee",,,,"2024","Logisch","00","Ja","2025-02-17T00:00:00.000","2023-01-18T00:00:00.000","2001-09-04T00:00:00.000","2001-09-04T00:00:00.000","2003-10-03T00:00:00.000","0",,,,,,,,,,,,,,,,,,,,,,,,,,"https://opendata.rdw.nl/resource/3huj-srit.json","https://opendata.rdw.nl/resource/8ys7-d773.json","https://opendata.rdw.nl/resource/vezc-m2t6.json","https://opendata.rdw.nl/resource/jhie-znh9.json","https://opendata.rdw.nl/resource/kmfi-hrps.json"
"BBJL69","Bedrijfsauto","MITSUBISHI","FE 444FXSL","19950725","19940809",,"afneembare bovenbouw",,"N.v.t.","N.v.t.","4",,"2360","6000","2460",,,"19940725","19940725","Geen verstrekking in Open Data",,"Nee",,"3640",,,,,,"4",,,,,"200","N2",,,"tegen r. balk tussen vooras en 2e veerh.","6000",,,,,,,"0.03","376","Nee","Nee","20000903","Nee",,,,,"Niet geregistreerd","NG","Ja","1995-07-25T00:00:00.000","1994-08-09T00:00:00.000","1994-07-25T00:00:00.000","1994-07-25T00:00:00.000","2000-09-03T00:00:00.000","0",,,,,,,,,,,,,,,,,,,,,,,,,,"https://opendata.rdw.nl/resource/3huj-srit.json","https://opendata.rdw.nl/resource/8ys7-d773.json","https://opendata.rdw.nl/resource/vezc-m2t6.json","https://opendata.rdw.nl/resource/jhie-znh9.json","https://opendata.rdw.nl/resource/kmfi-hrps.json"
"BVBB29","Bedrijfsauto","MITSUBISHI","CANTER 6C15","20240506","20230620",,"afneembare bovenbouw","3","N.v.t.","N.v.t.","4","2977","3450","6500","3570","750",,"20080506","20080506","Geen verstrekking in Open Data",,"Ja",,"3050",,"3500","3500",,"0","4","0","555",,"565","210","N2",,,"tegen r. balk t.p.v. vooras","6500",,,"nl*2001/116*0054*04","FE84BV","E6SL4","0","0.03","335","Nee","Nee","20250310","Nee","10000","0",,,"Niet geregistreerd","NG","Ja","2024-05-06T00:00:00.000","2023-06-20T00:00:00.000","2008-05-06T00:00:00.000","2008-05-06T00:00:00.000","2025-03-10T00:00:00.000","0",,,,,,,,,,,,,,,,,,,,,,,,,,"https://opendata.rdw.nl/resource/3huj-srit.json","https://opendata.rdw.nl/resource/8ys7-d773.json","https://opendata.rdw.nl/resource/vezc-m2t6.json","https://opendata.rdw.nl/resource/jhie-znh9.json","https://opendata.rdw.nl/resource/kmfi-hrps.json"
"BXRF09","Bedrijfsauto","MITSUBISHI","CANTER 7C18","20250322","20100709",,"afneembare bovenbouw","3","N.v.t.","N.v.t.","4","4899","3530","7490","3630","750",,"20100708","20100708","Geen verstrekking in Open Data",,"Ja",,"3960",,"3500","3500",,,"4",,"552",,"562","205","N2",,,"tegen r. balk t.p.v. vooras","7490",,,,,,,"0.04","335","Nee","Nee","20250228","Nee","10990",,,,"Niet geregistreerd","NG","Ja","2025-03-22T00:00:00.000","2010-07-09T00:00:00.000","2010-07-08T00:00:00.000","2010-07-08T00:00:00.000","2025-02-28T00:00:00.000","0",,,,,,,,,,,,,,,,,,,,,,,,,,"https://opendata.rdw.nl/resource/3huj-srit.json","https://opendata.rdw.nl/resource/8ys7-d773.json","https://opendata.rdw.nl/resource/vezc-m2t6.json","https://opendata.rdw.nl/resource/jhie-znh9.json","https://opendata.rdw.nl/resource/kmfi-hrps.json"
"BZDD64","Bedrijfsauto","MITSUBISHI","CANTER 7C15","20250410","20230607",,"afneembare bovenbouw","3","N.v.t.","N.v.t.","4","2977","3450","7490","3550",,,"20110323","20110323","Geen verstrekking in Open Data",,"Ja",,"4040",,,,,,"4",,,,"559","208","N2",,,"tegen r. balk t.p.v. vooras","7490",,,,,,,"0.03","335","Nee","Nee","20250124","Nee","10990",,,,"Niet geregistreerd","NG","Ja","2025-04-10T00:00:00.000","2023-06-07T00:00:00.000","2011-03-23T00:00:00.000","2011-03-23T00:00:00.000","2025-01-24T00:00:00.000","0",,,,,,,,,,,,,,,,,,,,,,,,,,"https://opendata.rdw.nl/resource/3huj-srit.json","https://opendata.rdw.nl/resource/8ys7-d773.json","https://opendata.rdw.nl/resource/vezc-m2t6.json","https://opendata.rdw.nl/resource/jhie-znh9.json","https://opendata.rdw.nl/resource/kmfi-hrps.json"
"V110FJ","Bedrijfsauto","MITSUBISHI","MITSUBISHI L200","20240727","20170313","13371","afneembare bovenbouw","5","N.v.t.","N.v.t.","4","2442","1965","2910","2065","750",,"20160727","20170313","Geen verstrekking in Open Data","55412","Ja",,"945",,,"3100",,,"4",,,,,"182","N1",,,"r. balk by achteras","2910","KJ0T",,,,,,"0.06","300","Nee","Nee",,"Nee","50000",,,"2023","Geen oordeel","05","Ja","2024-07-27T00:00:00.000","2017-03-13T00:00:00.000","2016-07-27T00:00:00.000","2017-03-13T00:00:00.000",,"0",,,,,,,,,,,,,,,,,,,,,,,,,,"https://opendata.rdw.nl/resource/3huj-srit.json","https://opendata.rdw.nl/resource/8ys7-d773.json","https://opendata.rdw.nl/resource/vezc-m2t6.json","https://opendata.rdw.nl/resource/jhie-znh9.json","https://opendata.rdw.nl/resource/kmfi-hrps.json"
"VD097L","Bedrijfsauto","MITSUBISHI","MITSUBISHI L200","20250113","20210120","9394","afneembare bovenbouw","5","N.v.t.","N.v.t.","4","2477","2030","2850","2130","750",,"20121213","20130501","Geen verstrekking in Open Data","38668","Ja",,"820",,,"2700",,,"4",,,,,"182","N1",,,"r. balk a.","2850","KA0T",,,,,,"0.06","300","Nee","Nee",,"Nee","5500",,,"2023","Geen oordeel","05","Ja","2025-01-13T00:00:00.000","2021-01-20T00:00:00.000","2012-12-13T00:00:00.000","2013-05-01T00:00:00.000",,"0",,,,,,,,,,,,,,,,,,,,,,,,,,"https://opendata.rdw.nl/resource/3huj-srit.json","https://opendata.rdw.nl/resource/8ys7-d773.json","https://opendata.rdw.nl/resource/vezc-m2t6.json","https://opendata.rdw.nl/resource/jhie-znh9.json","https://opendata.rdw.nl/resource/kmfi-hrps.json"
"VD22TV","Bedrijfsauto","MITSUBISHI","L 032 PYZL 6","20250823","20200905",,"afneembare bovenbouw",,"N.v.t.","N.v.t.","4",,"1000","2205","1100",,,"19881117","19881117","Geen verstrekking in Open Data",,"Ja",,"1205",,,,,,"4",,,,,"180","N1",,,"tegen r. balk 025 cm a. achteras","2205",,,,,,,"0.05","220","Nee","Nee",,"Nee",,,,"2023","Logisch","00","Ja","2025-08-23T00:00:00.000","2020-09-05T00:00:00.000","1988-11-17T00:00:00.000","1988-11-17T00:00:00.000",,"0",,,,,,,,,,,,,,,,,,,,,,,,,,"https://opendata.rdw.nl/resource/3huj-srit.json","https://opendata.rdw.nl/resource/8ys7-d773.json","https://opendata.rdw.nl/resource/vezc-m2t6.json","https://opendata.rdw.nl/resource/jhie-znh9.json","https://opendata.rdw.nl/resource/kmfi-hrps.json"
"VH09DR","Bedrijfsauto","MITSUBISHI","FE 444EXL","20180729","19900322",,"afneembare bovenbouw",,"N.v.t.","N.v.t.","4",,"2682","3500","2782",,,"19900202","19900202","Geen verstrekking in Open Data",,"Ja",,"818",,,,,,"4",,"645",,,"189","N1",,,"tegen r. balk tussen 3e veerh. en achteras","3500",,,,,,,"0.03","435","Nee","Nee",,"Nee",,,,"2017","Logisch","00","Ja","2018-07-29T00:00:00.000","1990-03-22T00:00:00.000","1990-02-02T00:00:00.000","1990-02-02T00:00:00.000",,"0",,,,,,,,,,,,,,,,,,,,,,,,,,"https://opendata.rdw.nl/resource/3huj-srit.json","https://opendata.rdw.nl/resource/8ys7-d773.json","https://opendata.rdw.nl/resource/vezc-m2t6.json","https://opendata.rdw.nl/resource/jhie-znh9.json","https://opendata.rdw.nl/resource/kmfi-hrps.json"
"VS765S","Bedrijfsauto","MITSUBISHI","MITSUBISHI L200","20240530","20200403","11714","afneembare bovenbouw","5","N.v.t.","N.v.t.","4","2477","2032","2850","2132","750",,"20150520","20151229","Geen verstrekking in Open Data","48437","Ja",,"818",,,"3000",,,"4",,,,,"182","N1",,,"r. balk a.","2850","KA0T",,,,,,"0.06","300","Nee","Nee",,"Nee","5700",,,"2023","Geen oordeel","05","Ja","2024-05-30T00:00:00.000","2020-04-03T00:00:00.000","2015-05-20T00:00:00.000","2015-12-29T00:00:00.000",,"0",,,,,,,,,,,,,,,,,,,,,,,,,,"https://opendata.rdw.nl/resource/3huj-srit.json","https://opendata.rdw.nl/resource/8ys7-d773.json","https://opendata.rdw.nl/resource/vezc-m2t6.json","https://opendata.rdw.nl/resource/jhie-znh9.json","https://opendata.rdw.nl/resource/kmfi-hrps.json"
"VS837P","Bedrijfsauto","MITSUBISHI","MITSUBISHI L200","20240713","20220310","10996","afneembare bovenbouw","5","N.v.t.","N.v.t.","4","2477","2020","2850","2120","750",,"20150713","20151229","Geen verstrekking in Open Data","45414","Ja",,"830",,,"3000",,,"4",,,,,"182","N1",,,"r. balk a.","2850","KA0T",,,,,,"0.06","300","Nee","Nee",,"Nee","5700",,,"2023","Geen oordeel","05","Ja","2024-07-13T00:00:00.000","2022-03-10T00:00:00.000","2015-07-13T00:00:00.000","2015-12-29T00:00:00.000",,"0",,,,,,,,,,,,,,,,,,,,,,,,,,"https://opendata.rdw.nl/resource/3huj-srit.json","https://opendata.rdw.nl/resource/8ys7-d773.json","https://opendata.rdw.nl/resource/vezc-m2t6.json","https://opendata.rdw.nl/resource/jhie-znh9.json","https://opendata.rdw.nl/resource/kmfi-hrps.json"
"VV056V","Bedrijfsauto","MITSUBISHI","MITSUBISHI L200","20241219","20160517","12766","afneembare bovenbouw","5","N.v.t.","N.v.t.","4","2442","1980","2910","2080","750",,"20151119","20160517","Geen verstrekking in Open Data","52592","Ja",,"930",,,"3100",,,"4",,,,,"182","N1",,,"r. balk by achteras","2910","KJ0T",,,,,,"0.06","300","Nee","Nee",,"Nee","5950",,,"2023","Geen oordeel","05","Ja","2024-12-19T00:00:00.000","2016-05-17T00:00:00.000","2015-11-19T00:00:00.000","2016-05-17T00:00:00.000",,"0",,,,,,,,,,,,,,,,,,,,,,,,,,"https://opendata.rdw.nl/resource/3huj-srit.json","https://opendata.rdw.nl/resource/8ys7-d773.json","https://opendata.rdw.nl/resource/vezc-m2t6.json","https://opendata.rdw.nl/resource/jhie-znh9.json","https://opendata.rdw.nl/resource/kmfi-hrps.json"
"VV113D","Bedrijfsauto","MITSUBISHI","MITSUBISHI L200","20250221","20160412","12766","afneembare bovenbouw","5","N.v.t.","N.v.t.","4","2442","1979","2910","2079","750",,"20150903","20160329","Geen verstrekking in Open Data","52865","Ja",,"931",,"3100","3100",,,"4",,,,,"182","N1",,,"r. balk by achteras","2910","KJ0T",,,,,,"0.06","300","Nee","Nee",,"Nee",,,,"2023","Geen oordeel","05","Ja","2025-02-21T00:00:00.000","2016-04-12T00:00:00.000","2015-09-03T00:00:00.000","2016-03-29T00:00:00.000",,"0",,,,,,,,,,,,,,,,,,,,,,,,,,"https://opendata.rdw.nl/resource/3huj-srit.json","https://opendata.rdw.nl/resource/8ys7-d773.json","https://opendata.rdw.nl/resource/vezc-m2t6.json","https://opendata.rdw.nl/resource/jhie-znh9.json","https://opendata.rdw.nl/resource/kmfi-hrps.json"
"VV295V","Bedrijfsauto","MITSUBISHI","MITSUBISHI L200","20240608","20160608","14459","afneembare bovenbouw","5","N.v.t.","N.v.t.","4","2442","2000","2910","2100","750",,"20160608","20160608","Geen verstrekking in Open Data","59991","Ja",,"910",,,"3100",,,"4",,,,,"182","N1",,,"r. balk by achteras","2910","KJ0T",,,,,,"0.06","300","Nee","Nee",,"Nee","5950",,,"2023","Logisch","00","Ja","2024-06-08T00:00:00.000","2016-06-08T00:00:00.000","2016-06-08T00:00:00.000","2016-06-08T00:00:00.000",,"0",,,,,,,,,,,,,,,,,,,,,,,,,,"https://opendata.rdw.nl/resource/3huj-srit.json","https://opendata.rdw.nl/resource/8ys7-d773.json","https://opendata.rdw.nl/resource/vezc-m2t6.json","https://opendata.rdw.nl/resource/jhie-znh9.json","https://opendata.rdw.nl/resource/kmfi-hrps.json"
