"kenteken","voertuigsoort","merk","handelsbenaming","vervaldatum_apk","datum_tenaamstelling","bruto_bpm","inrichting","aantal_zitplaatsen","eerste_kleur","tweede_kleur","aantal_cilinders","cilinderinhoud","massa_ledig_voertuig","toegestane_maximum_massa_voertuig","massa_rijklaar","maximum_massa_trekken_ongeremd","maximum_trekken_massa_geremd","datum_eerste_toelating","datum_eerste_tenaamstelling_in_nederland","wacht_op_keuren","catalogusprijs","wam_verzekerd","maximale_constructiesnelheid","laadvermogen","oplegger_geremd","aanhangwagen_autonoom_geremd","aanhangwagen_middenas_geremd","aantal_staanplaatsen","aantal_deuren","aantal_wielen","afstand_hart_koppeling_tot_achterzijde_voertuig","afstand_voorzijde_voertuig_tot_hart_koppeling","afwijkende_maximum_snelheid","lengte","breedte","europese_voertuigcategorie","europese_voertuigcategorie_toevoeging","europese_uitvoeringcategorie_toevoeging","plaats_chassisnummer","technische_max_massa_voertuig","type","type_gasinstallatie","typegoedkeuringsnummer","variant","uitvoering","volgnummer_wijziging_eu_typegoedkeuring","vermogen_massarijklaar","wielbasis","export_indicator","openstaande_terugroepactie_indicator","vervaldatum_tachograaf","taxi_indicator","maximum_massa_samenstelling","aantal_rolstoelplaatsen","maximum_ondersteunende_snelheid","jaar_laatste_registratie_tellerstand","tellerstandoordeel","code_toelichting_tellerstandoordeel","tenaamstellen_mogelijk","vervaldatum_apk_dt","datum_tenaamstelling_dt","datum_eerste_toelating_dt","datum_eerste_tenaamstelling_in_nederland_dt","vervaldatum_tachograaf_dt","maximum_last_onder_de_vooras_sen_tezamen_koppeling","type_remsysteem_voertuig_code","rupsonderstelconfiguratiecode","wielbasis_voertuig_minimum","wielbasis_voertuig_maximum","lengte_voertuig_minimum","lengte_voertuig_maximum","breedte_voertuig_minimum","breedte_voertuig_maximum","hoogte_voertuig","hoogte_voertuig_minimum","hoogte_voertuig_maximum","massa_bedrijfsklaar_minimaal","massa_bedrijfsklaar_maximaal","technisch_toelaatbaar_massa_koppelpunt","maximum_massa_technisch_maximaal","maximum_massa_technisch_minimaal","subcategorie_nederland","verticale_belasting_koppelpunt_getrokken_voertuig","zuinigheidsclassificatie","registratie_datum_goedkeuring_afschrijvingsmoment_bpm","registratie_datum_goedkeuring_afschrijvingsmoment_bpm_dt","gem_lading_wrde","aerodyn_voorz","massa_alt_aandr","verl_cab_ind","api_gekentekende_voertuigen_assen","api_gekentekende_voertuigen_brandstof","api_gekentekende_voertuigen_carrosserie","api_gekentekende_voertuigen_carrosserie_specifiek","api_gekentekende_voertuigen_voertuigklasse"
"18XDN4","Personenauto","MINI","ONE D CLUBMAN","20240802","20120530","3228","stationwagen","4","ZWART","Niet geregistreerd","4","1598","1160","1685","1260",,,"20110401","20120530","Geen verstrekking in Open Data","27735","Ja",,,,,,,"3","4","0","0",,"396","0","M1",,,"r. motorruimte","1685","UKL-K",,"e1*2007/46*0370*02","ZH11","5J","0","0.05","255","Nee","Nee",,"Nee","0","0","0.00","2023","Geen oordeel","05","Ja","2024-08-02T00:00:00.000","2012-05-30T00:00:00.000","2011-04-01T00:00:00.000","2012-05-30T00:00:00.000",,,,,,,,,,,,,,,,,,,,,"B",,,,,,,"https://opendata.rdw.nl/resource/3huj-srit.json","https://opendata.rdw.nl/resource/8ys7-d773.json","https://opendata.rdw.nl/resource/vezc-m2t6.json","https://opendata.rdw.nl/resource/jhie-znh9.json","https://opendata.rdw.nl/resource/kmfi-hrps.json"
"1KDD75","Personenauto","MINI","ONE D CLUBMAN","20250225","20201230","3727","stationwagen","4","ZWART","Niet geregistreerd","4","1598","1160","1685","1260",,,"20130321","20130321","Geen verstrekking in Open Data","25469","Ja",,,,,,,"3","4","0","0",,"396","0","M1",,,"r. motorruimte","1685","UKL-K",,"e1*2007/46*0370*10","ZH11","5H0C0","0","0.05","255","Nee","Nee",,"Nee","0","0",,"2024","Logisch","00","Ja","2025-02-25T00:00:00.000","2020-12-30T00:00:00.000","2013-03-21T00:00:00.000","2013-03-21T00:00:00.000",,,,,,,,,,,,,,,,,,,,,"C",,,,,,,"https://opendata.rdw.nl/resource/3huj-srit.json","https://opendata.rdw.nl/resource/8ys7-d773.json","https://opendata.rdw.nl/resource/vezc-m2t6.json","https://opendata.rdw.nl/resource/jhie-znh9.json","https://opendata.rdw.nl/resource/kmfi-hrps.json"
"1KTT87","Personenauto","MINI","ONE D CLUBMAN","20241018","20230707","3727","stationwagen","4","BLAUW","Niet geregistreerd","4","1598","1160","1685","1260",,,"20130718","20130718","Geen verstrekking in Open Data","25794","Ja",,,,,,,"3","4","0","0",,"396","0","M1",,,"r. motorruimte","1685","UKL-K",,"e1*2007/46*0370*10","ZH11","5H0C0","0","0.05","255","Nee","Nee",,"Nee","0","0",,"2023","Logisch","00","Ja","2024-10-18T00:00:00.000","2023-07-07T00:00:00.000","2013-07-18T00:00:00.000","2013-07-18T00:00:00.000",,,,,,,,,,,,,,,,,,,,,"C",,,,,,,"https://opendata.rdw.nl/resource/3huj-srit.json","https://opendata.rdw.nl/resource/8ys7-d773.json","https://opendata.rdw.nl/resource/vezc-m2t6.json","https://opendata.rdw.nl/resource/jhie-znh9.json","https://opendata.rdw.nl/resource/kmfi-hrps.json"
"1TTS50","Personenauto","MINI","ONE D CLUBMAN","20250208","20200201","3727","stationwagen","4","ZWART","Niet geregistreerd","4","1598","1160","1685","1260",,,"20110315","20140526","Geen verstrekking in Open Data","25879","Ja",,,,,,,"3","4","0","0",,"396","0","M1",,,"r. motorruimte","1685","UKL-K",,"e1*2007/46*0370*02","ZH11","5J","0","0.05","255","Nee","Nee",,"Nee","0","0","0.00","2024","Geen oordeel","05","Ja","2025-02-08T00:00:00.000","2020-02-01T00:00:00.000","2011-03-15T00:00:00.000","2014-05-26T00:00:00.000",,"0",,,,,,,,,,,,,,,,,,,"B",,,,,,,"https://opendata.rdw.nl/resource/3huj-srit.json","https://opendata.rdw.nl/resource/8ys7-d773.json","https://opendata.rdw.nl/resource/vezc-m2t6.json","https://opendata.rdw.nl/resource/jhie-znh9.json","https://opendata.rdw.nl/resource/kmfi-hrps.json"
"37RJN3","Personenauto","MINI","ONE D CLUBMAN","20230316","20151030","4979","stationwagen","4","GRIJS","Niet geregistreerd","4","1598","1160","1685","1260",,,"20110531","20110531","Geen verstrekking in Open Data","26685","Ja",,,,,,,"3","4","0","0",,"396","0","M1",,,"r. motorruimte","1685","UKL-K",,"e1*2007/46*0370*03","ZH11","5J","0","0.05","255","Nee","Nee",,"Nee","0","0","0.00","2022","Logisch","00","Ja","2023-03-16T00:00:00.000","2015-10-30T00:00:00.000","2011-05-31T00:00:00.000","2011-05-31T00:00:00.000",,,,,,,,,,,,,,,,,,,,,"B",,,,,,,"https://opendata.rdw.nl/resource/3huj-srit.json","https://opendata.rdw.nl/resource/8ys7-d773.json","https://opendata.rdw.nl/resource/vezc-m2t6.json","https://opendata.rdw.nl/resource/jhie-znh9.json","https://opendata.rdw.nl/resource/kmfi-hrps.json"
"3KGX18","Personenauto","MINI","ONE D CLUBMAN","20250314","20200604","3727","stationwagen","4","WIT","Niet geregistreerd","4","1598","1160","1685","1260",,,"20130415","20200604","Geen verstrekking in Open Data","34256","Ja",,,,,,,"3","4","0","0",,"396","0","M1",,,"r. motorruimte","1685","UKL-K",,"e1*2007/46*0370*10","ZH11","5H0C0","0","0.05","255","Nee","Nee",,"Nee","0","0",,"2024","Geen oordeel","05","Ja","2025-03-14T00:00:00.000","2020-06-04T00:00:00.000","2013-04-15T00:00:00.000","2020-06-04T00:00:00.000",,,,,,,,,,,,,,,,,,,,,"C",,,,,,,"https://opendata.rdw.nl/resource/3huj-srit.json","https://opendata.rdw.nl/resource/8ys7-d773.json","https://opendata.rdw.nl/resource/vezc-m2t6.json","https://opendata.rdw.nl/resource/jhie-znh9.json","https://opendata.rdw.nl/resource/kmfi-hrps.json"
"3TKX78","Personenauto","MINI","ONE D CLUBMAN","20250325","20190902","4296","stationwagen","4","ZWART","Niet geregistreerd","4","1598","1160","1685","1260",,,"20140319","20140319","Geen verstrekking in Open Data","25639","Ja",,,,,,,"3","4","0","0",,"396","0","M1",,,"r. motorruimte","1685","UKL-K",,"e1*2007/46*0370*10","ZH11","5H0C0","0","0.05","255","Nee","Nee",,"Nee","0","0",,"2024","Onlogisch","04","Ja","2025-03-25T00:00:00.000","2019-09-02T00:00:00.000","2014-03-19T00:00:00.000","2014-03-19T00:00:00.000",,,,,,,,,,,,,,,,,,,,,"D",,,,,,,"https://opendata.rdw.nl/resource/3huj-srit.json","https://opendata.rdw.nl/resource/8ys7-d773.json","https://opendata.rdw.nl/resource/vezc-m2t6.json","https://opendata.rdw.nl/resource/jhie-znh9.json","https://opendata.rdw.nl/resource/kmfi-hrps.json"
"4TBH96","Personenauto","MINI","ONE D CLUBMAN","20250418","20240311","3727","stationwagen","4","WIT","Niet geregistreerd","4","1598","1160","1685","1260",,,"20131231","20131231","Geen verstrekking in Open Data","28309","Ja",,,,,,,"3","4","0","0",,"396","0","M1",,,"r. motorruimte","1685","UKL-K",,"e1*2007/46*0370*10","ZH11","5H0C0","0","0.05","255","Nee","Nee",,"Nee","0","0",,"2024","Logisch","00","Ja","2025-04-18T00:00:00.000","2024-03-11T00:00:00.000","2013-12-31T00:00:00.000","2013-12-31T00:00:00.000",,,,,,,,,,,,,,,,,,,,,"C",,,,,,,"https://opendata.rdw.nl/resource/3huj-srit.json","https://opendata.rdw.nl/resource/8ys7-d773.json","https://opendata.rdw.nl/resource/vezc-m2t6.json","https://opendata.rdw.nl/resource/jhie-znh9.json","https://opendata.rdw.nl/resource/kmfi-hrps.json"
"4TFP62","Personenauto","MINI","ONE D CLUBMAN","20241031","20210828","4296","stationwagen","4","GRIJS","Niet geregistreerd","4","1598","1160","1685","1260",,,"20140108","20140108","Geen verstrekking in Open Data","29156","Ja",,,,,,,"3","4","0","0",,"396","0","M1",,,"r. motorruimte","1685","UKL-K",,"e1*2007/46*0370*10","ZH11","5H05C","0","0.05","255","Nee","Nee",,"Nee","0","0",,"2023","Logisch","00","Ja","2024-10-31T00:00:00.000","2021-08-28T00:00:00.000","2014-01-08T00:00:00.000","2014-01-08T00:00:00.000",,,,,,,,,,,,,,,,,,,,,"D",,,,,,,"https://opendata.rdw.nl/resource/3huj-srit.json","https://opendata.rdw.nl/resource/8ys7-d773.json","https://opendata.rdw.nl/resource/vezc-m2t6.json","https://opendata.rdw.nl/resource/jhie-znh9.json","https://opendata.rdw.nl/resource/kmfi-hrps.json"
"5SND69","Personenauto","MINI","ONE D CLUBMAN","20241109","20230907","3727","stationwagen","4","GRIJS","Niet geregistreerd","4","1598","1160","1685","1260",,,"20131104","20131104","Geen verstrekking in Open Data","25855","Ja",,,,,,,"3","4","0","0",,"396","0","M1",,,"r. motorruimte","1685","UKL-K",,"e1*2007/46*0370*10","ZH11","5H0C0","0","0.05","255","Nee","Nee",,"Nee","0","0",,"2024","Logisch","00","Ja","2024-11-09T00:00:00.000","2023-09-07T00:00:00.000","2013-11-04T00:00:00.000","2013-11-04T00:00:00.000",,,,,,,,,,,,,,,,,,,,,"C",,,,,,,"https://opendata.rdw.nl/resource/3huj-srit.json","https://opendata.rdw.nl/resource/8ys7-d773.json","https://opendata.rdw.nl/resource/vezc-m2t6.json","https://opendata.rdw.nl/resource/jhie-znh9.json","https://opendata.rdw.nl/resource/kmfi-hrps.json"
"5ZLN69","Personenauto","MINI","ONE D CLUBMAN","20250213","20150402","3727","stationwagen","4","GRIJS","Niet geregistreerd","4","1598","1160","1685","1260",,,"20101108","20150402","Geen verstrekking in Open Data","24845","Ja",,,,,,,"3","4","0","0",,"396","0","M1",,,"r. motorruimte","1685","UKL-K",,"e1*2007/46*0370*02","ZH11","5A","0","0.05","255","Nee","Nee",,"Nee","0","0","0.00","2024","Geen oordeel","05","Ja","2025-02-13T00:00:00.000","2015-04-02T00:00:00.000","2010-11-08T00:00:00.000","2015-04-02T00:00:00.000",,"0",,,,,,,,,,,,,,,,,,,"B",,,,,,,"https://opendata.rdw.nl/resource/3huj-srit.json","https://opendata.rdw.nl/resource/8ys7-d773.json","https://opendata.rdw.nl/resource/vezc-m2t6.json","https://opendata.rdw.nl/resource/jhie-znh9.json","https://opendata.rdw.nl/resource/kmfi-hrps.json"
"7KNF49","Personenauto","MINI","ONE D CLUBMAN","20250603","20161118","3727","stationwagen","4","ZWART","Niet geregistreerd","4","1598","1160","1685","1260",,,"20130603","20130603","Geen verstrekking in Open Data","28628","Ja",,,,,,,"3","4","0","0",,"396","0","M1",,,"r. motorruimte","1685","UKL-K",,"e1*2007/46*0370*10","ZH11","5H05C","0","0.05","255","Nee","Nee",,"Nee","0","0",,"2024","Logisch","00","Ja","2025-06-03T00:00:00.000","2016-11-18T00:00:00.000","2013-06-03T00:00:00.000","2013-06-03T00:00:00.000",,,,,,,,,,,,,,,,,,,,,"C",,,,,,,"https://opendata.rdw.nl/resource/3huj-srit.json","https://opendata.rdw.nl/resource/8ys7-d773.json","https://opendata.rdw.nl/resource/vezc-m2t6.json","https://opendata.rdw.nl/resource/jhie-znh9.json","https://opendata.rdw.nl/resource/kmfi-hrps.json"
"7SXX80","Personenauto","MINI","ONE D CLUBMAN","20250311","20210312","3727","stationwagen","4","GROEN","Niet geregistreerd","4","1598","1160","1685","1260",,,"20140107","20140107","Geen verstrekking in Open Data","27919","Ja",,,,,,,"3","4","0","0",,"396","0","M1",,,"r. motorruimte","1685","UKL-K",,"e1*2007/46*0370*10","ZH11","5H05C","0","0.05","255","Nee","Nee",,"Nee","0","0",,"2024","Logisch","00","Ja","2025-03-11T00:00:00.000","2021-03-12T00:00:00.000","2014-01-07T00:00:00.000","2014-01-07T00:00:00.000",,,,,,,,,,,,,,,,,,,,,"D",,,,,,,"https://opendata.rdw.nl/resource/3huj-srit.json","https://opendata.rdw.nl/resource/8ys7-d773.json","https://opendata.rdw.nl/resource/vezc-m2t6.json","https://opendata.rdw.nl/resource/jhie-znh9.json","https://opendata.rdw.nl/resource/kmfi-hrps.json"
"96SNJ2","Personenauto","MINI","ONE D CLUBMAN","20250216","20210410","5203","stationwagen","4","WIT","Niet geregistreerd","4","1598","1160","1685","1260",,,"20111101","20111101","Geen verstrekking in Open Data","28312","Ja",,,,,,,"3","4","0","0",,"396","0","M1",,,"r. motorruimte","1685","UKL-K",,"e1*2007/46*0370*04","ZH11","5A","0","0.05","255","Nee","Nee",,"Nee","0","0","0.00","2024","Logisch","00","Ja","2025-02-16T00:00:00.000","2021-04-10T00:00:00.000","2011-11-01T00:00:00.000","2011-11-01T00:00:00.000",,,,,,,,,,,,,,,,,,,,,"B",,,,,,,"https://opendata.rdw.nl/resource/3huj-srit.json","https://opendata.rdw.nl/resource/8ys7-d773.json","https://opendata.rdw.nl/resource/vezc-m2t6.json","https://opendata.rdw.nl/resource/jhie-znh9.json","https://opendata.rdw.nl/resource/kmfi-hrps.json"
"GH216F","Personenauto","MINI","ONE D CLUBMAN","20250414","20210226","2388","stationwagen","4","GRIJS","Niet geregistreerd","4","1598","1160","1685","1260",,,"20110606","20150520","Geen verstrekking in Open Data","27648","Ja",,,,,,,"3","4","0","0",,"396","0","M1",,,"r. motorruimte","1685","UKL-K",,"e1*2007/46*0370*03","ZH11","5J","0","0.05","255","Nee","Nee",,"Nee","0","0","0.00","2024","Geen oordeel","05","Ja","2025-04-14T00:00:00.000","2021-02-26T00:00:00.000","2011-06-06T00:00:00.000","2015-05-20T00:00:00.000",,,,,,,,,,,,,,,,,,,,,"B",,,,,,,"https://opendata.rdw.nl/resource/3huj-srit.json","https://opendata.rdw.nl/resource/8ys7-d773.json","https://opendata.rdw.nl/resource/vezc-m2t6.json","https://opendata.rdw.nl/resource/jhie-znh9.json","https://opendata.rdw.nl/resource/kmfi-hrps.json"
"GN111T","Personenauto","MINI","ONE D CLUBMAN","20250326","20240326","2659","stationwagen","4","ZWART","Niet geregistreerd","4","1598","1160","1685","1260",,,"20110621","20150701","Geen verstrekking in Open Data","34957","Ja",,,,,,,"3","4","0","0",,"396","0","M1",,,"r. motorruimte","1685","UKL-K",,"e1*2007/46*0370*03","ZH11","5A","0","0.05","255","Nee","Nee",,"Nee","0","0","0.00","2024","Geen oordeel","05","Ja","2025-03-26T00:00:00.000","2024-03-26T00:00:00.000","2011-06-21T00:00:00.000","2015-07-01T00:00:00.000",,,,,,,,,,,,,,,,,,,,,"B",,,,,,,"https://opendata.rdw.nl/resource/3huj-srit.json","https://opendata.rdw.nl/resource/8ys7-d773.json","https://opendata.rdw.nl/resource/vezc-m2t6.json","https://opendata.rdw.nl/resource/jhie-znh9.json","https://opendata.rdw.nl/resource/kmfi-hrps.json"
"H932XH","Personenauto","MINI","ONE D CLUBMAN","20240612","20200612","3726","stationwagen","4","BRUIN","Niet geregistreerd","4","1598","1160","1685","1260",,,"20131106","20200612","Geen verstrekking in Open Data","30130","Ja",,,,,,,"3","4","0","0",,"396","168","M1",,,"r. motorruimte","1685","UKL-K",,"e1*2007/46*0370*10","ZH11","5H05C","0","0.05","255","Nee","Nee",,"Nee","0","0",,"2023","Geen oordeel","05","Ja","2024-06-12T00:00:00.000","2020-06-12T00:00:00.000","2013-11-06T00:00:00.000","2020-06-12T00:00:00.000",,,,,,,,,,,"143",,,,,,,,,,"C",,,,,,,"https://opendata.rdw.nl/resource/3huj-srit.json","https://opendata.rdw.nl/resource/8ys7-d773.json","https://opendata.rdw.nl/resource/vezc-m2t6.json","https://opendata.rdw.nl/resource/jhie-znh9.json","https://opendata.rdw.nl/resource/kmfi-hrps.json"
"JB757S","Personenauto","MINI","ONE D CLUBMAN","20241212","20221125","3727","stationwagen","4","WIT","Niet geregistreerd","4","1598","1160","1685","1260",,,"20110610","20160212","Geen verstrekking in Open Data","25760","Ja",,,,,,,"3","4","0","0",,"396","0","M1",,,"r. motorruimte","1685","UKL-K",,"e1*2007/46*0370*03","ZH11","5J","0","0.05","255","Nee","Nee",,"Nee","0","0","0.00","2023","Geen oordeel","05","Ja","2024-12-12T00:00:00.000","2022-11-25T00:00:00.000","2011-06-10T00:00:00.000","2016-02-12T00:00:00.000",,,,,,,,,,,,,,,,,,,,,"B",,,,,,,"https://opendata.rdw.nl/resource/3huj-srit.json","https://opendata.rdw.nl/resource/8ys7-d773.json","https://opendata.rdw.nl/resource/vezc-m2t6.json","https://opendata.rdw.nl/resource/jhie-znh9.json","https://opendata.rdw.nl/resource/kmfi-hrps.json"
"JH061N","Personenauto","MINI","ONE D CLUBMAN","20250218","20221022","1291","stationwagen","4","BRUIN","Niet geregistreerd","4","1598","1160","1685","1260",,,"20130424","20160330","Geen verstrekking in Open Data","31781","Ja",,,,,,,"3","4","0","0",,"396","0","M1",,,"r. motorruimte","1685","UKL-K",,"e1*2007/46*0370*10","ZH11","5H0C0","0","0.05","255","Nee","Nee",,"Nee","0","0",,"2024","Geen oordeel","05","Nee","2025-02-18T00:00:00.000","2022-10-22T00:00:00.000","2013-04-24T00:00:00.000","2016-03-30T00:00:00.000",,,,,,,,,,,,,,,,,,,,,"C",,,,,,,"https://opendata.rdw.nl/resource/3huj-srit.json","https://opendata.rdw.nl/resource/8ys7-d773.json","https://opendata.rdw.nl/resource/vezc-m2t6.json","https://opendata.rdw.nl/resource/jhie-znh9.json","https://opendata.rdw.nl/resource/kmfi-hrps.json"
"KB197V","Personenauto","MINI","ONE D CLUBMAN","20250317","20190216","4296","stationwagen","4","ZWART","Niet geregistreerd","4","1598","1160","1685","1260",,,"20140317","20160725","Geen verstrekking in Open Data","28615","Ja",,,,,,,"3","4","0","0",,"396","0","M1",,,"r. motorruimte","1685","UKL-K",,"e1*2007/46*0370*10","ZH11","5H05C","0","0.05","255","Nee","Nee",,"Nee","0","0",,"2024","Geen oordeel","05","Ja","2025-03-17T00:00:00.000","2019-02-16T00:00:00.000","2014-03-17T00:00:00.000","2016-07-25T00:00:00.000",,,,,,,,,,,,,,,,,,,,,"D",,,,,,,"https://opendata.rdw.nl/resource/3huj-srit.json","https://opendata.rdw.nl/resource/8ys7-d773.json","https://opendata.rdw.nl/resource/vezc-m2t6.json","https://opendata.rdw.nl/resource/jhie-znh9.json","https://opendata.rdw.nl/resource/kmfi-hrps.json"
"NV711J","Personenauto","MINI","ONE D CLUBMAN","20250308","20170426","2740","stationwagen","5","ZWART","Niet geregistreerd","4","1598","1160","1685","1260",,,"20140326","20170426","Geen verstrekking in Open Data","31630","Ja",,,,,,,"3","4","0","0",,"396","0","M1",,,"r. motorruimte","1685","UKL-K",,"e1*2007/46*0370*10","ZH11","5H05C","0","0.05","255","Nee","Nee",,"Nee","0","0",,"2024","Geen oordeel","05","Ja","2025-03-08T00:00:00.000","2017-04-26T00:00:00.000","2014-03-26T00:00:00.000","2017-04-26T00:00:00.000",,,,,,,,,,,,,,,,,,,,,"D",,,,,,,"https://opendata.rdw.nl/resource/3huj-srit.json","https://opendata.rdw.nl/resource/8ys7-d773.json","https://opendata.rdw.nl/resource/vezc-m2t6.json","https://opendata.rdw.nl/resource/jhie-znh9.json","https://opendata.rdw.nl/resource/kmfi-hrps.json"
"PK419N","Personenauto","MINI","ONE D CLUBMAN","20241003","20181229","1156","stationwagen","5","ORANJE","Niet geregistreerd","4","1598","1160","1685","1260",,,"20120530","20181229","Geen verstrekking in Open Data","25258","Ja",,,,,,,"3","4","0","0",,"396","0","M1",,,"r. motorruimte","1685","UKL-K",,"e1*2007/46*0370*07","ZH11","5H05C","0","0.05","255","Nee","Nee",,"Nee","0","0","0.00","2023","Geen oordeel","05","Ja","2024-10-03T00:00:00.000","2018-12-29T00:00:00.000","2012-05-30T00:00:00.000","2018-12-29T00:00:00.000",,,,,,,,,,,,,,,,,,,,,"C",,,,,,,"https://opendata.rdw.nl/resource/3huj-srit.json","https://opendata.rdw.nl/resource/8ys7-d773.json","https://opendata.rdw.nl/resource/vezc-m2t6.json","https://opendata.rdw.nl/resource/jhie-znh9.json","https://opendata.rdw.nl/resource/kmfi-hrps.json"
"RG341N","Personenauto","MINI","ONE D CLUBMAN","20250201","20180202","3727","stationwagen","4","BLAUW","Niet geregistreerd","4","1598","1160","1685","1260",,,"20130603","20180202","Geen verstrekking in Open Data","26878","Ja",,,,,,,"3","4","0","0",,"396","0","M1",,,"r. motorruimte","1685","UKL-K",,"e1*2007/46*0370*10","ZH11","5H05C","0","0.05","255","Nee","Nee",,"Nee","0","0",,"2024","Geen oordeel","05","Ja","2025-02-01T00:00:00.000","2018-02-02T00:00:00.000","2013-06-03T00:00:00.000","2018-02-02T00:00:00.000",,,,,,,,,,,,,,,,,,,,,"C",,,,,,,"https://opendata.rdw.nl/resource/3huj-srit.json","https://opendata.rdw.nl/resource/8ys7-d773.json","https://opendata.rdw.nl/resource/vezc-m2t6.json","https://opendata.rdw.nl/resource/jhie-znh9.json","https://opendata.rdw.nl/resource/kmfi-hrps.json"
"RK903J","Personenauto","MINI","ONE D CLUBMAN","20250212","20190211","716","stationwagen","4","ZWART","Niet geregistreerd","4","1598","1160","1685","1260",,,"20120725","20190211","Geen verstrekking in Open Data","35704","Ja",,,,,,,"3","4","0","0",,"396","0","M1",,,"r. motorruimte","1685","UKL-K",,"e1*2007/46*0370*08","ZH11","5H0C0","0","0.05","255","Nee","Nee",,"Nee","0","0","0.00","2024","Geen oordeel","05","Ja","2025-02-12T00:00:00.000","2019-02-11T00:00:00.000","2012-07-25T00:00:00.000","2019-02-11T00:00:00.000",,,,,,,,,,,,,,,,,,,,,"C",,,,,,,"https://opendata.rdw.nl/resource/3huj-srit.json","https://opendata.rdw.nl/resource/8ys7-d773.json","https://opendata.rdw.nl/resource/vezc-m2t6.json","https://opendata.rdw.nl/resource/jhie-znh9.json","https://opendata.rdw.nl/resource/kmfi-hrps.json"
"RS143P","Personenauto","MINI","ONE D CLUBMAN","20240926","20180122","3727","stationwagen","5","BRUIN","Niet geregistreerd","4","1598","1160","1685","1260",,,"20130926","20180122","Geen verstrekking in Open Data","30007","Ja",,,,,,,"3","4",,,,,,"M1",,,"r. motorruimte","1685","UKL-K",,,,,,"0.05","255","Nee","Nee",,"Nee",,,,"2023","Geen oordeel","05","Ja","2024-09-26T00:00:00.000","2018-01-22T00:00:00.000","2013-09-26T00:00:00.000","2018-01-22T00:00:00.000",,,,,,,,,,,,,,,,,,,,,,,,,,,,"https://opendata.rdw.nl/resource/3huj-srit.json","https://opendata.rdw.nl/resource/8ys7-d773.json","https://opendata.rdw.nl/resource/vezc-m2t6.json","https://opendata.rdw.nl/resource/jhie-znh9.json","https://opendata.rdw.nl/resource/kmfi-hrps.json"
"RZ622L","Personenauto","MINI","ONE D CLUBMAN","20250118","20240404","3727","stationwagen","5","WIT","Niet geregistreerd","4","1598","1160","1685","1260",,,"20110125","20180226","Geen verstrekking in Open Data","27416","Ja",,,,,,,"3","4",,,,,,"M1",,,"r. motorruimte","1685","UKL-K",,,,,,"0.05","255","Nee","Nee",,"Nee",,,,"2024","Geen oordeel","05","Ja","2025-01-18T00:00:00.000","2024-04-04T00:00:00.000","2011-01-25T00:00:00.000","2018-02-26T00:00:00.000",,,,,,,,,,,,,,,,,,,,,,,,,,,,"https://opendata.rdw.nl/resource/3huj-srit.json","https://opendata.rdw.nl/resource/8ys7-d773.json","https://opendata.rdw.nl/resource/vezc-m2t6.json","https://opendata.rdw.nl/resource/jhie-znh9.json","https://opendata.rdw.nl/resource/kmfi-hrps.json"
"TF282D","Personenauto","MINI","ONE D CLUBMAN","20250403","20201014","1092","stationwagen","4","ZWART","Niet geregistreerd","4","1598","1160","1685","1260",,,"20130403","20180710","Geen verstrekking in Open Data","26923","Ja",,,,,,,"3","4","0","0",,"396","0","M1",,,"r. motorruimte","1685","UKL-K",,"e1*2007/46*0370*09","ZH11","5H05C","0","0.05","255","Nee","Nee",,"Nee","0","0","0.00","2024","Geen oordeel","05","Ja","2025-04-03T00:00:00.000","2020-10-14T00:00:00.000","2013-04-03T00:00:00.000","2018-07-10T00:00:00.000",,,,,,,,,,,,,,,,,,,,,"C",,,,,,,"https://opendata.rdw.nl/resource/3huj-srit.json","https://opendata.rdw.nl/resource/8ys7-d773.json","https://opendata.rdw.nl/resource/vezc-m2t6.json","https://opendata.rdw.nl/resource/jhie-znh9.json","https://opendata.rdw.nl/resource/kmfi-hrps.json"
