"kenteken","voertuigsoort","merk","handelsbenaming","vervaldatum_apk","datum_tenaamstelling","bruto_bpm","inrichting","aantal_zitplaatsen","eerste_kleur","tweede_kleur","aantal_cilinders","cilinderinhoud","massa_ledig_voertuig","toegestane_maximum_massa_voertuig","massa_rijklaar","maximum_massa_trekken_ongeremd","maximum_trekken_massa_geremd","datum_eerste_toelating","datum_eerste_tenaamstelling_in_nederland","wacht_op_keuren","catalogusprijs","wam_verzekerd","maximale_constructiesnelheid","laadvermogen","oplegger_geremd","aanhangwagen_autonoom_geremd","aanhangwagen_middenas_geremd","aantal_staanplaatsen","aantal_deuren","aantal_wielen","afstand_hart_koppeling_tot_achterzijde_voertuig","afstand_voorzijde_voertuig_tot_hart_koppeling","afwijkende_maximum_snelheid","lengte","breedte","europese_voertuigcategorie","europese_voertuigcategorie_toevoeging","europese_uitvoeringcategorie_toevoeging","plaats_chassisnummer","technische_max_massa_voertuig","type","type_gasinstallatie","typegoedkeuringsnummer","variant","uitvoering","volgnummer_wijziging_eu_typegoedkeuring","vermogen_massarijklaar","wielbasis","export_indicator","openstaande_terugroepactie_indicator","vervaldatum_tachograaf","taxi_indicator","maximum_massa_samenstelling","aantal_rolstoelplaatsen","maximum_ondersteunende_snelheid","jaar_laatste_registratie_tellerstand","tellerstandoordeel","code_toelichting_tellerstandoordeel","tenaamstellen_mogelijk","vervaldatum_apk_dt","datum_tenaamstelling_dt","datum_eerste_toelating_dt","datum_eerste_tenaamstelling_in_nederland_dt","vervaldatum_tachograaf_dt","maximum_last_onder_de_vooras_sen_tezamen_koppeling","type_remsysteem_voertuig_code","rupsonderstelconfiguratiecode","wielbasis_voertuig_minimum","wielbasis_voertuig_maximum","lengte_voertuig_minimum","lengte_voertuig_maximum","breedte_voertuig_minimum","breedte_voertuig_maximum","hoogte_voertuig","hoogte_voertuig_minimum","hoogte_voertuig_maximum","massa_bedrijfsklaar_minimaal","massa_bedrijfsklaar_maximaal","technisch_toelaatbaar_massa_koppelpunt","maximum_massa_technisch_maximaal","maximum_massa_technisch_minimaal","subcategorie_nederland","verticale_belasting_koppelpunt_getrokken_voertuig","zuinigheidsclassificatie","registratie_datum_goedkeuring_afschrijvingsmoment_bpm","registratie_datum_goedkeuring_afschrijvingsmoment_bpm_dt","gem_lading_wrde","aerodyn_voorz","massa_alt_aandr","verl_cab_ind","api_gekentekende_voertuigen_assen","api_gekentekende_voertuigen_brandstof","api_gekentekende_voertuigen_carrosserie","api_gekentekende_voertuigen_carrosserie_specifiek","api_gekentekende_voertuigen_voertuigklasse"
"G205FD","Personenauto","MINI","CLUBMAN COOPER D","20241002","20191002","8459","stationwagen","5","GRIJS","ZWART","4","1995","1435","2010","1535","695","1300","20191002","20191002","Geen verstrekking in Open Data","43588","Ja","212",,,,,,"4","4","0","0",,"427","180","M1",,,,"2010","FMK",,"e1*2007/46*1683*07","71BB","DAW500L0","0","0.07","267","Nee","Nee",,"Nee","3310","0","0.00","2023","Logisch","00","Ja","2024-10-02T00:00:00.000","2019-10-02T00:00:00.000","2019-10-02T00:00:00.000","2019-10-02T00:00:00.000",,,,,,,,,,,"144",,,,,,,,,,,,,,,,,"https://opendata.rdw.nl/resource/3huj-srit.json","https://opendata.rdw.nl/resource/8ys7-d773.json","https://opendata.rdw.nl/resource/vezc-m2t6.json","https://opendata.rdw.nl/resource/jhie-znh9.json","https://opendata.rdw.nl/resource/kmfi-hrps.json"
"G548NG","Personenauto","MINI","CLUBMAN COOPER D","20250201","20191108","8898","stationwagen","5","GRIJS","ZWART","4","1995","1435","2010","1535","695","1300","20191108","20191108","Geen verstrekking in Open Data","45077","Ja","212",,,,,,"4","4","0","0",,"427","180","M1",,,,"2010","FMK",,"e1*2007/46*1683*07","71BB","DAW500L0","0","0.07","267","Nee","Nee",,"Nee","3310","0","0.00","2024","Logisch","00","Ja","2025-02-01T00:00:00.000","2019-11-08T00:00:00.000","2019-11-08T00:00:00.000","2019-11-08T00:00:00.000",,,,,,,,,,,"144",,,,,,,,,,,,,,,,,"https://opendata.rdw.nl/resource/3huj-srit.json","https://opendata.rdw.nl/resource/8ys7-d773.json","https://opendata.rdw.nl/resource/vezc-m2t6.json","https://opendata.rdw.nl/resource/jhie-znh9.json","https://opendata.rdw.nl/resource/kmfi-hrps.json"
"G725GF","Personenauto","MINI","CLUBMAN COOPER D","20241002","20190916","7776","stationwagen","5","ROOD","WIT","4","1995","1335","1945","1435","695","1300","20160308","20190916","Geen verstrekking in Open Data","38368","Ja","212",,,,,,"4","4","0","0",,"425","180","M1",,,,"1945","UKL-L",,"e1*2007/46*0371*21","LR91","6A3500C0","0","0.08","267","Nee","Nee",,"Nee","3320","0","0.00","2024","Geen oordeel","05","Ja","2024-10-02T00:00:00.000","2019-09-16T00:00:00.000","2016-03-08T00:00:00.000","2019-09-16T00:00:00.000",,,,,,,,,,,"144",,,,,,,,,,"F",,,,,,,"https://opendata.rdw.nl/resource/3huj-srit.json","https://opendata.rdw.nl/resource/8ys7-d773.json","https://opendata.rdw.nl/resource/vezc-m2t6.json","https://opendata.rdw.nl/resource/jhie-znh9.json","https://opendata.rdw.nl/resource/kmfi-hrps.json"
"GZ658K","Personenauto","MINI","CLUBMAN COOPER D","20250503","20181119","7029","stationwagen","5","ZWART","Niet geregistreerd","4","1995","1295","1910","1395","695","1300","20150918","20150918","Geen verstrekking in Open Data","45360","Ja",,,,,,,"4","4","0","0",,"425","180","M1",,,"in motorruimte r.","1910","UKL-L",,"e1*2007/46*0371*20","LR91","6H3500C0","0","0.08","267","Nee","Nee",,"Nee","3285","0","0.00","2024","Logisch","00","Ja","2025-05-03T00:00:00.000","2018-11-19T00:00:00.000","2015-09-18T00:00:00.000","2015-09-18T00:00:00.000",,,,,,,,,,,"144",,,,,,,,,,"D",,,,,,,"https://opendata.rdw.nl/resource/3huj-srit.json","https://opendata.rdw.nl/resource/8ys7-d773.json","https://opendata.rdw.nl/resource/vezc-m2t6.json","https://opendata.rdw.nl/resource/jhie-znh9.json","https://opendata.rdw.nl/resource/kmfi-hrps.json"
"H375ZZ","Personenauto","MINI","CLUBMAN COOPER D","20240708","20200708","9548","stationwagen","5","ROOD","ZWART","4","1995","1445","2010","1545","750","1300","20200708","20200708","Geen verstrekking in Open Data","47866","Ja","212",,,,,,"4","4","0","0",,"427","180","M1",,,,"2010","FMK",,"e1*2007/46*1683*08","71BB","IAW500L0","0","0.07","267","Nee","Nee",,"Nee","3310","0","0.00","2024","Logisch","00","Ja","2024-07-08T00:00:00.000","2020-07-08T00:00:00.000","2020-07-08T00:00:00.000","2020-07-08T00:00:00.000",,,,,,,,,,,"144",,,,,,,,,,"D",,,,,,,"https://opendata.rdw.nl/resource/3huj-srit.json","https://opendata.rdw.nl/resource/8ys7-d773.json","https://opendata.rdw.nl/resource/vezc-m2t6.json","https://opendata.rdw.nl/resource/jhie-znh9.json","https://opendata.rdw.nl/resource/kmfi-hrps.json"
"HD348S","Personenauto","MINI","CLUBMAN COOPER D","20250501","20180504","7029","stationwagen","5","GRIJS","Niet geregistreerd","4","1995","1335","1945","1435","695","1300","20151009","20151009","Geen verstrekking in Open Data","52515","Ja",,,,,,,"4","4","0","0",,"425","180","M1",,,"in motorruimte r.","1945","UKL-L",,"e1*2007/46*0371*20","LR91","6A3500C0","0","0.08","267","Nee","Nee",,"Nee","3320","0","0.00","2024","Logisch","00","Ja","2025-05-01T00:00:00.000","2018-05-04T00:00:00.000","2015-10-09T00:00:00.000","2015-10-09T00:00:00.000",,,,,,,,,,,"144",,,,,,,,,,"D",,,,,,,"https://opendata.rdw.nl/resource/3huj-srit.json","https://opendata.rdw.nl/resource/8ys7-d773.json","https://opendata.rdw.nl/resource/vezc-m2t6.json","https://opendata.rdw.nl/resource/jhie-znh9.json","https://opendata.rdw.nl/resource/kmfi-hrps.json"
"HD350S","Personenauto","MINI","CLUBMAN COOPER D","20241020","20240113","7029","stationwagen","5","GRIJS","ZWART","4","1995","1295","1910","1395","695","1300","20151007","20151007","Geen verstrekking in Open Data","49431","Ja",,,,,,,"4","4","0","0",,"425","180","M1",,,"in motorruimte r.","1910","UKL-L",,"e1*2007/46*0371*20","LR91","6H3500C0","0","0.08","267","Nee","Nee",,"Nee","3285","0","0.00","2023","Logisch","00","Ja","2024-10-20T00:00:00.000","2024-01-13T00:00:00.000","2015-10-07T00:00:00.000","2015-10-07T00:00:00.000",,,,,,,,,,,"144",,,,,,,,,,"D",,,,,,,"https://opendata.rdw.nl/resource/3huj-srit.json","https://opendata.rdw.nl/resource/8ys7-d773.json","https://opendata.rdw.nl/resource/vezc-m2t6.json","https://opendata.rdw.nl/resource/jhie-znh9.json","https://opendata.rdw.nl/resource/kmfi-hrps.json"
"HG327L","Personenauto","MINI","CLUBMAN COOPER D","20250506","20161118","7029","stationwagen","5","BLAUW","GRIJS","4","1995","1335","1945","1435","695","1300","20151029","20151029","Geen verstrekking in Open Data","53243","Ja",,,,,,,"4","4","0","0",,"425","180","M1",,,"in motorruimte r.","1945","UKL-L",,"e1*2007/46*0371*20","LR91","6A3500C0","0","0.08","267","Nee","Nee",,"Nee","3320","0","0.00","2024","Logisch","00","Ja","2025-05-06T00:00:00.000","2016-11-18T00:00:00.000","2015-10-29T00:00:00.000","2015-10-29T00:00:00.000",,,,,,,,,,,"144",,,,,,,,,,"D",,,,,,,"https://opendata.rdw.nl/resource/3huj-srit.json","https://opendata.rdw.nl/resource/8ys7-d773.json","https://opendata.rdw.nl/resource/vezc-m2t6.json","https://opendata.rdw.nl/resource/jhie-znh9.json","https://opendata.rdw.nl/resource/kmfi-hrps.json"
"HG472T","Personenauto","MINI","CLUBMAN COOPER D","20250127","20240328","6633","stationwagen","5","GRIJS","ZWART","4","1995","1335","1945","1435","695","1300","20151028","20151028","Geen verstrekking in Open Data","51906","Ja",,,,,,,"4","4","0","0",,"425","180","M1",,,"in motorruimte r.","1945","UKL-L",,"e1*2007/46*0371*20","LR91","6A2500C0","0","0.08","267","Nee","Nee",,"Nee","3320","0","0.00","2024","Logisch","00","Ja","2025-01-27T00:00:00.000","2024-03-28T00:00:00.000","2015-10-28T00:00:00.000","2015-10-28T00:00:00.000",,,,,,,,,,,"144",,,,,,,,,,"D",,,,,,,"https://opendata.rdw.nl/resource/3huj-srit.json","https://opendata.rdw.nl/resource/8ys7-d773.json","https://opendata.rdw.nl/resource/vezc-m2t6.json","https://opendata.rdw.nl/resource/jhie-znh9.json","https://opendata.rdw.nl/resource/kmfi-hrps.json"
"HG476T","Personenauto","MINI","CLUBMAN COOPER D","20250514","20230531","7025","stationwagen","5","BLAUW","GRIJS","4","1995","1335","1945","1435","695","1300","20151029","20151029","Geen verstrekking in Open Data","46184","Ja","212",,,,,,"4","4","0","0",,"425","0","M1",,,"in motorruimte r.","1945","UKL-L",,"e1*2007/46*0371*20","LR91","6A3500C0","0","0.08","267","Nee","Nee",,"Nee","3320","0","0.00","2024","Geen oordeel","05","Ja","2025-05-14T00:00:00.000","2023-05-31T00:00:00.000","2015-10-29T00:00:00.000","2015-10-29T00:00:00.000",,,,,,,,,,,,,,,,,,,,,"D","20230420","2023-04-20T00:00:00.000",,,,,"https://opendata.rdw.nl/resource/3huj-srit.json","https://opendata.rdw.nl/resource/8ys7-d773.json","https://opendata.rdw.nl/resource/vezc-m2t6.json","https://opendata.rdw.nl/resource/jhie-znh9.json","https://opendata.rdw.nl/resource/kmfi-hrps.json"
"HG479T","Personenauto","MINI","CLUBMAN COOPER D","20221031","20160503","5884","stationwagen","5","ZWART","GRIJS","4","1995","1335","1945","1435","695","1300","20151029","20151029","Geen verstrekking in Open Data","45564","Nee",,,,,,,"4","4","0","0",,"425","180","M1",,,"in motorruimte r.","1945","UKL-L",,"e1*2007/46*0371*20","LR91","6A1500C0","0","0.08","267","Nee","Nee",,"Nee","3320","0","0.00","2022","Logisch","00","Ja","2022-10-31T00:00:00.000","2016-05-03T00:00:00.000","2015-10-29T00:00:00.000","2015-10-29T00:00:00.000",,,,,,,,,,,"144",,,,,,,,,,"D",,,,,,,"https://opendata.rdw.nl/resource/3huj-srit.json","https://opendata.rdw.nl/resource/8ys7-d773.json","https://opendata.rdw.nl/resource/vezc-m2t6.json","https://opendata.rdw.nl/resource/jhie-znh9.json","https://opendata.rdw.nl/resource/kmfi-hrps.json"
"HG598Z","Personenauto","MINI","CLUBMAN COOPER D","20241102","20210515","5884","stationwagen","5","ZWART","Niet geregistreerd","4","1995","1295","1910","1395","695","1300","20151102","20151102","Geen verstrekking in Open Data","39885","Ja",,,,,,,"4","4","0","0",,"425","180","M1",,,"in motorruimte r.","1910","UKL-L",,"e1*2007/46*0371*20","LR91","6H1500C0","0","0.08","267","Nee","Nee",,"Nee","3285","0","0.00","2024","Logisch","00","Ja","2024-11-02T00:00:00.000","2021-05-15T00:00:00.000","2015-11-02T00:00:00.000","2015-11-02T00:00:00.000",,,,,,,,,,,"144",,,,,,,,,,"D",,,,,,,"https://opendata.rdw.nl/resource/3huj-srit.json","https://opendata.rdw.nl/resource/8ys7-d773.json","https://opendata.rdw.nl/resource/vezc-m2t6.json","https://opendata.rdw.nl/resource/jhie-znh9.json","https://opendata.rdw.nl/resource/kmfi-hrps.json"
"HG915H","Personenauto","MINI","CLUBMAN COOPER D","20241026","20170303","5884","stationwagen","5","ZWART","Niet geregistreerd","4","1995","1335","1945","1435","695","1300","20151026","20151026","Geen verstrekking in Open Data","46760","Ja",,,,,,,"4","4","0","0",,"425","180","M1",,,"in motorruimte r.","1945","UKL-L",,"e1*2007/46*0371*20","LR91","6A1500C0","0","0.08","267","Nee","Nee",,"Nee","3320","0","0.00","2023","Logisch","00","Ja","2024-10-26T00:00:00.000","2017-03-03T00:00:00.000","2015-10-26T00:00:00.000","2015-10-26T00:00:00.000",,,,,,,,,,,"144",,,,,,,,,,"D",,,,,,,"https://opendata.rdw.nl/resource/3huj-srit.json","https://opendata.rdw.nl/resource/8ys7-d773.json","https://opendata.rdw.nl/resource/vezc-m2t6.json","https://opendata.rdw.nl/resource/jhie-znh9.json","https://opendata.rdw.nl/resource/kmfi-hrps.json"
"HH344S","Personenauto","MINI","CLUBMAN COOPER D","20250206","20201114","7029","stationwagen","5","ZWART","Niet geregistreerd","4","1995","1335","1945","1435","695","1300","20151117","20151117","Geen verstrekking in Open Data","51715","Ja",,,,,,,"4","4","0","0",,"425","180","M1",,,"in motorruimte r.","1945","UKL-L",,"e1*2007/46*0371*20","LR91","6A3500C0","0","0.08","267","Nee","Nee",,"Nee","3320","0","0.00","2024","Logisch","00","Ja","2025-02-06T00:00:00.000","2020-11-14T00:00:00.000","2015-11-17T00:00:00.000","2015-11-17T00:00:00.000",,,,,,,,,,,"144",,,,,,,,,,"D",,,,,,,"https://opendata.rdw.nl/resource/3huj-srit.json","https://opendata.rdw.nl/resource/8ys7-d773.json","https://opendata.rdw.nl/resource/vezc-m2t6.json","https://opendata.rdw.nl/resource/jhie-znh9.json","https://opendata.rdw.nl/resource/kmfi-hrps.json"
"HH932F","Personenauto","MINI","CLUBMAN COOPER D","20241107","20200912","6633","stationwagen","5","ROOD","GRIJS","4","1995","1335","1945","1435","695","1300","20151102","20151102","Geen verstrekking in Open Data","45647","Ja",,,,,,,"4","4","0","0",,"425","180","M1",,,"in motorruimte r.","1945","UKL-L",,"e1*2007/46*0371*20","LR91","6A2500C0","0","0.08","267","Nee","Nee",,"Nee","3320","0","0.00","2023","Logisch","00","Ja","2024-11-07T00:00:00.000","2020-09-12T00:00:00.000","2015-11-02T00:00:00.000","2015-11-02T00:00:00.000",,,,,,,,,,,"144",,,,,,,,,,"D",,,,,,,"https://opendata.rdw.nl/resource/3huj-srit.json","https://opendata.rdw.nl/resource/8ys7-d773.json","https://opendata.rdw.nl/resource/vezc-m2t6.json","https://opendata.rdw.nl/resource/jhie-znh9.json","https://opendata.rdw.nl/resource/kmfi-hrps.json"
"HH961K","Personenauto","MINI","CLUBMAN COOPER D","20240727","20210731","5884","stationwagen","5","GRIJS","ZWART","4","1995","1335","1945","1435","695","1300","20151103","20151103","Geen verstrekking in Open Data","40992","Ja",,,,,,,"4","4","0","0",,"425","180","M1",,,"in motorruimte r.","1945","UKL-L",,"e1*2007/46*0371*20","LR91","6A1500C0","0","0.08","267","Nee","Nee",,"Nee","3320","0","0.00","2024","Logisch","00","Ja","2024-07-27T00:00:00.000","2021-07-31T00:00:00.000","2015-11-03T00:00:00.000","2015-11-03T00:00:00.000",,,,,,,,,,,"144",,,,,,,,,,"D",,,,,,,"https://opendata.rdw.nl/resource/3huj-srit.json","https://opendata.rdw.nl/resource/8ys7-d773.json","https://opendata.rdw.nl/resource/vezc-m2t6.json","https://opendata.rdw.nl/resource/jhie-znh9.json","https://opendata.rdw.nl/resource/kmfi-hrps.json"
"HJ189P","Personenauto","MINI","CLUBMAN COOPER D","20250311","20210317","6633","stationwagen","5","BLAUW","ZWART","4","1995","1335","1945","1435","695","1300","20151113","20151113","Geen verstrekking in Open Data","46000","Ja",,,,,,,"4","4","0","0",,"425","180","M1",,,"in motorruimte r.","1945","UKL-L",,"e1*2007/46*0371*20","LR91","6A2500C0","0","0.08","267","Nee","Nee",,"Nee","3320","0","0.00","2024","Logisch","00","Ja","2025-03-11T00:00:00.000","2021-03-17T00:00:00.000","2015-11-13T00:00:00.000","2015-11-13T00:00:00.000",,,,,,,,,,,"144",,,,,,,,,,"D",,,,,,,"https://opendata.rdw.nl/resource/3huj-srit.json","https://opendata.rdw.nl/resource/8ys7-d773.json","https://opendata.rdw.nl/resource/vezc-m2t6.json","https://opendata.rdw.nl/resource/jhie-znh9.json","https://opendata.rdw.nl/resource/kmfi-hrps.json"
"HJ743F","Personenauto","MINI","CLUBMAN COOPER D","20250328","20240420","6633","stationwagen","5","GRIJS","ZWART","4","1995","1295","1910","1395","695","1300","20151109","20151109","Geen verstrekking in Open Data","42542","Ja",,,,,,,"4","4","0","0",,"425","180","M1",,,"in motorruimte r.","1910","UKL-L",,"e1*2007/46*0371*20","LR91","6H2500C0","0","0.08","267","Nee","Nee",,"Nee","3285","0","0.00","2024","Logisch","00","Ja","2025-03-28T00:00:00.000","2024-04-20T00:00:00.000","2015-11-09T00:00:00.000","2015-11-09T00:00:00.000",,,,,,,,,,,"144",,,,,,,,,,"D",,,,,,,"https://opendata.rdw.nl/resource/3huj-srit.json","https://opendata.rdw.nl/resource/8ys7-d773.json","https://opendata.rdw.nl/resource/vezc-m2t6.json","https://opendata.rdw.nl/resource/jhie-znh9.json","https://opendata.rdw.nl/resource/kmfi-hrps.json"
"HJ967V","Personenauto","MINI","CLUBMAN COOPER D","20241118","20181009","5884","stationwagen","5","GRIJS","ZWART","4","1995","1295","1910","1395","695","1300","20151118","20151118","Geen verstrekking in Open Data","36309","Ja",,,,,,,"4","4","0","0",,"425","180","M1",,,"in motorruimte r.","1910","UKL-L",,"e1*2007/46*0371*20","LR91","6H1500C0","0","0.08","267","Nee","Nee",,"Nee","3285","0","0.00","2023","Logisch","00","Ja","2024-11-18T00:00:00.000","2018-10-09T00:00:00.000","2015-11-18T00:00:00.000","2015-11-18T00:00:00.000",,,,,,,,,,,"144",,,,,,,,,,"D",,,,,,,"https://opendata.rdw.nl/resource/3huj-srit.json","https://opendata.rdw.nl/resource/8ys7-d773.json","https://opendata.rdw.nl/resource/vezc-m2t6.json","https://opendata.rdw.nl/resource/jhie-znh9.json","https://opendata.rdw.nl/resource/kmfi-hrps.json"
"HK090K","Personenauto","MINI","CLUBMAN COOPER D","20241125","20180316","5884","stationwagen","5","GRIJS","ZWART","4","1995","1295","1910","1395","695","1300","20151125","20151125","Geen verstrekking in Open Data","40444","Ja",,,,,,,"4","4","0","0",,"425","180","M1",,,"in motorruimte r.","1910","UKL-L",,"e1*2007/46*0371*20","LR91","6H1500C0","0","0.08","267","Nee","Nee",,"Nee","3285","0","0.00","2023","Logisch","00","Ja","2024-11-25T00:00:00.000","2018-03-16T00:00:00.000","2015-11-25T00:00:00.000","2015-11-25T00:00:00.000",,,,,,,,,,,"144",,,,,,,,,,"D",,,,,,,"https://opendata.rdw.nl/resource/3huj-srit.json","https://opendata.rdw.nl/resource/8ys7-d773.json","https://opendata.rdw.nl/resource/vezc-m2t6.json","https://opendata.rdw.nl/resource/jhie-znh9.json","https://opendata.rdw.nl/resource/kmfi-hrps.json"
"HK092K","Personenauto","MINI","CLUBMAN COOPER D","20250109","20231228","5884","stationwagen","5","ZWART","Niet geregistreerd","4","1995","1335","1945","1435","695","1300","20151118","20151118","Geen verstrekking in Open Data","38091","Ja",,,,,,,"4","4","0","0",,"425","180","M1",,,"in motorruimte r.","1945","UKL-L",,"e1*2007/46*0371*20","LR91","6A1500C0","0","0.08","267","Nee","Nee",,"Nee","3320","0","0.00","2023","Logisch","00","Ja","2025-01-09T00:00:00.000","2023-12-28T00:00:00.000","2015-11-18T00:00:00.000","2015-11-18T00:00:00.000",,,,,,,,,,,"144",,,,,,,,,,"D",,,,,,,"https://opendata.rdw.nl/resource/3huj-srit.json","https://opendata.rdw.nl/resource/8ys7-d773.json","https://opendata.rdw.nl/resource/vezc-m2t6.json","https://opendata.rdw.nl/resource/jhie-znh9.json","https://opendata.rdw.nl/resource/kmfi-hrps.json"
"HK277S","Personenauto","MINI","CLUBMAN COOPER D","20241204","20161231","5884","stationwagen","5","GRIJS","ZWART","4","1995","1335","1945","1435","695","1300","20151121","20151121","Geen verstrekking in Open Data","40693","Ja",,,,,,,"4","4","0","0",,"425","180","M1",,,"in motorruimte r.","1945","UKL-L",,"e1*2007/46*0371*20","LR91","6A1500C0","0","0.08","267","Nee","Nee",,"Nee","3320","0","0.00","2023","Logisch","00","Ja","2024-12-04T00:00:00.000","2016-12-31T00:00:00.000","2015-11-21T00:00:00.000","2015-11-21T00:00:00.000",,,,,,,,,,,"144",,,,,,,,,,"D",,,,,,,"https://opendata.rdw.nl/resource/3huj-srit.json","https://opendata.rdw.nl/resource/8ys7-d773.json","https://opendata.rdw.nl/resource/vezc-m2t6.json","https://opendata.rdw.nl/resource/jhie-znh9.json","https://opendata.rdw.nl/resource/kmfi-hrps.json"
"HK584N","Personenauto","MINI","CLUBMAN COOPER D","20241120","20220913","7029","stationwagen","5","ZWART","Niet geregistreerd","4","1995","1295","1910","1395","695","1300","20151120","20151120","Geen verstrekking in Open Data","46701","Ja",,,,,,,"4","4","0","0",,"425","180","M1",,,"in motorruimte r.","1910","UKL-L",,"e1*2007/46*0371*20","LR91","6H3500C0","0","0.08","267","Nee","Nee",,"Nee","3285","0","0.00","2024","Logisch","00","Ja","2024-11-20T00:00:00.000","2022-09-13T00:00:00.000","2015-11-20T00:00:00.000","2015-11-20T00:00:00.000",,,,,,,,,,,"144",,,,,,,,,,"D",,,,,,,"https://opendata.rdw.nl/resource/3huj-srit.json","https://opendata.rdw.nl/resource/8ys7-d773.json","https://opendata.rdw.nl/resource/vezc-m2t6.json","https://opendata.rdw.nl/resource/jhie-znh9.json","https://opendata.rdw.nl/resource/kmfi-hrps.json"
"HK585N","Personenauto","MINI","CLUBMAN COOPER D","20241124","20210107","5884","stationwagen","5","ZWART","GRIJS","4","1995","1335","1945","1435","695","1300","20151119","20151119","Geen verstrekking in Open Data","45615","Ja",,,,,,,"4","4","0","0",,"425","180","M1",,,"in motorruimte r.","1945","UKL-L",,"e1*2007/46*0371*20","LR91","6A1500C0","0","0.08","267","Nee","Nee",,"Nee","3320","0","0.00","2023","Logisch","00","Ja","2024-11-24T00:00:00.000","2021-01-07T00:00:00.000","2015-11-19T00:00:00.000","2015-11-19T00:00:00.000",,,,,,,,,,,"144",,,,,,,,,,"D",,,,,,,"https://opendata.rdw.nl/resource/3huj-srit.json","https://opendata.rdw.nl/resource/8ys7-d773.json","https://opendata.rdw.nl/resource/vezc-m2t6.json","https://opendata.rdw.nl/resource/jhie-znh9.json","https://opendata.rdw.nl/resource/kmfi-hrps.json"
"HK923T","Personenauto","MINI","CLUBMAN COOPER D","20241124","20220216","5884","stationwagen","5","GRIJS","ZWART","4","1995","1335","1945","1435","695","1300","20151124","20151124","Geen verstrekking in Open Data","36359","Ja",,,,,,,"4","4","0","0",,"425","180","M1",,,"in motorruimte r.","1945","UKL-L",,"e1*2007/46*0371*20","LR91","6A1500C0","0","0.08","267","Nee","Nee",,"Nee","3320","0","0.00","2023","Logisch","00","Ja","2024-11-24T00:00:00.000","2022-02-16T00:00:00.000","2015-11-24T00:00:00.000","2015-11-24T00:00:00.000",,,,,,,,,,,"144",,,,,,,,,,"D",,,,,,,"https://opendata.rdw.nl/resource/3huj-srit.json","https://opendata.rdw.nl/resource/8ys7-d773.json","https://opendata.rdw.nl/resource/vezc-m2t6.json","https://opendata.rdw.nl/resource/jhie-znh9.json","https://opendata.rdw.nl/resource/kmfi-hrps.json"
"HK930T","Personenauto","MINI","CLUBMAN COOPER D","20240919","20200312","5884","stationwagen","5","ZWART","Niet geregistreerd","4","1995","1295","1910","1395","695","1300","20151125","20151125","Geen verstrekking in Open Data","41657","Ja",,,,,,,"4","4","0","0",,"425","180","M1",,,"in motorruimte r.","1910","UKL-L",,"e1*2007/46*0371*20","LR91","6H1500C0","0","0.08","267","Nee","Nee",,"Nee","3285","0","0.00","2023","Logisch","00","Ja","2024-09-19T00:00:00.000","2020-03-12T00:00:00.000","2015-11-25T00:00:00.000","2015-11-25T00:00:00.000",,,,,,,,,,,"144",,,,,,,,,,"D",,,,,,,"https://opendata.rdw.nl/resource/3huj-srit.json","https://opendata.rdw.nl/resource/8ys7-d773.json","https://opendata.rdw.nl/resource/vezc-m2t6.json","https://opendata.rdw.nl/resource/jhie-znh9.json","https://opendata.rdw.nl/resource/kmfi-hrps.json"