"kenteken","voertuigsoort","merk","handelsbenaming","vervaldatum_apk","datum_tenaamstelling","bruto_bpm","inrichting","aantal_zitplaatsen","eerste_kleur","tweede_kleur","aantal_cilinders","cilinderinhoud","massa_ledig_voertuig","toegestane_maximum_massa_voertuig","massa_rijklaar","maximum_massa_trekken_ongeremd","maximum_trekken_massa_geremd","datum_eerste_toelating","datum_eerste_tenaamstelling_in_nederland","wacht_op_keuren","catalogusprijs","wam_verzekerd","maximale_constructiesnelheid","laadvermogen","oplegger_geremd","aanhangwagen_autonoom_geremd","aanhangwagen_middenas_geremd","aantal_staanplaatsen","aantal_deuren","aantal_wielen","afstand_hart_koppeling_tot_achterzijde_voertuig","afstand_voorzijde_voertuig_tot_hart_koppeling","afwijkende_maximum_snelheid","lengte","breedte","europese_voertuigcategorie","europese_voertuigcategorie_toevoeging","europese_uitvoeringcategorie_toevoeging","plaats_chassisnummer","technische_max_massa_voertuig","type","type_gasinstallatie","typegoedkeuringsnummer","variant","uitvoering","volgnummer_wijziging_eu_typegoedkeuring","vermogen_massarijklaar","wielbasis","export_indicator","openstaande_terugroepactie_indicator","vervaldatum_tachograaf","taxi_indicator","maximum_massa_samenstelling","aantal_rolstoelplaatsen","maximum_ondersteunende_snelheid","jaar_laatste_registratie_tellerstand","tellerstandoordeel","code_toelichting_tellerstandoordeel","tenaamstellen_mogelijk","vervaldatum_apk_dt","datum_tenaamstelling_dt","datum_eerste_toelating_dt","datum_eerste_tenaamstelling_in_nederland_dt","vervaldatum_tachograaf_dt","maximum_last_onder_de_vooras_sen_tezamen_koppeling","type_remsysteem_voertuig_code","rupsonderstelconfiguratiecode","wielbasis_voertuig_minimum","wielbasis_voertuig_maximum","lengte_voertuig_minimum","lengte_voertuig_maximum","breedte_voertuig_minimum","breedte_voertuig_maximum","hoogte_voertuig","hoogte_voertuig_minimum","hoogte_voertuig_maximum","massa_bedrijfsklaar_minimaal","massa_bedrijfsklaar_maximaal","technisch_toelaatbaar_massa_koppelpunt","maximum_massa_technisch_maximaal","maximum_massa_technisch_minimaal","subcategorie_nederland","verticale_belasting_koppelpunt_getrokken_voertuig","zuinigheidsclassificatie","registratie_datum_goedkeuring_afschrijvingsmoment_bpm","registratie_datum_goedkeuring_afschrijvingsmoment_bpm_dt","gem_lading_wrde","aerodyn_voorz","massa_alt_aandr","verl_cab_ind","api_gekentekende_voertuigen_assen","api_gekentekende_voertuigen_brandstof","api_gekentekende_voertuigen_carrosserie","api_gekentekende_voertuigen_carrosserie_specifiek","api_gekentekende_voertuigen_voertuigklasse"
"3ZFK16","Personenauto","MERCEDES-BENZ","CLS 350 BLUETEC","20250102","20180804","13090","stationwagen","5","GRIJS","Niet geregistreerd","6","2987","1835","2460","1935","750","2100","20150102","20150102","Geen verstrekking in Open Data","103611","Ja",,,,,,,"5","4","0","0",,"0","0","M1",,,"r. voorzitting","2460","218",,"e1*2007/46*0485*12","G2BFP0","CZCCB501","0","0.10","287","Nee","Nee",,"Nee","4660","0","0.00","2023","Logisch","00","Ja","2025-01-02T00:00:00.000","2018-08-04T00:00:00.000","2015-01-02T00:00:00.000","2015-01-02T00:00:00.000",,,,,,,,,,,,,,,,,,,,,"D",,,,,,,"https://opendata.rdw.nl/resource/3huj-srit.json","https://opendata.rdw.nl/resource/8ys7-d773.json","https://opendata.rdw.nl/resource/vezc-m2t6.json","https://opendata.rdw.nl/resource/jhie-znh9.json","https://opendata.rdw.nl/resource/kmfi-hrps.json"
"5ZNT81","Personenauto","MERCEDES-BENZ","CLS 350 BLUETEC 4MATIC","20240819","20240515","21393","stationwagen","5","WIT","Niet geregistreerd","6","2987","1895","2520","1995","750","2100","20150212","20150212","Geen verstrekking in Open Data","128750","Nee",,,,,,,"5","4","0","0",,"0","0","M1",,,"r. voorzitting","2520","218",,"e1*2007/46*0485*12","G2BDP1","NZCCB521","0","0.09","287","Nee","Nee",,"Nee","4720","0","0.00","2024","Logisch","00","Ja","2024-08-19T00:00:00.000","2024-05-15T00:00:00.000","2015-02-12T00:00:00.000","2015-02-12T00:00:00.000",,,,,,,,,,,,,,,,,,,,,"F",,,,,,,"https://opendata.rdw.nl/resource/3huj-srit.json","https://opendata.rdw.nl/resource/8ys7-d773.json","https://opendata.rdw.nl/resource/vezc-m2t6.json","https://opendata.rdw.nl/resource/jhie-znh9.json","https://opendata.rdw.nl/resource/kmfi-hrps.json"
"7ZSB47","Personenauto","MERCEDES-BENZ","CLS 350 BLUETEC","20240610","20151130","13761","stationwagen","5","GRIJS","Niet geregistreerd","6","2987","1835","2460","1935","750","2100","20150312","20150312","Geen verstrekking in Open Data","109768","Ja",,,,,,,"5","4",,,,,,"M1",,,"r. voorzitting","2460","218",,,,,,"0.10","287","Nee","Nee",,"Nee","4660",,,"2023","Logisch","00","Ja","2024-06-10T00:00:00.000","2015-11-30T00:00:00.000","2015-03-12T00:00:00.000","2015-03-12T00:00:00.000",,,,,,,,,,,,,,,,,,,,,"D",,,,,,,"https://opendata.rdw.nl/resource/3huj-srit.json","https://opendata.rdw.nl/resource/8ys7-d773.json","https://opendata.rdw.nl/resource/vezc-m2t6.json","https://opendata.rdw.nl/resource/jhie-znh9.json","https://opendata.rdw.nl/resource/kmfi-hrps.json"
"GD715F","Personenauto","MERCEDES-BENZ","CLS 350 BLUETEC","20240622","20190109","13761","stationwagen","5","BLAUW","Niet geregistreerd","6","2987","1835","2460","1935","750","2100","20150421","20150421","Geen verstrekking in Open Data","101292","Ja",,,,,,,"5","4","0","0",,"0","0","M1",,,"r. voorzitting","2460","218",,"e1*2007/46*0485*12","G2BFP0","CZCCB521","0","0.10","287","Nee","Nee",,"Nee","4660","0","0.00","2023","Logisch","00","Ja","2024-06-22T00:00:00.000","2019-01-09T00:00:00.000","2015-04-21T00:00:00.000","2015-04-21T00:00:00.000",,,,,,,,,,,,,,,,,,,,,"D",,,,,,,"https://opendata.rdw.nl/resource/3huj-srit.json","https://opendata.rdw.nl/resource/8ys7-d773.json","https://opendata.rdw.nl/resource/vezc-m2t6.json","https://opendata.rdw.nl/resource/jhie-znh9.json","https://opendata.rdw.nl/resource/kmfi-hrps.json"
"GD717F","Personenauto","MERCEDES-BENZ","CLS 350 BLUETEC","20250430","20160916","13761","stationwagen","5","BLAUW","Niet geregistreerd","6","2987","1835","2460","1935","750","2100","20150420","20150420","Geen verstrekking in Open Data","105061","Ja",,,,,,,"5","4","0","0",,"0","0","M1",,,"r. voorzitting","2460","218",,"e1*2007/46*0485*12","G2BFP0","CZCCB501","0","0.10","287","Nee","Nee",,"Nee","4660","0","0.00","2024","Logisch","00","Ja","2025-04-30T00:00:00.000","2016-09-16T00:00:00.000","2015-04-20T00:00:00.000","2015-04-20T00:00:00.000",,,,,,,,,,,,,,,,,,,,,"D",,,,,,,"https://opendata.rdw.nl/resource/3huj-srit.json","https://opendata.rdw.nl/resource/8ys7-d773.json","https://opendata.rdw.nl/resource/vezc-m2t6.json","https://opendata.rdw.nl/resource/jhie-znh9.json","https://opendata.rdw.nl/resource/kmfi-hrps.json"
"GH556S","Personenauto","MERCEDES-BENZ","CLS 350 BLUETEC","20241022","20161014","13761","stationwagen","5","BLAUW","Niet geregistreerd","6","2987","1835","2460","1935","750","2100","20151006","20151006","Geen verstrekking in Open Data","101292","Ja",,,,,,,"5","4","0","0",,"0","0","M1",,,"r. voorzitting","2460","218",,"e1*2007/46*0485*12","G2BFP0","CZCCB521","0","0.10","287","Nee","Nee",,"Nee","4660","0","0.00","2023","Logisch","00","Ja","2024-10-22T00:00:00.000","2016-10-14T00:00:00.000","2015-10-06T00:00:00.000","2015-10-06T00:00:00.000",,,,,,,,,,,,,,,,,,,,,"D",,,,,,,"https://opendata.rdw.nl/resource/3huj-srit.json","https://opendata.rdw.nl/resource/8ys7-d773.json","https://opendata.rdw.nl/resource/vezc-m2t6.json","https://opendata.rdw.nl/resource/jhie-znh9.json","https://opendata.rdw.nl/resource/kmfi-hrps.json"
"GH683N","Personenauto","MERCEDES-BENZ","CLS 350 BLUETEC","20241127","20231028","13761","stationwagen","5","GRIJS","Niet geregistreerd","6","2987","1835","2460","1935","750","2100","20150528","20150528","Geen verstrekking in Open Data","101292","Ja",,,,,,,"5","4","0","0",,"0","0","M1",,,"r. voorzitting","2460","218",,"e1*2007/46*0485*12","G2BFP0","CZCCB521","0","0.10","287","Nee","Nee",,"Nee","4660","0","0.00","2023","Logisch","00","Ja","2024-11-27T00:00:00.000","2023-10-28T00:00:00.000","2015-05-28T00:00:00.000","2015-05-28T00:00:00.000",,,,,,,,,,,,,,,,,,,,,"D",,,,,,,"https://opendata.rdw.nl/resource/3huj-srit.json","https://opendata.rdw.nl/resource/8ys7-d773.json","https://opendata.rdw.nl/resource/vezc-m2t6.json","https://opendata.rdw.nl/resource/jhie-znh9.json","https://opendata.rdw.nl/resource/kmfi-hrps.json"
"GH901J","Personenauto","MERCEDES-BENZ","CLS 350 BLUETEC","20240628","20220609","13761","stationwagen","5","ZWART","Niet geregistreerd","6","2987","1835","2460","1935","750","2100","20150528","20150528","Geen verstrekking in Open Data","101292","Ja",,,,,,,"5","4","0","0",,"0","0","M1",,,"r. voorzitting","2460","218",,"e1*2007/46*0485*12","G2BFP0","CZCCB521","0","0.10","287","Nee","Nee",,"Nee","4660","0","0.00","2023","Logisch","00","Ja","2024-06-28T00:00:00.000","2022-06-09T00:00:00.000","2015-05-28T00:00:00.000","2015-05-28T00:00:00.000",,,,,,,,,,,,,,,,,,,,,"D",,,,,,,"https://opendata.rdw.nl/resource/3huj-srit.json","https://opendata.rdw.nl/resource/8ys7-d773.json","https://opendata.rdw.nl/resource/vezc-m2t6.json","https://opendata.rdw.nl/resource/jhie-znh9.json","https://opendata.rdw.nl/resource/kmfi-hrps.json"
"GK957V","Personenauto","MERCEDES-BENZ","CLS 350 BLUETEC","20240706","20170201","13761","stationwagen","5","GRIJS","Niet geregistreerd","6","2987","1835","2460","1935","750","2100","20150625","20150625","Geen verstrekking in Open Data","105061","Ja",,,,,,,"5","4","0","0",,"0","0","M1",,,"r. voorzitting","2460","218",,"e1*2007/46*0485*12","G2BFP0","CZCCB501","0","0.10","287","Nee","Nee",,"Nee","4660","0","0.00","2023","Logisch","00","Ja","2024-07-06T00:00:00.000","2017-02-01T00:00:00.000","2015-06-25T00:00:00.000","2015-06-25T00:00:00.000",,,,,,,,,,,,,,,,,,,,,"D",,,,,,,"https://opendata.rdw.nl/resource/3huj-srit.json","https://opendata.rdw.nl/resource/8ys7-d773.json","https://opendata.rdw.nl/resource/vezc-m2t6.json","https://opendata.rdw.nl/resource/jhie-znh9.json","https://opendata.rdw.nl/resource/kmfi-hrps.json"
"GL488K","Personenauto","MERCEDES-BENZ","CLS 350 BLUETEC 4MATIC","20250311","20210202","15170","stationwagen","5","ZWART","Niet geregistreerd","6","2987","1895","2520","1995","750","2100","20150216","20150629","Geen verstrekking in Open Data","115766","Ja",,,,,,,"4","4","0","0",,"0","0","M1",,,"r. voorzitting","2520","218",,"e1*2007/46*0485*12","G2BDP1","NZCCB521","0","0.09","287","Nee","Nee",,"Nee","4720","0","0.00","2024","Geen oordeel","05","Ja","2025-03-11T00:00:00.000","2021-02-02T00:00:00.000","2015-02-16T00:00:00.000","2015-06-29T00:00:00.000",,,,,,,,,,,,,,,,,,,,,"F",,,,,,,"https://opendata.rdw.nl/resource/3huj-srit.json","https://opendata.rdw.nl/resource/8ys7-d773.json","https://opendata.rdw.nl/resource/vezc-m2t6.json","https://opendata.rdw.nl/resource/jhie-znh9.json","https://opendata.rdw.nl/resource/kmfi-hrps.json"
"GL580J","Personenauto","MERCEDES-BENZ","CLS 350 BLUETEC","20250318","20231004","13090","stationwagen","5","ZWART","Niet geregistreerd","6","2987","1835","2460","1935","750","2100","20150630","20150630","Geen verstrekking in Open Data","70696","Ja",,,,,,,"5","4","0","0",,"0","0","M1",,,"r. voorzitting","2460","218",,"e1*2007/46*0485*12","G2BFP0","CZCCB521","0","0.10","287","Nee","Nee",,"Nee","4660","0","0.00","2024","Logisch","00","Ja","2025-03-18T00:00:00.000","2023-10-04T00:00:00.000","2015-06-30T00:00:00.000","2015-06-30T00:00:00.000",,,,,,,,,,,,,,,,,,,,,"D",,,,,,,"https://opendata.rdw.nl/resource/3huj-srit.json","https://opendata.rdw.nl/resource/8ys7-d773.json","https://opendata.rdw.nl/resource/vezc-m2t6.json","https://opendata.rdw.nl/resource/jhie-znh9.json","https://opendata.rdw.nl/resource/kmfi-hrps.json"
"J494FH","Personenauto","MERCEDES-BENZ","CLS 350 BLUETEC","20240715","20200710","8901","stationwagen","5","GRIJS","Niet geregistreerd","6","2987","1835","2460","1935","750","2100","20140926","20200710","Geen verstrekking in Open Data","94953","Ja","245",,,,,,"5","4","0","0",,"0","188","M1",,,,"2460","218",,"e1*2007/46*0485*12","G2BFP0","CZCCB521","0","0.10","287","Nee","Nee",,"Nee","4660","0","0.00","2023","Geen oordeel","05","Ja","2024-07-15T00:00:00.000","2020-07-10T00:00:00.000","2014-09-26T00:00:00.000","2020-07-10T00:00:00.000",,,,,,,,,,,,,,,,,,,,,"D",,,,,,,"https://opendata.rdw.nl/resource/3huj-srit.json","https://opendata.rdw.nl/resource/8ys7-d773.json","https://opendata.rdw.nl/resource/vezc-m2t6.json","https://opendata.rdw.nl/resource/jhie-znh9.json","https://opendata.rdw.nl/resource/kmfi-hrps.json"
"JG119P","Personenauto","MERCEDES-BENZ","CLS 350 BLUETEC 4MATIC","20240620","20220726","15748","stationwagen","5","GRIJS","Niet geregistreerd","6","2987","1895","2520","1995","750","2100","20150317","20170117","Geen verstrekking in Open Data","106807","Ja",,,,,,,"4","4","0","0",,"0","0","M1",,,"r. voorzitting","2520","218",,"e1*2007/46*0485*13","G2BDP1","NZCCB524","0","0.09","287","Nee","Nee",,"Nee","4720","0","0.00","2023","Geen oordeel","05","Ja","2024-06-20T00:00:00.000","2022-07-26T00:00:00.000","2015-03-17T00:00:00.000","2017-01-17T00:00:00.000",,,,,,,,,,,,,,,,,,,,,"F",,,,,,,"https://opendata.rdw.nl/resource/3huj-srit.json","https://opendata.rdw.nl/resource/8ys7-d773.json","https://opendata.rdw.nl/resource/vezc-m2t6.json","https://opendata.rdw.nl/resource/jhie-znh9.json","https://opendata.rdw.nl/resource/kmfi-hrps.json"
"JG400G","Personenauto","MERCEDES-BENZ","CLS 350 BLUETEC","20250403","20190322","14931","stationwagen","5","ZWART","Niet geregistreerd","6","2987","1835","2460","1935","750","2100","20160309","20160309","Geen verstrekking in Open Data","106231","Ja",,,,,,,"5","4","0","0",,"498","188","M1",,,"onder r. voorzitting","2460","218",,"e1*2007/46*0485*12","G2BFP0","CZCCB501","0","0.10","287","Nee","Nee",,"Nee","4660","0","0.00","2024","Logisch","00","Ja","2025-04-03T00:00:00.000","2019-03-22T00:00:00.000","2016-03-09T00:00:00.000","2016-03-09T00:00:00.000",,,,,,,,,,,"143",,,,,,,,,,"E",,,,,,,"https://opendata.rdw.nl/resource/3huj-srit.json","https://opendata.rdw.nl/resource/8ys7-d773.json","https://opendata.rdw.nl/resource/vezc-m2t6.json","https://opendata.rdw.nl/resource/jhie-znh9.json","https://opendata.rdw.nl/resource/kmfi-hrps.json"
"JG801N","Personenauto","MERCEDES-BENZ","CLS 350 BLUETEC 4MATIC","20230610","20220104","15738","stationwagen","5","ZWART","Niet geregistreerd","6","2987","1895","2520","1995","750","2100","20150323","20161014","Geen verstrekking in Open Data","107086","Ja",,,,,,,"4","4","0","0",,"0","0","M1",,,"r. voorzitting","2520","218",,"e1*2007/46*0485*13","G2BDP1","NZCCB524","0","0.09","287","Nee","Nee",,"Nee","4720","0","0.00","2022","Geen oordeel","05","Ja","2023-06-10T00:00:00.000","2022-01-04T00:00:00.000","2015-03-23T00:00:00.000","2016-10-14T00:00:00.000",,,,,,,,,,,,,,,,,,,,,"F",,,,,,,"https://opendata.rdw.nl/resource/3huj-srit.json","https://opendata.rdw.nl/resource/8ys7-d773.json","https://opendata.rdw.nl/resource/vezc-m2t6.json","https://opendata.rdw.nl/resource/jhie-znh9.json","https://opendata.rdw.nl/resource/kmfi-hrps.json"
"JN320X","Personenauto","MERCEDES-BENZ","CLS 350 BLUETEC","20241222","20231222","14089","stationwagen","5","GRIJS","Niet geregistreerd","6","2987","1835","2460","1935","750","2100","20160512","20160512","Geen verstrekking in Open Data","102189","Ja",,,,,,,"5","4","0","0",,"498","188","M1",,,"onder r. voorzitting","2460","218",,"e1*2007/46*0485*13","G2BFP0","CZCCB522","0","0.10","287","Nee","Nee",,"Nee","4660","0","0.00","2023","Logisch","00","Ja","2024-12-22T00:00:00.000","2023-12-22T00:00:00.000","2016-05-12T00:00:00.000","2016-05-12T00:00:00.000",,,,,,,,,,,"143",,,,,,,,,,"D",,,,,,,"https://opendata.rdw.nl/resource/3huj-srit.json","https://opendata.rdw.nl/resource/8ys7-d773.json","https://opendata.rdw.nl/resource/vezc-m2t6.json","https://opendata.rdw.nl/resource/jhie-znh9.json","https://opendata.rdw.nl/resource/kmfi-hrps.json"
"JX332R","Personenauto","MERCEDES-BENZ","CLS 350 BLUETEC","20250318","20200429","9223","stationwagen","5","ZWART","Niet geregistreerd","6","2987","1835","2460","1935","750","2100","20150421","20160701","Geen verstrekking in Open Data","97378","Ja",,,,,,,"5","4","0","0",,"0","0","M1",,,"r. voorzitting","2460","218",,"e1*2007/46*0485*13","G2BFP0","CZCCB524","0","0.10","287","Nee","Nee",,"Nee","4660","0","0.00","2024","Geen oordeel","05","Ja","2025-03-18T00:00:00.000","2020-04-29T00:00:00.000","2015-04-21T00:00:00.000","2016-07-01T00:00:00.000",,,,,,,,,,,,,,,,,,,,,"D",,,,,,,"https://opendata.rdw.nl/resource/3huj-srit.json","https://opendata.rdw.nl/resource/8ys7-d773.json","https://opendata.rdw.nl/resource/vezc-m2t6.json","https://opendata.rdw.nl/resource/jhie-znh9.json","https://opendata.rdw.nl/resource/kmfi-hrps.json"
"K869RD","Personenauto","MERCEDES-BENZ","CLS 350 BLUETEC","20241015","20211015","3470","stationwagen","5","GRIJS","Niet geregistreerd","6","2987","1835","2460","1935","750","2100","20150216","20211015","Geen verstrekking in Open Data","111831","Ja","245",,,,,,"5","4","0","0",,"0","188","M1",,,,"2460","218",,"e1*2007/46*0485*12","G2BFP0","CZCCB521","0","0.10","287","Nee","Nee",,"Nee","4660","0","0.00","2023","Geen oordeel","05","Ja","2024-10-15T00:00:00.000","2021-10-15T00:00:00.000","2015-02-16T00:00:00.000","2021-10-15T00:00:00.000",,,,,,,,,,,,,,,,,,,,,"D",,,,,,,"https://opendata.rdw.nl/resource/3huj-srit.json","https://opendata.rdw.nl/resource/8ys7-d773.json","https://opendata.rdw.nl/resource/vezc-m2t6.json","https://opendata.rdw.nl/resource/jhie-znh9.json","https://opendata.rdw.nl/resource/kmfi-hrps.json"
"KG069B","Personenauto","MERCEDES-BENZ","CLS 350 BLUETEC","20250508","20160822","13761","stationwagen","5","ZWART","Niet geregistreerd","6","2987","1835","2460","1935","750","2100","20150508","20160822","Geen verstrekking in Open Data","90650","Ja",,,,,,,"5","4","0","0",,"0","0","M1",,,"r. voorzitting","2460","218",,"e1*2007/46*0485*13","G2BFP0","CZCCB524","0","0.10","287","Nee","Nee",,"Nee","4660","0","0.00","2024","Geen oordeel","05","Ja","2025-05-08T00:00:00.000","2016-08-22T00:00:00.000","2015-05-08T00:00:00.000","2016-08-22T00:00:00.000",,,,,,,,,,,,,,,,,,,,,"D",,,,,,,"https://opendata.rdw.nl/resource/3huj-srit.json","https://opendata.rdw.nl/resource/8ys7-d773.json","https://opendata.rdw.nl/resource/vezc-m2t6.json","https://opendata.rdw.nl/resource/jhie-znh9.json","https://opendata.rdw.nl/resource/kmfi-hrps.json"
"L599FD","Personenauto","MERCEDES-BENZ","CLS 350 BLUETEC 4MATIC","20240517","20240302","4936","stationwagen","5","ZWART","Niet geregistreerd","6","2987","1895","2520","1995","750","2100","20150811","20210428","Geen verstrekking in Open Data","106352","Ja","240",,,,,,"4","4",,,,,"188","M1",,,"r. voorzitting","2520","218",,,,,,"0.09","287","Nee","Nee",,"Nee","4720",,,"2023","Geen oordeel","05","Ja","2024-05-17T00:00:00.000","2024-03-02T00:00:00.000","2015-08-11T00:00:00.000","2021-04-28T00:00:00.000",,,,,,,,,,,,,,,,,,,,,,,,,,,,"https://opendata.rdw.nl/resource/3huj-srit.json","https://opendata.rdw.nl/resource/8ys7-d773.json","https://opendata.rdw.nl/resource/vezc-m2t6.json","https://opendata.rdw.nl/resource/jhie-znh9.json","https://opendata.rdw.nl/resource/kmfi-hrps.json"
"RD090S","Personenauto","MERCEDES-BENZ","CLS 350 BLUETEC 4MATIC","20241124","20201126","3733","stationwagen","5","GRIJS","Niet geregistreerd","6","2987","1895","2520","1995","750","2100","20160129","20171217","Geen verstrekking in Open Data","109916","Ja",,,,,,,"4","4","0","0",,"0","0","M1",,,"r. voorzitting","2520","218",,"e1*2007/46*0485*13","G2BDP1","NZCCB524","0","0.09","287","Nee","Nee",,"Nee","4720","0","0.00","2023","Geen oordeel","05","Ja","2024-11-24T00:00:00.000","2020-11-26T00:00:00.000","2016-01-29T00:00:00.000","2017-12-17T00:00:00.000",,,,,,,,,,,,,,,,,,,,,"G",,,,,,,"https://opendata.rdw.nl/resource/3huj-srit.json","https://opendata.rdw.nl/resource/8ys7-d773.json","https://opendata.rdw.nl/resource/vezc-m2t6.json","https://opendata.rdw.nl/resource/jhie-znh9.json","https://opendata.rdw.nl/resource/kmfi-hrps.json"
"S068ZX","Personenauto","MERCEDES-BENZ","CLS 350 BLUETEC 4MATIC","20240630","20230608","5023","stationwagen","5","ZWART","Niet geregistreerd","6","2987","1895","2520","1995","750","2100","20150413","20230608","Geen verstrekking in Open Data","100860","Ja","240",,,,,,"4","4","0","0",,"0","188","M1",,,,"2520","218",,"e1*2007/46*0485*13","G2BDP1","NZCCB524","0","0.09","287","Nee","Nee",,"Nee","4720","0","0.00","2024","Geen oordeel","05","Ja","2024-06-30T00:00:00.000","2023-06-08T00:00:00.000","2015-04-13T00:00:00.000","2023-06-08T00:00:00.000",,,,,,,,,,,,,,,,,,,,,,"20230411","2023-04-11T00:00:00.000",,,,,"https://opendata.rdw.nl/resource/3huj-srit.json","https://opendata.rdw.nl/resource/8ys7-d773.json","https://opendata.rdw.nl/resource/vezc-m2t6.json","https://opendata.rdw.nl/resource/jhie-znh9.json","https://opendata.rdw.nl/resource/kmfi-hrps.json"
"T264GX","Personenauto","MERCEDES-BENZ","CLS 350 BLUETEC 4MATIC","20240622","20230612","19191","stationwagen","5","GRIJS","Niet geregistreerd","6","2987","1895","2520","1995","750","2100","20141203","20230612","Geen verstrekking in Open Data","106747","Ja","240",,,,,,"5","4","0","0",,"0","188","M1",,,"r. voorzitting","2520","218",,"e1*2007/46*0485*12","G2BDP1","NZCCB521","0","0.09","287","Nee","Nee",,"Nee","4720","0","0.00","2024","Geen oordeel","05","Ja","2024-06-22T00:00:00.000","2023-06-12T00:00:00.000","2014-12-03T00:00:00.000","2023-06-12T00:00:00.000",,,,,,,,,,,,,,,,,,,,,,"20230608","2023-06-08T00:00:00.000",,,,,"https://opendata.rdw.nl/resource/3huj-srit.json","https://opendata.rdw.nl/resource/8ys7-d773.json","https://opendata.rdw.nl/resource/vezc-m2t6.json","https://opendata.rdw.nl/resource/jhie-znh9.json","https://opendata.rdw.nl/resource/kmfi-hrps.json"
"TB026D","Personenauto","MERCEDES-BENZ","CLS 350 BLUETEC","20240629","20210921","7731","stationwagen","5","GRIJS","Niet geregistreerd","6","2987","1835","2460","1935","750","2100","20150126","20180629","Geen verstrekking in Open Data","106498","Ja",,,,,,,"5","4","0","0",,"0","0","M1",,,,"2460","218",,"e1*2007/46*0485*12","G2BFP0","CZCCB521","0","0.10","287","Nee","Nee",,"Nee","4660","0","0.00","2023","Geen oordeel","05","Ja","2024-06-29T00:00:00.000","2021-09-21T00:00:00.000","2015-01-26T00:00:00.000","2018-06-29T00:00:00.000",,,,,,,,,,,,,,,,,,,,,"D",,,,,,,"https://opendata.rdw.nl/resource/3huj-srit.json","https://opendata.rdw.nl/resource/8ys7-d773.json","https://opendata.rdw.nl/resource/vezc-m2t6.json","https://opendata.rdw.nl/resource/jhie-znh9.json","https://opendata.rdw.nl/resource/kmfi-hrps.json"
"XP435V","Personenauto","MERCEDES-BENZ","CLS 350 BLUETEC 4MATIC","20240904","20200905","15323","stationwagen","5","GRIJS","Niet geregistreerd","6","2987","1895","2520","1995","750","2100","20150410","20190228","Geen verstrekking in Open Data","96570","Ja",,,,,,,"4","4","0","0",,"0","0","M1",,,,"2520","218",,"e1*2007/46*0485*13","G2BDP1","NZCCB504","0","0.09","287","Nee","Nee",,"Nee","4720","0","0.00","2024","Geen oordeel","05","Ja","2024-09-04T00:00:00.000","2020-09-05T00:00:00.000","2015-04-10T00:00:00.000","2019-02-28T00:00:00.000",,,,,,,,,,,,,,,,,,,,,"F",,,,,,,"https://opendata.rdw.nl/resource/3huj-srit.json","https://opendata.rdw.nl/resource/8ys7-d773.json","https://opendata.rdw.nl/resource/vezc-m2t6.json","https://opendata.rdw.nl/resource/jhie-znh9.json","https://opendata.rdw.nl/resource/kmfi-hrps.json"
