"kenteken","voertuigsoort","merk","handelsbenaming","vervaldatum_apk","datum_tenaamstelling","bruto_bpm","inrichting","aantal_zitplaatsen","eerste_kleur","tweede_kleur","aantal_cilinders","cilinderinhoud","massa_ledig_voertuig","toegestane_maximum_massa_voertuig","massa_rijklaar","maximum_massa_trekken_ongeremd","maximum_trekken_massa_geremd","datum_eerste_toelating","datum_eerste_tenaamstelling_in_nederland","wacht_op_keuren","catalogusprijs","wam_verzekerd","maximale_constructiesnelheid","laadvermogen","oplegger_geremd","aanhangwagen_autonoom_geremd","aanhangwagen_middenas_geremd","aantal_staanplaatsen","aantal_deuren","aantal_wielen","afstand_hart_koppeling_tot_achterzijde_voertuig","afstand_voorzijde_voertuig_tot_hart_koppeling","afwijkende_maximum_snelheid","lengte","breedte","europese_voertuigcategorie","europese_voertuigcategorie_toevoeging","europese_uitvoeringcategorie_toevoeging","plaats_chassisnummer","technische_max_massa_voertuig","type","type_gasinstallatie","typegoedkeuringsnummer","variant","uitvoering","volgnummer_wijziging_eu_typegoedkeuring","vermogen_massarijklaar","wielbasis","export_indicator","openstaande_terugroepactie_indicator","vervaldatum_tachograaf","taxi_indicator","maximum_massa_samenstelling","aantal_rolstoelplaatsen","maximum_ondersteunende_snelheid","jaar_laatste_registratie_tellerstand","tellerstandoordeel","code_toelichting_tellerstandoordeel","tenaamstellen_mogelijk","vervaldatum_apk_dt","datum_tenaamstelling_dt","datum_eerste_toelating_dt","datum_eerste_tenaamstelling_in_nederland_dt","vervaldatum_tachograaf_dt","maximum_last_onder_de_vooras_sen_tezamen_koppeling","type_remsysteem_voertuig_code","rupsonderstelconfiguratiecode","wielbasis_voertuig_minimum","wielbasis_voertuig_maximum","lengte_voertuig_minimum","lengte_voertuig_maximum","breedte_voertuig_minimum","breedte_voertuig_maximum","hoogte_voertuig","hoogte_voertuig_minimum","hoogte_voertuig_maximum","massa_bedrijfsklaar_minimaal","massa_bedrijfsklaar_maximaal","technisch_toelaatbaar_massa_koppelpunt","maximum_massa_technisch_maximaal","maximum_massa_technisch_minimaal","subcategorie_nederland","verticale_belasting_koppelpunt_getrokken_voertuig","zuinigheidsclassificatie","registratie_datum_goedkeuring_afschrijvingsmoment_bpm","registratie_datum_goedkeuring_afschrijvingsmoment_bpm_dt","gem_lading_wrde","aerodyn_voorz","massa_alt_aandr","verl_cab_ind","api_gekentekende_voertuigen_assen","api_gekentekende_voertuigen_brandstof","api_gekentekende_voertuigen_carrosserie","api_gekentekende_voertuigen_carrosserie_specifiek","api_gekentekende_voertuigen_voertuigklasse"
"G139LT","Personenauto","MERCEDES-BENZ","CLA 200 D","20250412","20191028","6125","stationwagen","5","ROOD","Niet geregistreerd","4","2143","1455","2050","1555","750","1500","20180315","20191028","Geen verstrekking in Open Data","54381","Ja","215",,,,,,"5","4","0","0",,"0","178","M1",,,,"2050","245 G",,"e1*2001/116*0470*18","22S1P2","MZBA1504","0","0.06","270","Nee","Ja",,"Nee","3590","0","0.00","2024","Geen oordeel","05","Ja","2025-04-12T00:00:00.000","2019-10-28T00:00:00.000","2018-03-15T00:00:00.000","2019-10-28T00:00:00.000",,,,,,,,,,,,,,,,,,,,,"E",,,,,,,"https://opendata.rdw.nl/resource/3huj-srit.json","https://opendata.rdw.nl/resource/8ys7-d773.json","https://opendata.rdw.nl/resource/vezc-m2t6.json","https://opendata.rdw.nl/resource/jhie-znh9.json","https://opendata.rdw.nl/resource/kmfi-hrps.json"
"G144SF","Personenauto","MERCEDES-BENZ","CLA 200 D","20240622","20200526","6183","stationwagen","5","BLAUW","Niet geregistreerd","4","2143","1455","2050","1555","750","1500","20180622","20200526","Geen verstrekking in Open Data","44909","Ja","215",,,,,,"5","4","0","0",,"0","178","M1",,,,"2050","245 G",,"e1*2001/116*0470*18","22S1P2","MZBA1502","0","0.06","270","Nee","Nee",,"Nee","3590","0","0.00","2023","Geen oordeel","05","Ja","2024-06-22T00:00:00.000","2020-05-26T00:00:00.000","2018-06-22T00:00:00.000","2020-05-26T00:00:00.000",,,,,,,,,,,,,,,,,,,,,"D",,,,,,,"https://opendata.rdw.nl/resource/3huj-srit.json","https://opendata.rdw.nl/resource/8ys7-d773.json","https://opendata.rdw.nl/resource/vezc-m2t6.json","https://opendata.rdw.nl/resource/jhie-znh9.json","https://opendata.rdw.nl/resource/kmfi-hrps.json"
"G263DP","Personenauto","MERCEDES-BENZ","CLA 200 D","20250427","20190830","5881","stationwagen","5","GRIJS","Niet geregistreerd","4","2143","1455","2050","1555","750","1500","20160427","20190830","Geen verstrekking in Open Data","52041","Ja","215",,,,,,"5","4","0","0",,"0","178","M1",,,,"2050","245 G",,"e1*2001/116*0470*15","22S1P2","MZAAA502","0","0.06","270","Nee","Nee",,"Nee","3590","0","0.00","2024","Geen oordeel","05","Ja","2025-04-27T00:00:00.000","2019-08-30T00:00:00.000","2016-04-27T00:00:00.000","2019-08-30T00:00:00.000",,,,,,,,,,,,,,,,,,,,,"D",,,,,,,"https://opendata.rdw.nl/resource/3huj-srit.json","https://opendata.rdw.nl/resource/8ys7-d773.json","https://opendata.rdw.nl/resource/vezc-m2t6.json","https://opendata.rdw.nl/resource/jhie-znh9.json","https://opendata.rdw.nl/resource/kmfi-hrps.json"
"G446KJ","Personenauto","MERCEDES-BENZ","CLA 200 D","20240823","20200307","799","stationwagen","5","ZWART","Niet geregistreerd","4","2143","1455","2050","1555","750","1500","20180821","20200307","Geen verstrekking in Open Data","45818","Ja","215",,,,,,"5","4","0","0",,"0","178","M1",,,,"2050","245 G",,"e1*2001/116*0470*22","22S1P2","MZBA150B","0","0.06","270","Nee","Nee",,"Nee","3590","0","0.00","2023","Geen oordeel","05","Ja","2024-08-23T00:00:00.000","2020-03-07T00:00:00.000","2018-08-21T00:00:00.000","2020-03-07T00:00:00.000",,,,,,,,,,,,,,,,,,,,,,,,,,,,"https://opendata.rdw.nl/resource/3huj-srit.json","https://opendata.rdw.nl/resource/8ys7-d773.json","https://opendata.rdw.nl/resource/vezc-m2t6.json","https://opendata.rdw.nl/resource/jhie-znh9.json","https://opendata.rdw.nl/resource/kmfi-hrps.json"
"G666KR","Personenauto","MERCEDES-BENZ","CLA 200 D","20250104","20240323","895","stationwagen","5","GRIJS","Niet geregistreerd","4","2143","1455","2050","1555","750","1500","20180104","20191014","Geen verstrekking in Open Data","49229","Ja","215",,,,,,"5","4","0","0",,"0","178","M1",,,"r. dwarsbalk by voorzitting","2050","245 G",,"e1*2001/116*0470*18","22S1P2","MZBA1502","0","0.06","270","Nee","Nee",,"Nee","3590","0","0.00","2024","Geen oordeel","05","Ja","2025-01-04T00:00:00.000","2024-03-23T00:00:00.000","2018-01-04T00:00:00.000","2019-10-14T00:00:00.000",,,,,,,,,,,,,,,,,,,,,"D",,,,,,,"https://opendata.rdw.nl/resource/3huj-srit.json","https://opendata.rdw.nl/resource/8ys7-d773.json","https://opendata.rdw.nl/resource/vezc-m2t6.json","https://opendata.rdw.nl/resource/jhie-znh9.json","https://opendata.rdw.nl/resource/kmfi-hrps.json"
"G782PT","Personenauto","MERCEDES-BENZ","CLA 200 D","20241112","20191112","9117","stationwagen","5","GRIJS","Niet geregistreerd","4","1950","1470","2120","1570","750","1600","20191112","20191112","Geen verstrekking in Open Data","48684","Ja","221",,,,,,"5","4","0","0",,"470","186","M1",,,,"2120","F2CLA",,"e1*2007/46*1912*03","321CT2","HZAA150A","0","0.07","273","Nee","Nee",,"Nee","3765","0","0.00","2024","Logisch","00","Ja","2024-11-12T00:00:00.000","2019-11-12T00:00:00.000","2019-11-12T00:00:00.000","2019-11-12T00:00:00.000",,,,,,,,,,,"144",,,,,,,,,,,,,,,,,"https://opendata.rdw.nl/resource/3huj-srit.json","https://opendata.rdw.nl/resource/8ys7-d773.json","https://opendata.rdw.nl/resource/vezc-m2t6.json","https://opendata.rdw.nl/resource/jhie-znh9.json","https://opendata.rdw.nl/resource/kmfi-hrps.json"
"G922ST","Personenauto","MERCEDES-BENZ","CLA 200 D","20241130","20191122","4886","stationwagen","5","WIT","Niet geregistreerd","4","2143","1430","2050","1530","750","1500","20160818","20191122","Geen verstrekking in Open Data","56752","Ja","215",,,,,,"5","4","0","0",,"0","178","M1",,,,"2050","245 G",,"e1*2001/116*0470*16","22S1P2","WZBZ1502","0","0.07","270","Nee","Ja",,"Nee","3565","0","0.00","2023","Geen oordeel","05","Ja","2024-11-30T00:00:00.000","2019-11-22T00:00:00.000","2016-08-18T00:00:00.000","2019-11-22T00:00:00.000",,,,,,,,,,,,,,,,,,,,,"E",,,,,,,"https://opendata.rdw.nl/resource/3huj-srit.json","https://opendata.rdw.nl/resource/8ys7-d773.json","https://opendata.rdw.nl/resource/vezc-m2t6.json","https://opendata.rdw.nl/resource/jhie-znh9.json","https://opendata.rdw.nl/resource/kmfi-hrps.json"
"G952VS","Personenauto","MERCEDES-BENZ","CLA 200 D","20250408","20200108","9117","stationwagen","5","GRIJS","Niet geregistreerd","4","1950","1470","2120","1570","750","1600","20200108","20200108","Geen verstrekking in Open Data","62453","Ja","221",,,,,,"5","4","0","0",,"470","186","M1",,,,"2120","F2CLA",,"e1*2007/46*1912*04","321CT2","HZAA154A","0","0.07","273","Nee","Nee",,"Nee","3765","0","0.00","2024","Logisch","00","Ja","2025-04-08T00:00:00.000","2020-01-08T00:00:00.000","2020-01-08T00:00:00.000","2020-01-08T00:00:00.000",,,,,,,,,,,"144",,,,,,,,,,"C",,,,,,,"https://opendata.rdw.nl/resource/3huj-srit.json","https://opendata.rdw.nl/resource/8ys7-d773.json","https://opendata.rdw.nl/resource/vezc-m2t6.json","https://opendata.rdw.nl/resource/jhie-znh9.json","https://opendata.rdw.nl/resource/kmfi-hrps.json"
"GZ333K","Personenauto","MERCEDES-BENZ","CLA 200 D","20241129","20150918","5419","stationwagen","5","GRIJS","Niet geregistreerd","4","2143","1455","2050","1555","750","1500","20150918","20150918","Geen verstrekking in Open Data","51822","Ja",,,,,,,"5","4","0","0",,"0","0","M1",,,"by dwarsbalk r. voorzitting","2050","245 G",,"e1*2001/116*0470*15","22S1P2","MZAAA502","0","0.06","270","Nee","Nee",,"Nee","3590","0","0.00","2024","Logisch","00","Ja","2024-11-29T00:00:00.000","2015-09-18T00:00:00.000","2015-09-18T00:00:00.000","2015-09-18T00:00:00.000",,,,,,,,,,,,,,,,,,,,,"C",,,,,,,"https://opendata.rdw.nl/resource/3huj-srit.json","https://opendata.rdw.nl/resource/8ys7-d773.json","https://opendata.rdw.nl/resource/vezc-m2t6.json","https://opendata.rdw.nl/resource/jhie-znh9.json","https://opendata.rdw.nl/resource/kmfi-hrps.json"
"H058TT","Personenauto","MERCEDES-BENZ","CLA 200 D","20250327","20200528","9330","stationwagen","5","ZWART","Niet geregistreerd","4","1950","1470","2120","1570","750","1600","20200528","20200528","Geen verstrekking in Open Data","55104","Ja","221",,,,,,"5","4","0","0",,"470","186","M1",,,,"2120","F2CLA",,"e1*2007/46*1912*06","321CT2","HZAA054A","0","0.07","273","Nee","Nee",,"Nee","3765","0","0.00","2024","Logisch","00","Ja","2025-03-27T00:00:00.000","2020-05-28T00:00:00.000","2020-05-28T00:00:00.000","2020-05-28T00:00:00.000",,,,,,,,,,,"144",,,,,,,,,,"B",,,,,,,"https://opendata.rdw.nl/resource/3huj-srit.json","https://opendata.rdw.nl/resource/8ys7-d773.json","https://opendata.rdw.nl/resource/vezc-m2t6.json","https://opendata.rdw.nl/resource/jhie-znh9.json","https://opendata.rdw.nl/resource/kmfi-hrps.json"
"H140NF","Personenauto","MERCEDES-BENZ","CLA 200 D","20250506","20200319","6705","stationwagen","5","ZWART","Niet geregistreerd","4","1950","1470","2120","1570","750","1600","20190829","20200319","Geen verstrekking in Open Data","50261","Ja","221",,,,,,"5","4","0","0",,"0","0","M1",,,,"2120","F2CLA",,"e1*2007/46*1912*02","321CT2","HZAA154A","0","0.07","273","Nee","Nee",,"Nee","3765","0","0.00","2024","Geen oordeel","05","Ja","2025-05-06T00:00:00.000","2020-03-19T00:00:00.000","2019-08-29T00:00:00.000","2020-03-19T00:00:00.000",,,,,,,,,,,,,,,,,,,,,,,,,,,,"https://opendata.rdw.nl/resource/3huj-srit.json","https://opendata.rdw.nl/resource/8ys7-d773.json","https://opendata.rdw.nl/resource/vezc-m2t6.json","https://opendata.rdw.nl/resource/jhie-znh9.json","https://opendata.rdw.nl/resource/kmfi-hrps.json"
"H335KB","Personenauto","MERCEDES-BENZ","CLA 200 D","20250227","20200227","10862","stationwagen","5","GRIJS","Niet geregistreerd","4","1950","1470","2120","1570","750","1600","20200227","20200227","Geen verstrekking in Open Data","63134","Ja","221",,,,,,"5","4","0","0",,"470","186","M1",,,,"2120","F2CLA",,"e1*2007/46*1912*05","321CT2","HZAA154A","0","0.07","273","Nee","Nee",,"Nee","3765","0","0.00","2024","Logisch","00","Ja","2025-02-27T00:00:00.000","2020-02-27T00:00:00.000","2020-02-27T00:00:00.000","2020-02-27T00:00:00.000",,,,,,,,,,,"144",,,,,,,,,,"C",,,,,,,"https://opendata.rdw.nl/resource/3huj-srit.json","https://opendata.rdw.nl/resource/8ys7-d773.json","https://opendata.rdw.nl/resource/vezc-m2t6.json","https://opendata.rdw.nl/resource/jhie-znh9.json","https://opendata.rdw.nl/resource/kmfi-hrps.json"
"H449FP","Personenauto","MERCEDES-BENZ","CLA 200 D 4MATIC","20250204","20220413","3399","stationwagen","5","ZWART","Niet geregistreerd","4","2143","1515","2100","1615","750","1500","20161012","20200203","Geen verstrekking in Open Data","54990","Ja","212",,,,,,"5","4","0","0",,"0","178","M1",,,,"2100","245 G",,"e1*2001/116*0470*16","22S1P1","MZBZ1502","0","0.06","270","Nee","Ja",,"Nee","3650","0","0.00","2024","Geen oordeel","05","Ja","2025-02-04T00:00:00.000","2022-04-13T00:00:00.000","2016-10-12T00:00:00.000","2020-02-03T00:00:00.000",,,,,,,,,,,,,,,,,,,,,"F",,,,,,,"https://opendata.rdw.nl/resource/3huj-srit.json","https://opendata.rdw.nl/resource/8ys7-d773.json","https://opendata.rdw.nl/resource/vezc-m2t6.json","https://opendata.rdw.nl/resource/jhie-znh9.json","https://opendata.rdw.nl/resource/kmfi-hrps.json"
"H678PF","Personenauto","MERCEDES-BENZ","CLA 200 D","20250325","20200325","10862","stationwagen","5","GRIJS","Niet geregistreerd","4","1950","1470","2120","1570","750","1600","20200325","20200325","Geen verstrekking in Open Data","59322","Ja","221",,,,,,"5","4","0","0",,"470","186","M1",,,,"2120","F2CLA",,"e1*2007/46*1912*06","321CT2","HZAA054A","0","0.07","273","Nee","Nee",,"Nee","3765","0","0.00","2024","Logisch","00","Ja","2025-03-25T00:00:00.000","2020-03-25T00:00:00.000","2020-03-25T00:00:00.000","2020-03-25T00:00:00.000",,,,,,,,,,,"144",,,,,,,,,,"C",,,,,,,"https://opendata.rdw.nl/resource/3huj-srit.json","https://opendata.rdw.nl/resource/8ys7-d773.json","https://opendata.rdw.nl/resource/vezc-m2t6.json","https://opendata.rdw.nl/resource/jhie-znh9.json","https://opendata.rdw.nl/resource/kmfi-hrps.json"
"H683RS","Personenauto","MERCEDES-BENZ","CLA 200 D","20250412","20200418","3860","stationwagen","5","ZWART","Niet geregistreerd","4","2143","1455","2050","1555","750","1500","20161214","20200418","Geen verstrekking in Open Data","51248","Ja","215",,,,,,"5","4","0","0",,"0","178","M1",,,"by dwarsbalk r. voorzitting","2050","245 G",,"e1*2001/116*0470*16","22S1P2","MZBA1502","0","0.06","270","Nee","Ja",,"Nee","3590","0","0.00","2024","Geen oordeel","05","Ja","2025-04-12T00:00:00.000","2020-04-18T00:00:00.000","2016-12-14T00:00:00.000","2020-04-18T00:00:00.000",,,,,,,,,,,,,,,,,,,,,"D",,,,,,,"https://opendata.rdw.nl/resource/3huj-srit.json","https://opendata.rdw.nl/resource/8ys7-d773.json","https://opendata.rdw.nl/resource/vezc-m2t6.json","https://opendata.rdw.nl/resource/jhie-znh9.json","https://opendata.rdw.nl/resource/kmfi-hrps.json"
"H790KP","Personenauto","MERCEDES-BENZ","CLA 200 D","20250321","20231121","5289","stationwagen","5","GRIJS","Niet geregistreerd","4","2143","1455","2050","1555","750","1500","20160211","20200627","Geen verstrekking in Open Data","53726","Ja","215",,,,,,"5","4","0","0",,"0","178","M1",,,,"2050","245 G",,"e1*2001/116*0470*15","22S1P2","MZAAA502","0","0.06","270","Nee","Nee",,"Nee","3590","0","0.00","2024","Geen oordeel","05","Ja","2025-03-21T00:00:00.000","2023-11-21T00:00:00.000","2016-02-11T00:00:00.000","2020-06-27T00:00:00.000",,,,,,,,,,,,,,,,,,,,,"D",,,,,,,"https://opendata.rdw.nl/resource/3huj-srit.json","https://opendata.rdw.nl/resource/8ys7-d773.json","https://opendata.rdw.nl/resource/vezc-m2t6.json","https://opendata.rdw.nl/resource/jhie-znh9.json","https://opendata.rdw.nl/resource/kmfi-hrps.json"
"H842NB","Personenauto","MERCEDES-BENZ","CLA 200 D","20250427","20210313","2529","stationwagen","5","WIT","Niet geregistreerd","4","2143","1430","2050","1530","750","1500","20160427","20200306","Geen verstrekking in Open Data","49332","Ja","215",,,,,,"5","4","0","0",,"0","178","M1",,,,"2050","245 G",,"e1*2001/116*0470*15","22S1P2","WZAAA502","0","0.07","270","Nee","Nee",,"Nee","3565","0","0.00","2024","Geen oordeel","05","Ja","2025-04-27T00:00:00.000","2021-03-13T00:00:00.000","2016-04-27T00:00:00.000","2020-03-06T00:00:00.000",,,,,,,,,,,,,,,,,,,,,"E",,,,,,,"https://opendata.rdw.nl/resource/3huj-srit.json","https://opendata.rdw.nl/resource/8ys7-d773.json","https://opendata.rdw.nl/resource/vezc-m2t6.json","https://opendata.rdw.nl/resource/jhie-znh9.json","https://opendata.rdw.nl/resource/kmfi-hrps.json"
"H948XL","Personenauto","MERCEDES-BENZ","CLA 200 D","20250415","20200618","9330","stationwagen","5","GRIJS","Niet geregistreerd","4","1950","1470","2120","1570","750","1600","20200618","20200618","Geen verstrekking in Open Data","54015","Ja","221",,,,,,"5","4","0","0",,"470","186","M1",,,,"2120","F2CLA",,"e1*2007/46*1912*06","321CT2","HZAA050A","0","0.07","273","Nee","Nee",,"Nee","3765","0","0.00","2024","Logisch","00","Ja","2025-04-15T00:00:00.000","2020-06-18T00:00:00.000","2020-06-18T00:00:00.000","2020-06-18T00:00:00.000",,,,,,,,,,,"144",,,,,,,,,,"B",,,,,,,"https://opendata.rdw.nl/resource/3huj-srit.json","https://opendata.rdw.nl/resource/8ys7-d773.json","https://opendata.rdw.nl/resource/vezc-m2t6.json","https://opendata.rdw.nl/resource/jhie-znh9.json","https://opendata.rdw.nl/resource/kmfi-hrps.json"
"HG820D","Personenauto","MERCEDES-BENZ","CLA 200 D","20241026","20200912","5419","stationwagen","5","GRIJS","Niet geregistreerd","4","2143","1455","2050","1555","750","1500","20151026","20151026","Geen verstrekking in Open Data","50733","Ja",,,,,,,"5","4","0","0",,"469","178","M1",,,"onder r. voorzitting","2050","245 G",,"e1*2001/116*0470*15","22S1P2","MZAAA502","0","0.06","270","Nee","Nee",,"Nee","3590","0","0.00","2023","Logisch","00","Ja","2024-10-26T00:00:00.000","2020-09-12T00:00:00.000","2015-10-26T00:00:00.000","2015-10-26T00:00:00.000",,,,,,,,,,,"146",,,,,,,,,,"C",,,,,,,"https://opendata.rdw.nl/resource/3huj-srit.json","https://opendata.rdw.nl/resource/8ys7-d773.json","https://opendata.rdw.nl/resource/vezc-m2t6.json","https://opendata.rdw.nl/resource/jhie-znh9.json","https://opendata.rdw.nl/resource/kmfi-hrps.json"
"HJ812D","Personenauto","MERCEDES-BENZ","CLA 200 D","20240808","20220523","4644","stationwagen","5","GRIJS","Niet geregistreerd","4","2143","1455","2050","1555","750","1500","20151111","20151111","Geen verstrekking in Open Data","42769","Ja",,,,,,,"5","4","0","0",,"469","178","M1",,,"onder r. voorzitting","2050","245 G",,"e1*2001/116*0470*15","22S1P2","MZAAA501","0","0.06","270","Nee","Nee",,"Ja","3590","0","0.00","2023","Logisch","00","Ja","2024-08-08T00:00:00.000","2022-05-23T00:00:00.000","2015-11-11T00:00:00.000","2015-11-11T00:00:00.000",,,,,,,,,,,"146",,,,,,,,,,"B","20220525","2022-05-25T00:00:00.000",,,,,"https://opendata.rdw.nl/resource/3huj-srit.json","https://opendata.rdw.nl/resource/8ys7-d773.json","https://opendata.rdw.nl/resource/vezc-m2t6.json","https://opendata.rdw.nl/resource/jhie-znh9.json","https://opendata.rdw.nl/resource/kmfi-hrps.json"
"HJ958T","Personenauto","MERCEDES-BENZ","CLA 200 D","20250202","20201229","5419","stationwagen","5","GRIJS","Niet geregistreerd","4","2143","1455","2050","1555","750","1500","20151120","20151120","Geen verstrekking in Open Data","51653","Ja",,,,,,,"5","4","0","0",,"469","178","M1",,,"onder r. voorzitting","2050","245 G",,"e1*2001/116*0470*15","22S1P2","MZAAA502","0","0.06","270","Nee","Nee",,"Nee","3590","0","0.00","2024","Logisch","00","Ja","2025-02-02T00:00:00.000","2020-12-29T00:00:00.000","2015-11-20T00:00:00.000","2015-11-20T00:00:00.000",,,,,,,,,,,"146",,,,,,,,,,"C",,,,,,,"https://opendata.rdw.nl/resource/3huj-srit.json","https://opendata.rdw.nl/resource/8ys7-d773.json","https://opendata.rdw.nl/resource/vezc-m2t6.json","https://opendata.rdw.nl/resource/jhie-znh9.json","https://opendata.rdw.nl/resource/kmfi-hrps.json"
"HN660V","Personenauto","MERCEDES-BENZ","CLA 200 D","20250302","20240417","5419","stationwagen","5","ZWART","Niet geregistreerd","4","2143","1455","2050","1555","750","1500","20151210","20151210","Geen verstrekking in Open Data","52427","Ja",,,,,,,"5","4","0","0",,"469","178","M1",,,"onder r. voorzitting","2050","245 G",,"e1*2001/116*0470*15","22S1P2","MZAAA502","0","0.06","270","Nee","Nee",,"Nee","3590","0","0.00","2024","Logisch","00","Ja","2025-03-02T00:00:00.000","2024-04-17T00:00:00.000","2015-12-10T00:00:00.000","2015-12-10T00:00:00.000",,,,,,,,,,,"146",,,,,,,,,,"C",,,,,,,"https://opendata.rdw.nl/resource/3huj-srit.json","https://opendata.rdw.nl/resource/8ys7-d773.json","https://opendata.rdw.nl/resource/vezc-m2t6.json","https://opendata.rdw.nl/resource/jhie-znh9.json","https://opendata.rdw.nl/resource/kmfi-hrps.json"
"HN699N","Personenauto","MERCEDES-BENZ","CLA 200 D","20241221","20221223","4644","stationwagen","5","GRIJS","Niet geregistreerd","4","2143","1455","2050","1555","750","1500","20151208","20151208","Geen verstrekking in Open Data","42769","Ja",,,,,,,"5","4","0","0",,"469","178","M1",,,"onder r. voorzitting","2050","245 G",,"e1*2001/116*0470*15","22S1P2","MZAAA501","0","0.06","270","Nee","Nee",,"Nee","3590","0","0.00","2024","Logisch","00","Ja","2024-12-21T00:00:00.000","2022-12-23T00:00:00.000","2015-12-08T00:00:00.000","2015-12-08T00:00:00.000",,,,,,,,,,,"146",,,,,,,,,,"B",,,,,,,"https://opendata.rdw.nl/resource/3huj-srit.json","https://opendata.rdw.nl/resource/8ys7-d773.json","https://opendata.rdw.nl/resource/vezc-m2t6.json","https://opendata.rdw.nl/resource/jhie-znh9.json","https://opendata.rdw.nl/resource/kmfi-hrps.json"
"HP858S","Personenauto","MERCEDES-BENZ","CLA 200 D","20240708","20210705","4644","stationwagen","5","PAARS","Niet geregistreerd","4","2143","1455","2050","1555","750","1500","20151217","20151217","Geen verstrekking in Open Data","42769","Ja",,,,,,,"5","4","0","0",,"469","178","M1",,,"onder r. voorzitting","2050","245 G",,"e1*2001/116*0470*15","22S1P2","MZAAA501","0","0.06","270","Nee","Nee",,"Nee","3590","0","0.00","2023","Logisch","00","Ja","2024-07-08T00:00:00.000","2021-07-05T00:00:00.000","2015-12-17T00:00:00.000","2015-12-17T00:00:00.000",,,,,,,,,,,"146",,,,,,,,,,"B",,,,,,,"https://opendata.rdw.nl/resource/3huj-srit.json","https://opendata.rdw.nl/resource/8ys7-d773.json","https://opendata.rdw.nl/resource/vezc-m2t6.json","https://opendata.rdw.nl/resource/jhie-znh9.json","https://opendata.rdw.nl/resource/kmfi-hrps.json"
"HS994N","Personenauto","MERCEDES-BENZ","CLA 200 D","20240708","20220514","4644","stationwagen","5","WIT","Niet geregistreerd","4","2143","1455","2050","1555","750","1500","20160106","20160106","Geen verstrekking in Open Data","41995","Ja",,,,,,,"5","4","0","0",,"469","178","M1",,,"onder r. voorzitting","2050","245 G",,"e1*2001/116*0470*15","22S1P2","MZAAA501","0","0.06","270","Nee","Nee",,"Nee","3590","0","0.00","2023","Logisch","00","Ja","2024-07-08T00:00:00.000","2022-05-14T00:00:00.000","2016-01-06T00:00:00.000","2016-01-06T00:00:00.000",,,,,,,,,,,"146",,,,,,,,,,"D",,,,,,,"https://opendata.rdw.nl/resource/3huj-srit.json","https://opendata.rdw.nl/resource/8ys7-d773.json","https://opendata.rdw.nl/resource/vezc-m2t6.json","https://opendata.rdw.nl/resource/jhie-znh9.json","https://opendata.rdw.nl/resource/kmfi-hrps.json"