"kenteken","voertuigsoort","merk","handelsbenaming","vervaldatum_apk","datum_tenaamstelling","bruto_bpm","inrichting","aantal_zitplaatsen","eerste_kleur","tweede_kleur","aantal_cilinders","cilinderinhoud","massa_ledig_voertuig","toegestane_maximum_massa_voertuig","massa_rijklaar","maximum_massa_trekken_ongeremd","maximum_trekken_massa_geremd","datum_eerste_toelating","datum_eerste_tenaamstelling_in_nederland","wacht_op_keuren","catalogusprijs","wam_verzekerd","maximale_constructiesnelheid","laadvermogen","oplegger_geremd","aanhangwagen_autonoom_geremd","aanhangwagen_middenas_geremd","aantal_staanplaatsen","aantal_deuren","aantal_wielen","afstand_hart_koppeling_tot_achterzijde_voertuig","afstand_voorzijde_voertuig_tot_hart_koppeling","afwijkende_maximum_snelheid","lengte","breedte","europese_voertuigcategorie","europese_voertuigcategorie_toevoeging","europese_uitvoeringcategorie_toevoeging","plaats_chassisnummer","technische_max_massa_voertuig","type","type_gasinstallatie","typegoedkeuringsnummer","variant","uitvoering","volgnummer_wijziging_eu_typegoedkeuring","vermogen_massarijklaar","wielbasis","export_indicator","openstaande_terugroepactie_indicator","vervaldatum_tachograaf","taxi_indicator","maximum_massa_samenstelling","aantal_rolstoelplaatsen","maximum_ondersteunende_snelheid","jaar_laatste_registratie_tellerstand","tellerstandoordeel","code_toelichting_tellerstandoordeel","tenaamstellen_mogelijk","vervaldatum_apk_dt","datum_tenaamstelling_dt","datum_eerste_toelating_dt","datum_eerste_tenaamstelling_in_nederland_dt","vervaldatum_tachograaf_dt","maximum_last_onder_de_vooras_sen_tezamen_koppeling","type_remsysteem_voertuig_code","rupsonderstelconfiguratiecode","wielbasis_voertuig_minimum","wielbasis_voertuig_maximum","lengte_voertuig_minimum","lengte_voertuig_maximum","breedte_voertuig_minimum","breedte_voertuig_maximum","hoogte_voertuig","hoogte_voertuig_minimum","hoogte_voertuig_maximum","massa_bedrijfsklaar_minimaal","massa_bedrijfsklaar_maximaal","technisch_toelaatbaar_massa_koppelpunt","maximum_massa_technisch_maximaal","maximum_massa_technisch_minimaal","subcategorie_nederland","verticale_belasting_koppelpunt_getrokken_voertuig","zuinigheidsclassificatie","registratie_datum_goedkeuring_afschrijvingsmoment_bpm","registratie_datum_goedkeuring_afschrijvingsmoment_bpm_dt","gem_lading_wrde","aerodyn_voorz","massa_alt_aandr","verl_cab_ind","api_gekentekende_voertuigen_assen","api_gekentekende_voertuigen_brandstof","api_gekentekende_voertuigen_carrosserie","api_gekentekende_voertuigen_carrosserie_specifiek","api_gekentekende_voertuigen_voertuigklasse"
"1ZNZ87","Personenauto","MERCEDES-BENZ","C 400 4MATIC","20250308","20220310","12973","sedan","5","ZWART","Niet geregistreerd","6","2996","1545","2210","1645","750","1800","20150224","20150224","Geen verstrekking in Open Data","80885","Ja",,,,,,,"4","4","0","0",,"0","0","M1",,,"op dwarsbalk v. r. voorzitting","2210","204",,"e1*2001/116*0431*34","R05EP1","NLAAB574","0","0.15","284","Nee","Nee",,"Nee","4075","0","0.00","2024","Logisch","00","Ja","2025-03-08T00:00:00.000","2022-03-10T00:00:00.000","2015-02-24T00:00:00.000","2015-02-24T00:00:00.000",,,,,,,,,,,,,,,,,,,,,"E",,,,,,,"https://opendata.rdw.nl/resource/3huj-srit.json","https://opendata.rdw.nl/resource/8ys7-d773.json","https://opendata.rdw.nl/resource/vezc-m2t6.json","https://opendata.rdw.nl/resource/jhie-znh9.json","https://opendata.rdw.nl/resource/kmfi-hrps.json"
"2ZSJ31","Personenauto","MERCEDES-BENZ","C 400 4MATIC","20250506","20220507","12973","sedan","5","WIT","Niet geregistreerd","6","2996","1545","2210","1645","750","1800","20150318","20150318","Geen verstrekking in Open Data","90075","Ja",,,,,,,"4","4","0","0",,"0","0","M1",,,"op dwarsbalk v. r. voorzitting","2210","204",,"e1*2001/116*0431*34","R05EP1","NLAAB574","0","0.15","284","Nee","Nee",,"Nee","4075","0","0.00","2024","Logisch","00","Ja","2025-05-06T00:00:00.000","2022-05-07T00:00:00.000","2015-03-18T00:00:00.000","2015-03-18T00:00:00.000",,,,,,,,,,,,,,,,,,,,,"E",,,,,,,"https://opendata.rdw.nl/resource/3huj-srit.json","https://opendata.rdw.nl/resource/8ys7-d773.json","https://opendata.rdw.nl/resource/vezc-m2t6.json","https://opendata.rdw.nl/resource/jhie-znh9.json","https://opendata.rdw.nl/resource/kmfi-hrps.json"
"5ZPR97","Personenauto","MERCEDES-BENZ","C 400 4MATIC","20250227","20190614","10369","sedan","5","BEIGE","Niet geregistreerd","6","2996","1545","2210","1645","750","1800","20150227","20150227","Geen verstrekking in Open Data","77392","Ja",,,,,,,"4","4","0","0",,"0","0","M1",,,"op dwarsbalk v. r. voorzitting","2210","204",,"e1*2001/116*0431*34","R05EP1","NLAAB531","0","0.15","284","Nee","Nee",,"Nee","4075","0","0.00","2024","Logisch","00","Ja","2025-02-27T00:00:00.000","2019-06-14T00:00:00.000","2015-02-27T00:00:00.000","2015-02-27T00:00:00.000",,,,,,,,,,,,,,,,,,,,,"D",,,,,,,"https://opendata.rdw.nl/resource/3huj-srit.json","https://opendata.rdw.nl/resource/8ys7-d773.json","https://opendata.rdw.nl/resource/vezc-m2t6.json","https://opendata.rdw.nl/resource/jhie-znh9.json","https://opendata.rdw.nl/resource/kmfi-hrps.json"
"5ZRV13","Personenauto","MERCEDES-BENZ","C 400 4MATIC","20241004","20200728","10369","sedan","5","GRIJS","Niet geregistreerd","6","2996","1545","2210","1645","750","1800","20150316","20150316","Geen verstrekking in Open Data","79890","Ja",,,,,,,"4","4","0","0",,"0","0","M1",,,"op dwarsbalk v. r. voorzitting","2210","204",,"e1*2001/116*0431*34","R05EP1","NLAAB531","0","0.15","284","Nee","Nee",,"Nee","4075","0","0.00","2023","Logisch","00","Ja","2024-10-04T00:00:00.000","2020-07-28T00:00:00.000","2015-03-16T00:00:00.000","2015-03-16T00:00:00.000",,,,,,,,,,,,,,,,,,,,,"D",,,,,,,"https://opendata.rdw.nl/resource/3huj-srit.json","https://opendata.rdw.nl/resource/8ys7-d773.json","https://opendata.rdw.nl/resource/vezc-m2t6.json","https://opendata.rdw.nl/resource/jhie-znh9.json","https://opendata.rdw.nl/resource/kmfi-hrps.json"
"5ZSK71","Personenauto","MERCEDES-BENZ","C 400 4MATIC","20250606","20240430","12105","sedan","5","ZWART","Niet geregistreerd","6","2996","1545","2210","1645","750","1800","20150313","20150313","Geen verstrekking in Open Data","86757","Ja",,,,,,,"4","4","0","0",,"0","0","M1",,,"op dwarsbalk v. r. voorzitting","2210","204",,"e1*2001/116*0431*34","R05EP1","NLAAB532","0","0.15","284","Nee","Nee",,"Nee","4075","0","0.00","2024","Logisch","00","Ja","2025-06-06T00:00:00.000","2024-04-30T00:00:00.000","2015-03-13T00:00:00.000","2015-03-13T00:00:00.000",,,,,,,,,,,,,,,,,,,,,"E",,,,,,,"https://opendata.rdw.nl/resource/3huj-srit.json","https://opendata.rdw.nl/resource/8ys7-d773.json","https://opendata.rdw.nl/resource/vezc-m2t6.json","https://opendata.rdw.nl/resource/jhie-znh9.json","https://opendata.rdw.nl/resource/kmfi-hrps.json"
"6ZPR11","Personenauto","MERCEDES-BENZ","C 400 4MATIC","20250405","20240405","12973","sedan","5","GRIJS","Niet geregistreerd","6","2996","1545","2210","1645","750","1800","20150304","20150304","Geen verstrekking in Open Data","81296","Ja",,,,,,,"4","4","0","0",,"0","0","M1",,,"op dwarsbalk v. r. voorzitting","2210","204",,"e1*2001/116*0431*34","R05EP1","NLAAB574","0","0.15","284","Nee","Nee",,"Nee","4075","0","0.00","2024","Logisch","00","Ja","2025-04-05T00:00:00.000","2024-04-05T00:00:00.000","2015-03-04T00:00:00.000","2015-03-04T00:00:00.000",,,,,,,,,,,,,,,,,,,,,"E",,,,,,,"https://opendata.rdw.nl/resource/3huj-srit.json","https://opendata.rdw.nl/resource/8ys7-d773.json","https://opendata.rdw.nl/resource/vezc-m2t6.json","https://opendata.rdw.nl/resource/jhie-znh9.json","https://opendata.rdw.nl/resource/kmfi-hrps.json"
"6ZTK51","Personenauto","MERCEDES-BENZ","C 400 4MATIC","20240609","20180608","12973","sedan","5","ZWART","Niet geregistreerd","6","2996","1545","2210","1645","750","1800","20150327","20150327","Geen verstrekking in Open Data","96506","Ja",,,,,,,"4","4","0","0",,"0","0","M1",,,"op dwarsbalk v. r. voorzitting","2210","204",,"e1*2001/116*0431*34","R05EP1","NLAAB574","0","0.15","284","Nee","Nee",,"Nee","4075","0","0.00","2023","Logisch","00","Ja","2024-06-09T00:00:00.000","2018-06-08T00:00:00.000","2015-03-27T00:00:00.000","2015-03-27T00:00:00.000",,,,,,,,,,,,,,,,,,,,,"E",,,,,,,"https://opendata.rdw.nl/resource/3huj-srit.json","https://opendata.rdw.nl/resource/8ys7-d773.json","https://opendata.rdw.nl/resource/vezc-m2t6.json","https://opendata.rdw.nl/resource/jhie-znh9.json","https://opendata.rdw.nl/resource/kmfi-hrps.json"
"7ZSB36","Personenauto","MERCEDES-BENZ","C 400 4MATIC","20250310","20160526","12105","sedan","5","BLAUW","Niet geregistreerd","6","2996","1545","2210","1645","750","1800","20150310","20150310","Geen verstrekking in Open Data","96975","Ja",,,,,,,"4","4","0","0",,"0","0","M1",,,"op dwarsbalk v. r. voorzitting","2210","204",,"e1*2001/116*0431*34","R05EP1","NLAAB532","0","0.15","284","Nee","Nee",,"Nee","4075","0","0.00","2024","Logisch","00","Ja","2025-03-10T00:00:00.000","2016-05-26T00:00:00.000","2015-03-10T00:00:00.000","2015-03-10T00:00:00.000",,,,,,,,,,,,,,,,,,,,,"E",,,,,,,"https://opendata.rdw.nl/resource/3huj-srit.json","https://opendata.rdw.nl/resource/8ys7-d773.json","https://opendata.rdw.nl/resource/vezc-m2t6.json","https://opendata.rdw.nl/resource/jhie-znh9.json","https://opendata.rdw.nl/resource/kmfi-hrps.json"
"7ZSB44","Personenauto","MERCEDES-BENZ","C 400 4MATIC","20250330","20150313","10369","sedan","5","GRIJS","Niet geregistreerd","6","2996","1545","2210","1645","750","1800","20150313","20150313","Geen verstrekking in Open Data","74016","Ja",,,,,,,"4","4","0","0",,"0","0","M1",,,"op dwarsbalk v. r. voorzitting","2210","204",,"e1*2001/116*0431*34","R05EP1","NLAAB531","0","0.15","284","Nee","Nee",,"Nee","4075","0","0.00","2024","Logisch","00","Ja","2025-03-30T00:00:00.000","2015-03-13T00:00:00.000","2015-03-13T00:00:00.000","2015-03-13T00:00:00.000",,,,,,,,,,,,,,,,,,,,,"D",,,,,,,"https://opendata.rdw.nl/resource/3huj-srit.json","https://opendata.rdw.nl/resource/8ys7-d773.json","https://opendata.rdw.nl/resource/vezc-m2t6.json","https://opendata.rdw.nl/resource/jhie-znh9.json","https://opendata.rdw.nl/resource/kmfi-hrps.json"
"8ZSG23","Personenauto","MERCEDES-BENZ","C 400 4MATIC","20240905","20230907","10369","sedan","5","BLAUW","Niet geregistreerd","6","2996","1545","2210","1645","750","1800","20150318","20150318","Geen verstrekking in Open Data","84270","Ja",,,,,,,"4","4","0","0",,"0","0","M1",,,"op dwarsbalk v. r. voorzitting","2210","204",,"e1*2001/116*0431*34","R05EP1","NLAAB531","0","0.15","284","Nee","Nee",,"Nee","4075","0","0.00","2023","Logisch","00","Ja","2024-09-05T00:00:00.000","2023-09-07T00:00:00.000","2015-03-18T00:00:00.000","2015-03-18T00:00:00.000",,,,,,,,,,,,,,,,,,,,,"D",,,,,,,"https://opendata.rdw.nl/resource/3huj-srit.json","https://opendata.rdw.nl/resource/8ys7-d773.json","https://opendata.rdw.nl/resource/vezc-m2t6.json","https://opendata.rdw.nl/resource/jhie-znh9.json","https://opendata.rdw.nl/resource/kmfi-hrps.json"
"G016JK","Personenauto","MERCEDES-BENZ","C 400 4MATIC","20251026","20191017","20370","sedan","5","BLAUW","Niet geregistreerd","6","2996","1575","2255","1675","750","1800","20191017","20191017","Geen verstrekking in Open Data","89860","Ja","250",,,,,,"4","4","0","0",,"476","184","M1",,,,"2255","204",,"e1*2001/116*0431*53","R05ET1","CLAZ057A","0","0.15","284","Nee","Nee",,"Nee","4125","0","0.00","2024","Logisch","00","Ja","2025-10-26T00:00:00.000","2019-10-17T00:00:00.000","2019-10-17T00:00:00.000","2019-10-17T00:00:00.000",,,,,,,,,,,"145",,,,,,,,,,,,,,,,,"https://opendata.rdw.nl/resource/3huj-srit.json","https://opendata.rdw.nl/resource/8ys7-d773.json","https://opendata.rdw.nl/resource/vezc-m2t6.json","https://opendata.rdw.nl/resource/jhie-znh9.json","https://opendata.rdw.nl/resource/kmfi-hrps.json"
"G118VD","Personenauto","MERCEDES-BENZ","C 400 4MATIC","20240924","20210928","4033","sedan","5","WIT","Niet geregistreerd","6","2996","1545","2210","1645","750","1800","20150415","20191203","Geen verstrekking in Open Data","84424","Ja","250",,,,,,"4","4",,,,,,"M1",,,"r. bodemplaat by voorzitting","2210","204",,"e1*2001/116*0431*35","R05EP1","NLAAA574","0","0.15","284","Nee","Nee",,"Nee","4075",,,"2023","Geen oordeel","05","Ja","2024-09-24T00:00:00.000","2021-09-28T00:00:00.000","2015-04-15T00:00:00.000","2019-12-03T00:00:00.000",,,,,,,,,,,,,,,,,,,,,"E",,,,,,,"https://opendata.rdw.nl/resource/3huj-srit.json","https://opendata.rdw.nl/resource/8ys7-d773.json","https://opendata.rdw.nl/resource/vezc-m2t6.json","https://opendata.rdw.nl/resource/jhie-znh9.json","https://opendata.rdw.nl/resource/kmfi-hrps.json"
"G863JH","Personenauto","MERCEDES-BENZ","C 400 4MATIC","20240801","20191002","9174","sedan","5","WIT","Niet geregistreerd","6","2996","1545","2210","1645","750","1800","20160606","20191002","Geen verstrekking in Open Data","80773","Ja","250",,,,,,"4","4",,,,,,"M1",,,,"2210","204",,"e1*2001/116*0431*38","R05EP1","NLAA0521","0","0.15","284","Nee","Nee",,"Nee","4075",,,"2022","Geen oordeel","05","Ja","2024-08-01T00:00:00.000","2019-10-02T00:00:00.000","2016-06-06T00:00:00.000","2019-10-02T00:00:00.000",,,,,,,,,,,,,,,,,,,,,"F",,,,,,,"https://opendata.rdw.nl/resource/3huj-srit.json","https://opendata.rdw.nl/resource/8ys7-d773.json","https://opendata.rdw.nl/resource/vezc-m2t6.json","https://opendata.rdw.nl/resource/jhie-znh9.json","https://opendata.rdw.nl/resource/kmfi-hrps.json"
"GD603L","Personenauto","MERCEDES-BENZ","C 400 4MATIC","20250422","20191230","12973","sedan","5","ZWART","Niet geregistreerd","6","2996","1545","2210","1645","750","1800","20150422","20150422","Geen verstrekking in Open Data","96258","Ja",,,,,,,"4","4","0","0",,"0","0","M1",,,"op dwarsbalk v. r. voorzitting","2210","204",,"e1*2001/116*0431*34","R05EP1","NLAAB574","0","0.15","284","Nee","Nee",,"Nee","4075","0","0.00","2024","Logisch","00","Ja","2025-04-22T00:00:00.000","2019-12-30T00:00:00.000","2015-04-22T00:00:00.000","2015-04-22T00:00:00.000",,,,,,,,,,,,,,,,,,,,,"E",,,,,,,"https://opendata.rdw.nl/resource/3huj-srit.json","https://opendata.rdw.nl/resource/8ys7-d773.json","https://opendata.rdw.nl/resource/vezc-m2t6.json","https://opendata.rdw.nl/resource/jhie-znh9.json","https://opendata.rdw.nl/resource/kmfi-hrps.json"
"GP255V","Personenauto","MERCEDES-BENZ","C 400 4MATIC","20250203","20200204","12105","sedan","5","BLAUW","Niet geregistreerd","6","2996","1545","2210","1645","750","1800","20150720","20150720","Geen verstrekking in Open Data","96706","Ja",,,,,,,"4","4","0","0",,"0","0","M1",,,"op dwarsbalk v. r. voorzitting","2210","204",,"e1*2001/116*0431*36","R05EP1","NLAAB532","0","0.15","284","Nee","Nee",,"Nee","4075","0","0.00","2024","Logisch","00","Ja","2025-02-03T00:00:00.000","2020-02-04T00:00:00.000","2015-07-20T00:00:00.000","2015-07-20T00:00:00.000",,,,,,,,,,,,,,,,,,,,,"E",,,,,,,"https://opendata.rdw.nl/resource/3huj-srit.json","https://opendata.rdw.nl/resource/8ys7-d773.json","https://opendata.rdw.nl/resource/vezc-m2t6.json","https://opendata.rdw.nl/resource/jhie-znh9.json","https://opendata.rdw.nl/resource/kmfi-hrps.json"
"GS586P","Personenauto","MERCEDES-BENZ","C 400 4MATIC","20240817","20240503","10369","sedan","5","ZWART","Niet geregistreerd","6","2996","1545","2210","1645","750","1800","20150807","20150807","Geen verstrekking in Open Data","85577","Ja",,,,,,,"4","4","0","0",,"0","0","M1",,,"op dwarsbalk v. r. voorzitting","2210","204",,"e1*2001/116*0431*36","R05EP1","NLAAB531","0","0.15","284","Nee","Nee",,"Nee","4075","0","0.00","2023","Logisch","00","Ja","2024-08-17T00:00:00.000","2024-05-03T00:00:00.000","2015-08-07T00:00:00.000","2015-08-07T00:00:00.000",,,,,,,,,,,,,,,,,,,,,"D",,,,,,,"https://opendata.rdw.nl/resource/3huj-srit.json","https://opendata.rdw.nl/resource/8ys7-d773.json","https://opendata.rdw.nl/resource/vezc-m2t6.json","https://opendata.rdw.nl/resource/jhie-znh9.json","https://opendata.rdw.nl/resource/kmfi-hrps.json"
"GV157P","Personenauto","MERCEDES-BENZ","C 400 4MATIC","20250118","20220308","2313","sedan","5","WIT","Niet geregistreerd","6","2996","1545","2210","1645","750","1800","20150105","20151024","Geen verstrekking in Open Data","81012","Ja",,,,,,,"4","4","0","0",,"0","0","M1",,,"r. bodemplaat by voorzitting","2210","204",,"e1*2001/116*0431*34","R05EP1","NLAAB572","0","0.15","284","Nee","Nee",,"Nee","4075","0","0.00","2024","Geen oordeel","05","Ja","2025-01-18T00:00:00.000","2022-03-08T00:00:00.000","2015-01-05T00:00:00.000","2015-10-24T00:00:00.000",,,,,,,,,,,,,,,,,,,,,"E",,,,,,,"https://opendata.rdw.nl/resource/3huj-srit.json","https://opendata.rdw.nl/resource/8ys7-d773.json","https://opendata.rdw.nl/resource/vezc-m2t6.json","https://opendata.rdw.nl/resource/jhie-znh9.json","https://opendata.rdw.nl/resource/kmfi-hrps.json"
"H680GX","Personenauto","MERCEDES-BENZ","C 400 4MATIC","20250517","20240210","16148","sedan","5","GRIJS","Niet geregistreerd","6","2996","1575","2255","1675","750","1800","20181026","20200321","Geen verstrekking in Open Data","86890","Ja","250",,,,,,"4","4","0","0",,"0","0","M1",,,"r. bodemplaat by voorzitting","2255","204",,"e1*2001/116*0431*49","R05ET1","CLAA057A","0","0.15","284","Nee","Nee",,"Nee","4125","0","0.00","2024","Geen oordeel","05","Ja","2025-05-17T00:00:00.000","2024-02-10T00:00:00.000","2018-10-26T00:00:00.000","2020-03-21T00:00:00.000",,,,,,,,,,,,,,,,,,,,,,,,,,,,"https://opendata.rdw.nl/resource/3huj-srit.json","https://opendata.rdw.nl/resource/8ys7-d773.json","https://opendata.rdw.nl/resource/vezc-m2t6.json","https://opendata.rdw.nl/resource/jhie-znh9.json","https://opendata.rdw.nl/resource/kmfi-hrps.json"
"H875VZ","Personenauto","MERCEDES-BENZ","C 400 4MATIC","20241126","20231116","8736","sedan","5","GRIJS","Niet geregistreerd","6","2996","1545","2210","1645","750","1800","20150812","20211127","Geen verstrekking in Open Data","94208","Ja","250",,,,,,"4","4","0","0",,"0","0","M1",,,,"2210","204",,"e1*2001/116*0431*36","R05EP1","NLAAB572","0","0.15","284","Nee","Ja",,"Nee","4075","0","0.00","2023","Geen oordeel","05","Ja","2024-11-26T00:00:00.000","2023-11-16T00:00:00.000","2015-08-12T00:00:00.000","2021-11-27T00:00:00.000",,,,,,,,,,,,,,,,,,,,,"E",,,,,,,"https://opendata.rdw.nl/resource/3huj-srit.json","https://opendata.rdw.nl/resource/8ys7-d773.json","https://opendata.rdw.nl/resource/vezc-m2t6.json","https://opendata.rdw.nl/resource/jhie-znh9.json","https://opendata.rdw.nl/resource/kmfi-hrps.json"
"HD873R","Personenauto","MERCEDES-BENZ","C 400 4MATIC","20241008","20151008","10369","sedan","5","GRIJS","Niet geregistreerd","6","2996","1545","2210","1645","750","1800","20151008","20151008","Geen verstrekking in Open Data","85454","Ja",,,,,,,"4","4","0","0",,"0","0","M1",,,"op dwarsbalk v. r. voorzitting","2210","204",,"e1*2001/116*0431*36","R05EP1","NLAAB531","0","0.15","284","Nee","Nee",,"Nee","4075","0","0.00","2023","Logisch","00","Ja","2024-10-08T00:00:00.000","2015-10-08T00:00:00.000","2015-10-08T00:00:00.000","2015-10-08T00:00:00.000",,,,,,,,,,,,,,,,,,,,,"D",,,,,,,"https://opendata.rdw.nl/resource/3huj-srit.json","https://opendata.rdw.nl/resource/8ys7-d773.json","https://opendata.rdw.nl/resource/vezc-m2t6.json","https://opendata.rdw.nl/resource/jhie-znh9.json","https://opendata.rdw.nl/resource/kmfi-hrps.json"
"HH167V","Personenauto","MERCEDES-BENZ","C 400 4MATIC","20241106","20201106","10369","sedan","5","GRIJS","Niet geregistreerd","6","2996","1545","2210","1645","750","1800","20151106","20151106","Geen verstrekking in Open Data","84028","Ja",,,,,,,"4","4","0","0",,"476","184","M1",,,"onder r. voorzitting","2210","204",,"e1*2001/116*0431*36","R05EP1","NLAAB531","0","0.15","284","Nee","Nee",,"Nee","4075","0","0.00","2024","Logisch","00","Ja","2024-11-06T00:00:00.000","2020-11-06T00:00:00.000","2015-11-06T00:00:00.000","2015-11-06T00:00:00.000",,,,,,,,,,,"146",,,,,,,,,,"D",,,,,,,"https://opendata.rdw.nl/resource/3huj-srit.json","https://opendata.rdw.nl/resource/8ys7-d773.json","https://opendata.rdw.nl/resource/vezc-m2t6.json","https://opendata.rdw.nl/resource/jhie-znh9.json","https://opendata.rdw.nl/resource/kmfi-hrps.json"
"HH767G","Personenauto","MERCEDES-BENZ","C 400 4MATIC","20241107","20231009","8360","sedan","5","GRIJS","Niet geregistreerd","6","2996","1545","2210","1645","750","1800","20150401","20160316","Geen verstrekking in Open Data","85343","Ja",,,,,,,"4","4","0","0",,"0","0","M1",,,"r. bodemplaat by voorzitting","2210","204",,"e1*2001/116*0431*35","R05EP1","NLAAB572","0","0.15","284","Nee","Nee",,"Nee","4075","0","0.00","2023","Geen oordeel","05","Ja","2024-11-07T00:00:00.000","2023-10-09T00:00:00.000","2015-04-01T00:00:00.000","2016-03-16T00:00:00.000",,,,,,,,,,,,,,,,,,,,,"E",,,,,,,"https://opendata.rdw.nl/resource/3huj-srit.json","https://opendata.rdw.nl/resource/8ys7-d773.json","https://opendata.rdw.nl/resource/vezc-m2t6.json","https://opendata.rdw.nl/resource/jhie-znh9.json","https://opendata.rdw.nl/resource/kmfi-hrps.json"
"HK186R","Personenauto","MERCEDES-BENZ","C 400 4MATIC","20241126","20151126","10369","sedan","5","BRUIN","Niet geregistreerd","6","2996","1545","2210","1645","750","1800","20151126","20151126","Geen verstrekking in Open Data","82304","Ja",,,,,,,"4","4","0","0",,"476","184","M1",,,"onder r. voorzitting","2210","204",,"e1*2001/116*0431*36","R05EP1","NLAAB521","0","0.15","284","Nee","Nee",,"Nee","4075","0","0.00","2023","Logisch","00","Ja","2024-11-26T00:00:00.000","2015-11-26T00:00:00.000","2015-11-26T00:00:00.000","2015-11-26T00:00:00.000",,,,,,,,,,,"146",,,,,,,,,,"D",,,,,,,"https://opendata.rdw.nl/resource/3huj-srit.json","https://opendata.rdw.nl/resource/8ys7-d773.json","https://opendata.rdw.nl/resource/vezc-m2t6.json","https://opendata.rdw.nl/resource/jhie-znh9.json","https://opendata.rdw.nl/resource/kmfi-hrps.json"
"HR904Z","Personenauto","MERCEDES-BENZ","C 400 4MATIC","20250212","20230420","12973","sedan","5","ZWART","Niet geregistreerd","6","2996","1545","2210","1645","750","1800","20160118","20160118","Geen verstrekking in Open Data","95847","Ja",,,,,,,"4","4","0","0",,"476","184","M1",,,"onder r. voorzitting","2210","204",,"e1*2001/116*0431*37","R05EP1","NLAA0514","0","0.15","284","Nee","Nee",,"Nee","4075","0","0.00","2024","Logisch","00","Ja","2025-02-12T00:00:00.000","2023-04-20T00:00:00.000","2016-01-18T00:00:00.000","2016-01-18T00:00:00.000",,,,,,,,,,,"146",,,,,,,,,,"F",,,,,,,"https://opendata.rdw.nl/resource/3huj-srit.json","https://opendata.rdw.nl/resource/8ys7-d773.json","https://opendata.rdw.nl/resource/vezc-m2t6.json","https://opendata.rdw.nl/resource/jhie-znh9.json","https://opendata.rdw.nl/resource/kmfi-hrps.json"
"J017VB","Personenauto","MERCEDES-BENZ","C 400 4MATIC","20250508","20230425","963","sedan","5","BLAUW","Niet geregistreerd","6","2996","1545","2210","1645","750","1800","20150303","20201024","Geen verstrekking in Open Data","77458","Ja","250",,,,,,"4","4","0","0",,"0","0","M1",,,,"2210","204",,"e1*2001/116*0431*34","R05EP1","NLAAB572","0","0.15","284","Nee","Nee",,"Nee","4075","0","0.00","2024","Geen oordeel","05","Ja","2025-05-08T00:00:00.000","2023-04-25T00:00:00.000","2015-03-03T00:00:00.000","2020-10-24T00:00:00.000",,,,,,,,,,,,,,,,,,,,,"E",,,,,,,"https://opendata.rdw.nl/resource/3huj-srit.json","https://opendata.rdw.nl/resource/8ys7-d773.json","https://opendata.rdw.nl/resource/vezc-m2t6.json","https://opendata.rdw.nl/resource/jhie-znh9.json","https://opendata.rdw.nl/resource/kmfi-hrps.json"