"kenteken","voertuigsoort","merk","handelsbenaming","vervaldatum_apk","datum_tenaamstelling","bruto_bpm","inrichting","aantal_zitplaatsen","eerste_kleur","tweede_kleur","aantal_cilinders","cilinderinhoud","massa_ledig_voertuig","toegestane_maximum_massa_voertuig","massa_rijklaar","maximum_massa_trekken_ongeremd","maximum_trekken_massa_geremd","datum_eerste_toelating","datum_eerste_tenaamstelling_in_nederland","wacht_op_keuren","catalogusprijs","wam_verzekerd","maximale_constructiesnelheid","laadvermogen","oplegger_geremd","aanhangwagen_autonoom_geremd","aanhangwagen_middenas_geremd","aantal_staanplaatsen","aantal_deuren","aantal_wielen","afstand_hart_koppeling_tot_achterzijde_voertuig","afstand_voorzijde_voertuig_tot_hart_koppeling","afwijkende_maximum_snelheid","lengte","breedte","europese_voertuigcategorie","europese_voertuigcategorie_toevoeging","europese_uitvoeringcategorie_toevoeging","plaats_chassisnummer","technische_max_massa_voertuig","type","type_gasinstallatie","typegoedkeuringsnummer","variant","uitvoering","volgnummer_wijziging_eu_typegoedkeuring","vermogen_massarijklaar","wielbasis","export_indicator","openstaande_terugroepactie_indicator","vervaldatum_tachograaf","taxi_indicator","maximum_massa_samenstelling","aantal_rolstoelplaatsen","maximum_ondersteunende_snelheid","jaar_laatste_registratie_tellerstand","tellerstandoordeel","code_toelichting_tellerstandoordeel","tenaamstellen_mogelijk","vervaldatum_apk_dt","datum_tenaamstelling_dt","datum_eerste_toelating_dt","datum_eerste_tenaamstelling_in_nederland_dt","vervaldatum_tachograaf_dt","maximum_last_onder_de_vooras_sen_tezamen_koppeling","type_remsysteem_voertuig_code","rupsonderstelconfiguratiecode","wielbasis_voertuig_minimum","wielbasis_voertuig_maximum","lengte_voertuig_minimum","lengte_voertuig_maximum","breedte_voertuig_minimum","breedte_voertuig_maximum","hoogte_voertuig","hoogte_voertuig_minimum","hoogte_voertuig_maximum","massa_bedrijfsklaar_minimaal","massa_bedrijfsklaar_maximaal","technisch_toelaatbaar_massa_koppelpunt","maximum_massa_technisch_maximaal","maximum_massa_technisch_minimaal","subcategorie_nederland","verticale_belasting_koppelpunt_getrokken_voertuig","zuinigheidsclassificatie","registratie_datum_goedkeuring_afschrijvingsmoment_bpm","registratie_datum_goedkeuring_afschrijvingsmoment_bpm_dt","gem_lading_wrde","aerodyn_voorz","massa_alt_aandr","verl_cab_ind","api_gekentekende_voertuigen_assen","api_gekentekende_voertuigen_brandstof","api_gekentekende_voertuigen_carrosserie","api_gekentekende_voertuigen_carrosserie_specifiek","api_gekentekende_voertuigen_voertuigklasse"
"GZ903V","Personenauto","MERCEDES-BENZ","GLA 200","20240904","20190329","5040","hatchback","5","BLAUW","Niet geregistreerd","4","1600","1431","1920","1531","750","1400","20140904","20150921","Geen verstrekking in Open Data","41506","Ja",,,,,,,"4","4",,,,,,"M1",,,"r. dwarsbalk onder voorzitting","1920",,,,,,,"0.08","270","Nee","Nee",,"Nee","3320",,,"2024","Geen oordeel","05","Ja","2024-09-04T00:00:00.000","2019-03-29T00:00:00.000","2014-09-04T00:00:00.000","2015-09-21T00:00:00.000",,,,,,,,,,,,,,,,,,,,,,,,,,,,"https://opendata.rdw.nl/resource/3huj-srit.json","https://opendata.rdw.nl/resource/8ys7-d773.json","https://opendata.rdw.nl/resource/vezc-m2t6.json","https://opendata.rdw.nl/resource/jhie-znh9.json","https://opendata.rdw.nl/resource/kmfi-hrps.json"
"H851JD","Personenauto","MERCEDES-BENZ","GLA 200","20250228","20200207","27947","hatchback","5","GRIJS","Niet geregistreerd","4","1595","1449","1920","1549",,,"20160228","20200207","Geen verstrekking in Open Data","67244","Ja",,,,,,,"5","4",,,,,,"M1",,,"r. bodemplaat by voorzitting","1920","245G",,,,,,"0.07","269","Nee","Nee",,"Nee",,,,"2024","Geen oordeel","05","Ja","2025-02-28T00:00:00.000","2020-02-07T00:00:00.000","2016-02-28T00:00:00.000","2020-02-07T00:00:00.000",,,,,,,,,,,,,,,,,,,,,,,,,,,,"https://opendata.rdw.nl/resource/3huj-srit.json","https://opendata.rdw.nl/resource/8ys7-d773.json","https://opendata.rdw.nl/resource/vezc-m2t6.json","https://opendata.rdw.nl/resource/jhie-znh9.json","https://opendata.rdw.nl/resource/kmfi-hrps.json"
"NZ421P","Personenauto","MERCEDES-BENZ","GLA 200","20240919","20200404","4352","hatchback","5","GRIJS","Niet geregistreerd","4","1595","1335","1920","1435","715","1400","20160120","20170529","Geen verstrekking in Open Data","45968","Ja",,,,,,,"4","4",,,,,,"M1",,,"r. bodemplaat by voorzitting","1920","245 G",,,,,,"0.08","271","Nee","Nee",,"Nee",,,,"2023","Geen oordeel","05","Ja","2024-09-19T00:00:00.000","2020-04-04T00:00:00.000","2016-01-20T00:00:00.000","2017-05-29T00:00:00.000",,,,,,,,,,,,,,,,,,,,,,,,,,,,"https://opendata.rdw.nl/resource/3huj-srit.json","https://opendata.rdw.nl/resource/8ys7-d773.json","https://opendata.rdw.nl/resource/vezc-m2t6.json","https://opendata.rdw.nl/resource/jhie-znh9.json","https://opendata.rdw.nl/resource/kmfi-hrps.json"
"P498PN","Personenauto","MERCEDES-BENZ","GLA 200","20250512","20220513","271","hatchback","5","ZWART","Niet geregistreerd","4","1595","1335","1920","1435",,"1450","20150512","20220513","Geen verstrekking in Open Data","59546","Ja",,,,,,,"4","4",,,,,,"M1",,,"r. dwarsbalk onder voorzitting","1920","245G",,,,,,"0.08","270","Nee","Ja",,"Nee","3370",,,"2024","Geen oordeel","05","Ja","2025-05-12T00:00:00.000","2022-05-13T00:00:00.000","2015-05-12T00:00:00.000","2022-05-13T00:00:00.000",,,,,,,,,,,,,,,,,,,,,,"20220504","2022-05-04T00:00:00.000",,,,,"https://opendata.rdw.nl/resource/3huj-srit.json","https://opendata.rdw.nl/resource/8ys7-d773.json","https://opendata.rdw.nl/resource/vezc-m2t6.json","https://opendata.rdw.nl/resource/jhie-znh9.json","https://opendata.rdw.nl/resource/kmfi-hrps.json"
"PB570N","Personenauto","MERCEDES-BENZ","GLA 200","20250208","20220916","3456","hatchback","5","WIT","Niet geregistreerd","4","1595","1335","1920","1435","715","1400","20160204","20170526","Geen verstrekking in Open Data","43832","Ja",,,,,,,"4","4",,,,,,"M1",,,"onder r. voorzitting","1920",,,,,,,"0.08","270","Nee","Nee",,"Nee",,,,"2024","Geen oordeel","05","Ja","2025-02-08T00:00:00.000","2022-09-16T00:00:00.000","2016-02-04T00:00:00.000","2017-05-26T00:00:00.000",,,,,,,,,,,,,,,,,,,,,,,,,,,,"https://opendata.rdw.nl/resource/3huj-srit.json","https://opendata.rdw.nl/resource/8ys7-d773.json","https://opendata.rdw.nl/resource/vezc-m2t6.json","https://opendata.rdw.nl/resource/jhie-znh9.json","https://opendata.rdw.nl/resource/kmfi-hrps.json"
"PD600T","Personenauto","MERCEDES-BENZ","GLA 200","20250312","20170929","4488","hatchback","5","GRIJS","Niet geregistreerd","4","1595","1335","1920","1435","715","1400","20160204","20170714","Geen verstrekking in Open Data","47613","Ja",,,,,,,"4","4",,,,,,"M1",,,"r. bodemplaat by voorzitting","1920","245G",,,,,,"0.08","270","Nee","Nee",,"Nee","3370",,,"2024","Onlogisch","04","Ja","2025-03-12T00:00:00.000","2017-09-29T00:00:00.000","2016-02-04T00:00:00.000","2017-07-14T00:00:00.000",,,,,,,,,,,,,,,,,,,,,,,,,,,,"https://opendata.rdw.nl/resource/3huj-srit.json","https://opendata.rdw.nl/resource/8ys7-d773.json","https://opendata.rdw.nl/resource/vezc-m2t6.json","https://opendata.rdw.nl/resource/jhie-znh9.json","https://opendata.rdw.nl/resource/kmfi-hrps.json"
"PF403F","Personenauto","MERCEDES-BENZ","GLA 200","20240507",,"4402","hatchback","5","ROOD","Niet geregistreerd","4","1595","1335","1920","1435","715","1400","20160121","20171124","Geen verstrekking in Open Data","46901","Ja",,,,,,,"4","4",,,,,,"M1",,,"r. bodemplaat by voorzitting","1920","245G",,,,,,"0.08","270","Nee","Nee",,"Nee",,,,"2022","Geen oordeel","05","Ja","2024-05-07T00:00:00.000",,"2016-01-21T00:00:00.000","2017-11-24T00:00:00.000",,,,,,,,,,,,,,,,,,,,,,,,,,,,"https://opendata.rdw.nl/resource/3huj-srit.json","https://opendata.rdw.nl/resource/8ys7-d773.json","https://opendata.rdw.nl/resource/vezc-m2t6.json","https://opendata.rdw.nl/resource/jhie-znh9.json","https://opendata.rdw.nl/resource/kmfi-hrps.json"
"PF620F","Personenauto","MERCEDES-BENZ","GLA 200","20250120","20181107","4165","hatchback","5","WIT","Niet geregistreerd","4","1595","1335","1920","1435","715","1400","20160120","20170706","Geen verstrekking in Open Data","46899","Ja",,,,,,,"4","4",,,,,,"M1",,,"r. dwarsbalk v. voorzitting","1920","245G",,,,,,"0.08","270","Nee","Nee",,"Nee",,,,"2024","Geen oordeel","05","Ja","2025-01-20T00:00:00.000","2018-11-07T00:00:00.000","2016-01-20T00:00:00.000","2017-07-06T00:00:00.000",,,,,,,,,,,,,,,,,,,,,,,,,,,,"https://opendata.rdw.nl/resource/3huj-srit.json","https://opendata.rdw.nl/resource/8ys7-d773.json","https://opendata.rdw.nl/resource/vezc-m2t6.json","https://opendata.rdw.nl/resource/jhie-znh9.json","https://opendata.rdw.nl/resource/kmfi-hrps.json"
"PK482K","Personenauto","MERCEDES-BENZ","GLA 200","20250214","20180410","5694","hatchback","5","GRIJS","Niet geregistreerd","4","1595","1335","1920","1435","715","1400","20160120","20180410","Geen verstrekking in Open Data","45733","Ja",,,,,,,"4","4",,,,,,"M1",,,"r. by voorzitting","1920","245G",,,,,,"0.08","270","Nee","Nee",,"Nee",,,,"2023","Geen oordeel","05","Ja","2025-02-14T00:00:00.000","2018-04-10T00:00:00.000","2016-01-20T00:00:00.000","2018-04-10T00:00:00.000",,,,,,,,,,,,,,,,,,,,,,,,,,,,"https://opendata.rdw.nl/resource/3huj-srit.json","https://opendata.rdw.nl/resource/8ys7-d773.json","https://opendata.rdw.nl/resource/vezc-m2t6.json","https://opendata.rdw.nl/resource/jhie-znh9.json","https://opendata.rdw.nl/resource/kmfi-hrps.json"
"PK526K","Personenauto","MERCEDES-BENZ","GLA 200","20250329","20240402","5804","hatchback","5","GRIJS","Niet geregistreerd","4","1595","1335","1920","1435","715","1400","20160204","20171023","Geen verstrekking in Open Data","45733","Ja",,,,,,,"4","4",,,,,,"M1",,,"r. dwarsbalk by voorzitting","1920","245 G",,,,,,"0.08","270","Nee","Nee",,"Nee",,,,"2024","Geen oordeel","05","Ja","2025-03-29T00:00:00.000","2024-04-02T00:00:00.000","2016-02-04T00:00:00.000","2017-10-23T00:00:00.000",,,,,,,,,,,,,,,,,,,,,,,,,,,,"https://opendata.rdw.nl/resource/3huj-srit.json","https://opendata.rdw.nl/resource/8ys7-d773.json","https://opendata.rdw.nl/resource/vezc-m2t6.json","https://opendata.rdw.nl/resource/jhie-znh9.json","https://opendata.rdw.nl/resource/kmfi-hrps.json"
"R029SB","Personenauto","MERCEDES-BENZ","GLA 200","20241103","20221107","22965","hatchback","5","GRIJS","Niet geregistreerd","4","1595","1295","1940","1395",,"1430","20170630","20221107","Geen verstrekking in Open Data","61987","Ja",,,,,,,"4","4",,,,,,"M1",,,,"1940","GLA 200",,,,,,"0.08","270","Nee","Nee",,"Nee","3370",,,"2024","Geen oordeel","05","Ja","2024-11-03T00:00:00.000","2022-11-07T00:00:00.000","2017-06-30T00:00:00.000","2022-11-07T00:00:00.000",,,,,,,,,,,,,,,,,,,,,,"20221103","2022-11-03T00:00:00.000",,,,,"https://opendata.rdw.nl/resource/3huj-srit.json","https://opendata.rdw.nl/resource/8ys7-d773.json","https://opendata.rdw.nl/resource/vezc-m2t6.json","https://opendata.rdw.nl/resource/jhie-znh9.json","https://opendata.rdw.nl/resource/kmfi-hrps.json"
"R909FB","Personenauto","MERCEDES-BENZ","GLA 200","20240808","20220803","11560","hatchback","5","WIT","Niet geregistreerd","4","1595","1240","1920","1340","670","1400","20140821","20220803","Geen verstrekking in Open Data","41476","Ja",,,,,,,"4","4",,,,,,"M1",,,,"1920","245G",,,,,,"0.09","270","Nee","Ja",,"Nee","3330",,,"2023","Geen oordeel","05","Ja","2024-08-08T00:00:00.000","2022-08-03T00:00:00.000","2014-08-21T00:00:00.000","2022-08-03T00:00:00.000",,,,,,,,,,,,,,,,,,,,,,"20220725","2022-07-25T00:00:00.000",,,,,"https://opendata.rdw.nl/resource/3huj-srit.json","https://opendata.rdw.nl/resource/8ys7-d773.json","https://opendata.rdw.nl/resource/vezc-m2t6.json","https://opendata.rdw.nl/resource/jhie-znh9.json","https://opendata.rdw.nl/resource/kmfi-hrps.json"
"RT658N","Personenauto","MERCEDES-BENZ","GLA 200","20250210","20180129","6604","hatchback","5","GRIJS","Niet geregistreerd","4","1595","1335","1920","1435","715","1400","20160120","20180129","Geen verstrekking in Open Data","43953","Ja",,,,,,,"4","4",,,,,,"M1",,,,"1920","245G",,,,,,"0.08","270","Nee","Nee",,"Nee",,,,"2024","Geen oordeel","05","Ja","2025-02-10T00:00:00.000","2018-01-29T00:00:00.000","2016-01-20T00:00:00.000","2018-01-29T00:00:00.000",,,,,,,,,,,,,,,,,,,,,,,,,,,,"https://opendata.rdw.nl/resource/3huj-srit.json","https://opendata.rdw.nl/resource/8ys7-d773.json","https://opendata.rdw.nl/resource/vezc-m2t6.json","https://opendata.rdw.nl/resource/jhie-znh9.json","https://opendata.rdw.nl/resource/kmfi-hrps.json"
"SF378L","Personenauto","MERCEDES-BENZ","GLA 200","20250124","20180315","4184","hatchback","5","GRIJS","Niet geregistreerd","4","1595","1335","1920","1435","715","1400","20160120","20180315","Geen verstrekking in Open Data","46555","Ja",,,,,,,"4","4",,,,,,"M1",,,"r. centrale balk onder voorzitting","1920","245 G",,,,,,"0.08","270","Nee","Nee",,"Nee",,,,"2024","Geen oordeel","05","Ja","2025-01-24T00:00:00.000","2018-03-15T00:00:00.000","2016-01-20T00:00:00.000","2018-03-15T00:00:00.000",,,,,,,,,,,,,,,,,,,,,,,,,,,,"https://opendata.rdw.nl/resource/3huj-srit.json","https://opendata.rdw.nl/resource/8ys7-d773.json","https://opendata.rdw.nl/resource/vezc-m2t6.json","https://opendata.rdw.nl/resource/jhie-znh9.json","https://opendata.rdw.nl/resource/kmfi-hrps.json"
