"kenteken","voertuigsoort","merk","handelsbenaming","vervaldatum_apk","datum_tenaamstelling","bruto_bpm","inrichting","aantal_zitplaatsen","eerste_kleur","tweede_kleur","aantal_cilinders","cilinderinhoud","massa_ledig_voertuig","toegestane_maximum_massa_voertuig","massa_rijklaar","maximum_massa_trekken_ongeremd","maximum_trekken_massa_geremd","datum_eerste_toelating","datum_eerste_tenaamstelling_in_nederland","wacht_op_keuren","catalogusprijs","wam_verzekerd","maximale_constructiesnelheid","laadvermogen","oplegger_geremd","aanhangwagen_autonoom_geremd","aanhangwagen_middenas_geremd","aantal_staanplaatsen","aantal_deuren","aantal_wielen","afstand_hart_koppeling_tot_achterzijde_voertuig","afstand_voorzijde_voertuig_tot_hart_koppeling","afwijkende_maximum_snelheid","lengte","breedte","europese_voertuigcategorie","europese_voertuigcategorie_toevoeging","europese_uitvoeringcategorie_toevoeging","plaats_chassisnummer","technische_max_massa_voertuig","type","type_gasinstallatie","typegoedkeuringsnummer","variant","uitvoering","volgnummer_wijziging_eu_typegoedkeuring","vermogen_massarijklaar","wielbasis","export_indicator","openstaande_terugroepactie_indicator","vervaldatum_tachograaf","taxi_indicator","maximum_massa_samenstelling","aantal_rolstoelplaatsen","maximum_ondersteunende_snelheid","jaar_laatste_registratie_tellerstand","tellerstandoordeel","code_toelichting_tellerstandoordeel","tenaamstellen_mogelijk","vervaldatum_apk_dt","datum_tenaamstelling_dt","datum_eerste_toelating_dt","datum_eerste_tenaamstelling_in_nederland_dt","vervaldatum_tachograaf_dt","maximum_last_onder_de_vooras_sen_tezamen_koppeling","type_remsysteem_voertuig_code","rupsonderstelconfiguratiecode","wielbasis_voertuig_minimum","wielbasis_voertuig_maximum","lengte_voertuig_minimum","lengte_voertuig_maximum","breedte_voertuig_minimum","breedte_voertuig_maximum","hoogte_voertuig","hoogte_voertuig_minimum","hoogte_voertuig_maximum","massa_bedrijfsklaar_minimaal","massa_bedrijfsklaar_maximaal","technisch_toelaatbaar_massa_koppelpunt","maximum_massa_technisch_maximaal","maximum_massa_technisch_minimaal","subcategorie_nederland","verticale_belasting_koppelpunt_getrokken_voertuig","zuinigheidsclassificatie","registratie_datum_goedkeuring_afschrijvingsmoment_bpm","registratie_datum_goedkeuring_afschrijvingsmoment_bpm_dt","gem_lading_wrde","aerodyn_voorz","massa_alt_aandr","verl_cab_ind","api_gekentekende_voertuigen_assen","api_gekentekende_voertuigen_brandstof","api_gekentekende_voertuigen_carrosserie","api_gekentekende_voertuigen_carrosserie_specifiek","api_gekentekende_voertuigen_voertuigklasse"
"G563LH","Personenauto","MERCEDES-BENZ","C 250 D","20250405","20240407","5163","coupe","4","ZWART","Niet geregistreerd","4","2143","1545","2125","1645","750","1800","20160713","20191021","Geen verstrekking in Open Data","73054","Ja","247",,,,,,"2","4","0","0",,"0","0","M1",,,,"2125","204",,"e1*2001/116*0431*39","R304P0","CZAZ0414","0","0.09","284","Nee","Ja",,"Nee","3995","0","0.00","2024","Geen oordeel","05","Ja","2025-04-05T00:00:00.000","2024-04-07T00:00:00.000","2016-07-13T00:00:00.000","2019-10-21T00:00:00.000",,,,,,,,,,,,,,,,,,,,,"E",,,,,,,"https://opendata.rdw.nl/resource/3huj-srit.json","https://opendata.rdw.nl/resource/8ys7-d773.json","https://opendata.rdw.nl/resource/vezc-m2t6.json","https://opendata.rdw.nl/resource/jhie-znh9.json","https://opendata.rdw.nl/resource/kmfi-hrps.json"
"G587BS","Personenauto","MERCEDES-BENZ","C 250 D","20240604","20190827","9444","coupe","4","ZWART","Niet geregistreerd","4","2143","1545","2125","1645","750","1800","20180604","20190827","Geen verstrekking in Open Data","85639","Ja","247",,,,,,"2","4","0","0",,"0","0","M1",,,,"2125","204",,"e1*2001/116*0431*44","R304P0","CZAA0474","0","0.09","284","Nee","Nee",,"Nee","3995","0","0.00","2023","Geen oordeel","05","Ja","2024-06-04T00:00:00.000","2019-08-27T00:00:00.000","2018-06-04T00:00:00.000","2019-08-27T00:00:00.000",,,,,,,,,,,,,,,,,,,,,"F",,,,,,,"https://opendata.rdw.nl/resource/3huj-srit.json","https://opendata.rdw.nl/resource/8ys7-d773.json","https://opendata.rdw.nl/resource/vezc-m2t6.json","https://opendata.rdw.nl/resource/jhie-znh9.json","https://opendata.rdw.nl/resource/kmfi-hrps.json"
"H282KG","Personenauto","MERCEDES-BENZ","C 250 D","20250419","20200220","2980","coupe","4","BLAUW","Niet geregistreerd","4","2143","1545","2125","1645","750","1800","20160315","20200220","Geen verstrekking in Open Data","56183","Ja","247",,,,,,"2","4","0","0",,"0","0","M1",,,,"2125","204",,"e1*2001/116*0431*38","R304P0","CZAA0412","0","0.09","284","Nee","Ja",,"Nee","3995","0","0.00","2024","Geen oordeel","05","Ja","2025-04-19T00:00:00.000","2020-02-20T00:00:00.000","2016-03-15T00:00:00.000","2020-02-20T00:00:00.000",,,,,,,,,,,,,,,,,,,,,"D",,,,,,,"https://opendata.rdw.nl/resource/3huj-srit.json","https://opendata.rdw.nl/resource/8ys7-d773.json","https://opendata.rdw.nl/resource/vezc-m2t6.json","https://opendata.rdw.nl/resource/jhie-znh9.json","https://opendata.rdw.nl/resource/kmfi-hrps.json"
"JG396G","Personenauto","MERCEDES-BENZ","C 250 D","20241207","20220805","7145","coupe","4","GRIJS","Niet geregistreerd","4","2143","1545","2125","1645","750","1800","20160311","20160311","Geen verstrekking in Open Data","63978","Ja",,,,,,,"2","4","0","0",,"476","188","M1",,,"onder r. voorzitting","2125","204",,"e1*2001/116*0431*38","R304P0","CZAA0412","0","0.09","284","Nee","Nee",,"Nee","3995","0","0.00","2023","Logisch","00","Ja","2024-12-07T00:00:00.000","2022-08-05T00:00:00.000","2016-03-11T00:00:00.000","2016-03-11T00:00:00.000",,,,,,,,,,,"143",,,,,,,,,,"D",,,,,,,"https://opendata.rdw.nl/resource/3huj-srit.json","https://opendata.rdw.nl/resource/8ys7-d773.json","https://opendata.rdw.nl/resource/vezc-m2t6.json","https://opendata.rdw.nl/resource/jhie-znh9.json","https://opendata.rdw.nl/resource/kmfi-hrps.json"
"JH337F","Personenauto","MERCEDES-BENZ","C 250 D","20241019","20200709","7145","coupe","4","GRIJS","Niet geregistreerd","4","2143","1545","2125","1645","750","1800","20160323","20160323","Geen verstrekking in Open Data","63246","Ja",,,,,,,"2","4","0","0",,"476","188","M1",,,"onder r. voorzitting","2125","204",,"e1*2001/116*0431*38","R304P0","CZAA0412","0","0.09","284","Nee","Nee",,"Nee","3995","0","0.00","2024","Logisch","00","Ja","2024-10-19T00:00:00.000","2020-07-09T00:00:00.000","2016-03-23T00:00:00.000","2016-03-23T00:00:00.000",,,,,,,,,,,"143",,,,,,,,,,"D",,,,,,,"https://opendata.rdw.nl/resource/3huj-srit.json","https://opendata.rdw.nl/resource/8ys7-d773.json","https://opendata.rdw.nl/resource/vezc-m2t6.json","https://opendata.rdw.nl/resource/jhie-znh9.json","https://opendata.rdw.nl/resource/kmfi-hrps.json"
"JK855S","Personenauto","MERCEDES-BENZ","C 250 D","20240712","20230712","7987","coupe","4","GRIJS","Niet geregistreerd","4","2143","1545","2125","1645","750","1800","20160418","20160418","Geen verstrekking in Open Data","78140","Ja",,,,,,,"2","4","0","0",,"476","188","M1",,,"onder r. voorzitting","2125","204",,"e1*2001/116*0431*38","R304P0","CZAA0414","0","0.09","284","Nee","Ja",,"Nee","3995","0","0.00","2024","Logisch","00","Ja","2024-07-12T00:00:00.000","2023-07-12T00:00:00.000","2016-04-18T00:00:00.000","2016-04-18T00:00:00.000",,,,,,,,,,,"143",,,,,,,,,,"E",,,,,,,"https://opendata.rdw.nl/resource/3huj-srit.json","https://opendata.rdw.nl/resource/8ys7-d773.json","https://opendata.rdw.nl/resource/vezc-m2t6.json","https://opendata.rdw.nl/resource/jhie-znh9.json","https://opendata.rdw.nl/resource/kmfi-hrps.json"
"JK873F","Personenauto","MERCEDES-BENZ","C 250 D","20250407","20180414","7145","coupe","4","GRIJS","Niet geregistreerd","4","2143","1545","2125","1645","750","1800","20160407","20160407","Geen verstrekking in Open Data","63228","Ja",,,,,,,"2","4","0","0",,"476","188","M1",,,"onder r. voorzitting","2125","204",,"e1*2001/116*0431*38","R304P0","CZAA0412","0","0.09","284","Nee","Nee",,"Nee","3995","0","0.00","2024","Logisch","00","Ja","2025-04-07T00:00:00.000","2018-04-14T00:00:00.000","2016-04-07T00:00:00.000","2016-04-07T00:00:00.000",,,,,,,,,,,"143",,,,,,,,,,"D",,,,,,,"https://opendata.rdw.nl/resource/3huj-srit.json","https://opendata.rdw.nl/resource/8ys7-d773.json","https://opendata.rdw.nl/resource/vezc-m2t6.json","https://opendata.rdw.nl/resource/jhie-znh9.json","https://opendata.rdw.nl/resource/kmfi-hrps.json"
"JL919H","Personenauto","MERCEDES-BENZ","C 250 D","20240429","20221223","7145","coupe","4","WIT","Niet geregistreerd","4","2143","1545","2125","1645","750","1800","20160429","20160429","Geen verstrekking in Open Data","77482","Ja",,,,,,,"2","4","0","0",,"476","188","M1",,,"onder r. voorzitting","2125","204",,"e1*2001/116*0431*38","R304P0","CZAA0412","0","0.09","284","Nee","Nee",,"Nee","3995","0","0.00","2023","Logisch","00","Ja","2024-04-29T00:00:00.000","2022-12-23T00:00:00.000","2016-04-29T00:00:00.000","2016-04-29T00:00:00.000",,,,,,,,,,,"143",,,,,,,,,,"D",,,,,,,"https://opendata.rdw.nl/resource/3huj-srit.json","https://opendata.rdw.nl/resource/8ys7-d773.json","https://opendata.rdw.nl/resource/vezc-m2t6.json","https://opendata.rdw.nl/resource/jhie-znh9.json","https://opendata.rdw.nl/resource/kmfi-hrps.json"
"JN702B","Personenauto","MERCEDES-BENZ","C 250 D","20240822","20240418","7145","coupe","4","GRIJS","Niet geregistreerd","4","2143","1545","2125","1645","750","1800","20160503","20160503","Geen verstrekking in Open Data","64209","Ja",,,,,,,"2","4","0","0",,"476","188","M1",,,"onder r. voorzitting","2125","204",,"e1*2001/116*0431*38","R304P0","CZAA0412","0","0.09","284","Nee","Nee",,"Nee","3995","0","0.00","2024","Logisch","00","Ja","2024-08-22T00:00:00.000","2024-04-18T00:00:00.000","2016-05-03T00:00:00.000","2016-05-03T00:00:00.000",,,,,,,,,,,"143",,,,,,,,,,"D",,,,,,,"https://opendata.rdw.nl/resource/3huj-srit.json","https://opendata.rdw.nl/resource/8ys7-d773.json","https://opendata.rdw.nl/resource/vezc-m2t6.json","https://opendata.rdw.nl/resource/jhie-znh9.json","https://opendata.rdw.nl/resource/kmfi-hrps.json"
"JZ911V","Personenauto","MERCEDES-BENZ","C 250 D","20240721","20171020","7987","coupe","4","GRIJS","Niet geregistreerd","4","2143","1545","2125","1645","750","1800","20160721","20160721","Geen verstrekking in Open Data","70903","Ja",,,,,,,"2","4","0","0",,"476","188","M1",,,"onder r. voorzitting","2125","204",,"e1*2001/116*0431*39","R304P0","CZAZ0414","0","0.09","284","Nee","Nee",,"Nee","3995","0","0.00","2023","Logisch","00","Ja","2024-07-21T00:00:00.000","2017-10-20T00:00:00.000","2016-07-21T00:00:00.000","2016-07-21T00:00:00.000",,,,,,,,,,,"142",,,,,,,,,,"E",,,,,,,"https://opendata.rdw.nl/resource/3huj-srit.json","https://opendata.rdw.nl/resource/8ys7-d773.json","https://opendata.rdw.nl/resource/vezc-m2t6.json","https://opendata.rdw.nl/resource/jhie-znh9.json","https://opendata.rdw.nl/resource/kmfi-hrps.json"
"K116XJ","Personenauto","MERCEDES-BENZ","C 250 D","20240512","20210322","11220","coupe","4","WIT","Niet geregistreerd","4","2143","1545","2125","1645","750","1800","20170512","20210322","Geen verstrekking in Open Data","59679","Ja","247",,,,,,"2","4","0","0",,"0","0","M1",,,,"2125","204",,"e1*2001/116*0431*42","R304P0","CZAA0474","0","0.09","284","Nee","Ja",,"Nee","3995","0","0.00","2023","Geen oordeel","05","Ja","2024-05-12T00:00:00.000","2021-03-22T00:00:00.000","2017-05-12T00:00:00.000","2021-03-22T00:00:00.000",,,,,,,,,,,,,,,,,,,,,"F",,,,,,,"https://opendata.rdw.nl/resource/3huj-srit.json","https://opendata.rdw.nl/resource/8ys7-d773.json","https://opendata.rdw.nl/resource/vezc-m2t6.json","https://opendata.rdw.nl/resource/jhie-znh9.json","https://opendata.rdw.nl/resource/kmfi-hrps.json"
"K402RR","Personenauto","MERCEDES-BENZ","C 250 D 4MATIC","20250214","20210211","3422","coupe","4","GRIJS","Niet geregistreerd","4","2143","1585","2165","1685","750","1800","20160928","20210211","Geen verstrekking in Open Data","57635","Ja","241",,,,,,"2","4","0","0",,"0","0","M1",,,,"2165","204",,"e1*2001/116*0431*39","R304P1","CLAA0401","0","0.09","284","Nee","Nee",,"Nee","4035","0","0.00","2024","Geen oordeel","05","Ja","2025-02-14T00:00:00.000","2021-02-11T00:00:00.000","2016-09-28T00:00:00.000","2021-02-11T00:00:00.000",,,,,,,,,,,,,,,,,,,,,"E",,,,,,,"https://opendata.rdw.nl/resource/3huj-srit.json","https://opendata.rdw.nl/resource/8ys7-d773.json","https://opendata.rdw.nl/resource/vezc-m2t6.json","https://opendata.rdw.nl/resource/jhie-znh9.json","https://opendata.rdw.nl/resource/kmfi-hrps.json"
"K861FT","Personenauto","MERCEDES-BENZ","C 250 D","20241128","20230509","6104","coupe","4","GRIJS","Niet geregistreerd","4","2143","1545","2125","1645","750","1800","20161117","20201202","Geen verstrekking in Open Data","62959","Ja","247",,,,,,"2","4","0","0",,"0","0","M1",,,,"2125","204",,"e1*2001/116*0431*39","R304P0","CZAA0412","0","0.09","284","Nee","Nee",,"Nee","3995","0","0.00","2023","Geen oordeel","05","Ja","2024-11-28T00:00:00.000","2023-05-09T00:00:00.000","2016-11-17T00:00:00.000","2020-12-02T00:00:00.000",,,,,,,,,,,,,,,,,,,,,"D",,,,,,,"https://opendata.rdw.nl/resource/3huj-srit.json","https://opendata.rdw.nl/resource/8ys7-d773.json","https://opendata.rdw.nl/resource/vezc-m2t6.json","https://opendata.rdw.nl/resource/jhie-znh9.json","https://opendata.rdw.nl/resource/kmfi-hrps.json"
"KB602F","Personenauto","MERCEDES-BENZ","C 250 D","20240723","20160723","7987","coupe","4","GRIJS","Niet geregistreerd","4","2143","1545","2125","1645","750","1800","20160723","20160723","Geen verstrekking in Open Data","67902","Ja",,,,,,,"2","4","0","0",,"476","188","M1",,,"onder r. voorzitting","2125","204",,"e1*2001/116*0431*39","R304P0","CZAZ0414","0","0.09","284","Nee","Nee",,"Nee","3995","0","0.00","2023","Logisch","00","Ja","2024-07-23T00:00:00.000","2016-07-23T00:00:00.000","2016-07-23T00:00:00.000","2016-07-23T00:00:00.000",,,,,,,,,,,"142",,,,,,,,,,"E",,,,,,,"https://opendata.rdw.nl/resource/3huj-srit.json","https://opendata.rdw.nl/resource/8ys7-d773.json","https://opendata.rdw.nl/resource/vezc-m2t6.json","https://opendata.rdw.nl/resource/jhie-znh9.json","https://opendata.rdw.nl/resource/kmfi-hrps.json"
"KD638N","Personenauto","MERCEDES-BENZ","C 250 D 4MATIC","20240805","20160805","9249","coupe","4","BLAUW","Niet geregistreerd","4","2143","1585","2165","1685","750","1800","20160805","20160805","Geen verstrekking in Open Data","76854","Ja",,,,,,,"2","4","0","0",,"476","188","M1",,,"onder r. voorzitting","2165","204",,"e1*2001/116*0431*39","R304P1","CLAZ0401","0","0.09","284","Nee","Nee",,"Nee","4035","0","0.00","2024","Logisch","00","Ja","2024-08-05T00:00:00.000","2016-08-05T00:00:00.000","2016-08-05T00:00:00.000","2016-08-05T00:00:00.000",,,,,,,,,,,"142",,,,,,,,,,"E",,,,,,,"https://opendata.rdw.nl/resource/3huj-srit.json","https://opendata.rdw.nl/resource/8ys7-d773.json","https://opendata.rdw.nl/resource/vezc-m2t6.json","https://opendata.rdw.nl/resource/jhie-znh9.json","https://opendata.rdw.nl/resource/kmfi-hrps.json"
"KP084H","Personenauto","MERCEDES-BENZ","C 250 D 4MATIC","20241031","20210922","11353","coupe","4","ZWART","Niet geregistreerd","4","2143","1585","2165","1685","750","1800","20161031","20161031","Geen verstrekking in Open Data","84803","Ja",,,,,,,"2","4","0","0",,"476","188","M1",,,"onder r. voorzitting","2165","204",,"e1*2001/116*0431*39","R304P1","CLAA0414","0","0.09","284","Nee","Nee",,"Nee","4035","0","0.00","2023","Logisch","00","Ja","2024-10-31T00:00:00.000","2021-09-22T00:00:00.000","2016-10-31T00:00:00.000","2016-10-31T00:00:00.000",,,,,,,,,,,"142",,,,,,,,,,"F",,,,,,,"https://opendata.rdw.nl/resource/3huj-srit.json","https://opendata.rdw.nl/resource/8ys7-d773.json","https://opendata.rdw.nl/resource/vezc-m2t6.json","https://opendata.rdw.nl/resource/jhie-znh9.json","https://opendata.rdw.nl/resource/kmfi-hrps.json"
"KP229G","Personenauto","MERCEDES-BENZ","C 250 D","20250411","20210419","6764","coupe","4","ZWART","Niet geregistreerd","4","2143","1545","2125","1645","750","1800","20160113","20161028","Geen verstrekking in Open Data","67911","Ja",,,,,,,"2","4","0","0",,"0","0","M1",,,"r. bodemplaat by voorzitting","2125","204",,"e1*2001/116*0431*37","R304P0","CZAA0474","0","0.09","284","Nee","Nee",,"Nee","3995","0","0.00","2024","Geen oordeel","05","Ja","2025-04-11T00:00:00.000","2021-04-19T00:00:00.000","2016-01-13T00:00:00.000","2016-10-28T00:00:00.000",,,,,,,,,,,,,,,,,,,,,"E",,,,,,,"https://opendata.rdw.nl/resource/3huj-srit.json","https://opendata.rdw.nl/resource/8ys7-d773.json","https://opendata.rdw.nl/resource/vezc-m2t6.json","https://opendata.rdw.nl/resource/jhie-znh9.json","https://opendata.rdw.nl/resource/kmfi-hrps.json"
"KS618F","Personenauto","MERCEDES-BENZ","C 250 D","20241205","20240306","4568","coupe","4","WIT","Niet geregistreerd","4","2143","1545","2125","1645","750","1800","20160104","20161229","Geen verstrekking in Open Data","76581","Ja",,,,,,,"2","4","0","0",,"0","0","M1",,,"r. bodemplaat by voorzitting","2125","204",,"e1*2001/116*0431*37","R304P0","CZAA0412","0","0.09","284","Nee","Nee",,"Nee","3995","0","0.00","2024","Geen oordeel","05","Ja","2024-12-05T00:00:00.000","2024-03-06T00:00:00.000","2016-01-04T00:00:00.000","2016-12-29T00:00:00.000",,,,,,,,,,,,,,,,,,,,,"D",,,,,,,"https://opendata.rdw.nl/resource/3huj-srit.json","https://opendata.rdw.nl/resource/8ys7-d773.json","https://opendata.rdw.nl/resource/vezc-m2t6.json","https://opendata.rdw.nl/resource/jhie-znh9.json","https://opendata.rdw.nl/resource/kmfi-hrps.json"
"KZ301G","Personenauto","MERCEDES-BENZ","C 250 D","20240807","20220920","7145","coupe","4","ZWART","Niet geregistreerd","4","2143","1545","2125","1645","750","1800","20161223","20161223","Geen verstrekking in Open Data","66871","Ja",,,,,,,"2","4","0","0",,"476","188","M1",,,"onder r. voorzitting","2125","204",,"e1*2001/116*0431*39","R304P0","CZAZ0472","0","0.09","284","Nee","Nee",,"Nee","3995","0","0.00","2024","Logisch","00","Ja","2024-08-07T00:00:00.000","2022-09-20T00:00:00.000","2016-12-23T00:00:00.000","2016-12-23T00:00:00.000",,,,,,,,,,,"142",,,,,,,,,,"D",,,,,,,"https://opendata.rdw.nl/resource/3huj-srit.json","https://opendata.rdw.nl/resource/8ys7-d773.json","https://opendata.rdw.nl/resource/vezc-m2t6.json","https://opendata.rdw.nl/resource/jhie-znh9.json","https://opendata.rdw.nl/resource/kmfi-hrps.json"
"N028JT","Personenauto","MERCEDES-BENZ","C 250 D 4MATIC","20240803","20211026","10074","coupe","4","GRIJS","Niet geregistreerd","4","2143","1585","2165","1685","750","1800","20170810","20211026","Geen verstrekking in Open Data","74498","Ja","241",,,,,,"2","4","0","0",,"0","0","M1",,,,"2165","204",,"e1*2001/116*0431*44","R304P1","CLAA0412","0","0.09","284","Nee","Ja",,"Nee","4035","0","0.00","2023","Geen oordeel","05","Ja","2024-08-03T00:00:00.000","2021-10-26T00:00:00.000","2017-08-10T00:00:00.000","2021-10-26T00:00:00.000",,,,,,,,,,,,,,,,,,,,,,"20211023","2021-10-23T00:00:00.000",,,,,"https://opendata.rdw.nl/resource/3huj-srit.json","https://opendata.rdw.nl/resource/8ys7-d773.json","https://opendata.rdw.nl/resource/vezc-m2t6.json","https://opendata.rdw.nl/resource/jhie-znh9.json","https://opendata.rdw.nl/resource/kmfi-hrps.json"
"N869VB","Personenauto","MERCEDES-BENZ","C 250 D","20250113","20220712","565","coupe","4","WIT","Niet geregistreerd","4","2143","1545","2125","1645","750","1800","20160309","20211224","Geen verstrekking in Open Data","64181","Nee","247",,,,,,"2","4","0","0",,"0","0","M1",,,,"2125","204",,"e1*2001/116*0431*38","R304P0","CZAA0414","0","0.09","284","Nee","Ja",,"Nee","3995","0","0.00","2023","Geen oordeel","05","Ja","2025-01-13T00:00:00.000","2022-07-12T00:00:00.000","2016-03-09T00:00:00.000","2021-12-24T00:00:00.000",,,,,,,,,,,,,,,,,,,,,,"20211221","2021-12-21T00:00:00.000",,,,,"https://opendata.rdw.nl/resource/3huj-srit.json","https://opendata.rdw.nl/resource/8ys7-d773.json","https://opendata.rdw.nl/resource/vezc-m2t6.json","https://opendata.rdw.nl/resource/jhie-znh9.json","https://opendata.rdw.nl/resource/kmfi-hrps.json"
"ND712F","Personenauto","MERCEDES-BENZ","C 250 D","20250409","20220103","7987","coupe","4","ZWART","Niet geregistreerd","4","2143","1545","2125","1645","750","1800","20170112","20170112","Geen verstrekking in Open Data","63764","Ja",,,,,,,"2","4","0","0",,"476","188","M1",,,"onder r. voorzitting","2125","204",,"e1*2001/116*0431*39","R304P0","CZAA0414","0","0.09","284","Nee","Ja",,"Nee","3995","0","0.00","2024","Logisch","00","Nee","2025-04-09T00:00:00.000","2022-01-03T00:00:00.000","2017-01-12T00:00:00.000","2017-01-12T00:00:00.000",,,,,,,,,,,"142",,,,,,,,,,"E","20220324","2022-03-24T00:00:00.000",,,,,"https://opendata.rdw.nl/resource/3huj-srit.json","https://opendata.rdw.nl/resource/8ys7-d773.json","https://opendata.rdw.nl/resource/vezc-m2t6.json","https://opendata.rdw.nl/resource/jhie-znh9.json","https://opendata.rdw.nl/resource/kmfi-hrps.json"
"NG476J","Personenauto","MERCEDES-BENZ","C 250 D","20250513","20240214","5149","coupe","4","WIT","Niet geregistreerd","4","2143","1545","2125","1645","750","1800","20160224","20170127","Geen verstrekking in Open Data","72493","Ja",,,,,,,"2","4","0","0",,"0","0","M1",,,"r. bodemplaat by voorzitting","2125","204",,"e1*2001/116*0431*38","R304P0","CZAA0474","0","0.09","284","Nee","Ja",,"Nee","3995","0","0.00","2024","Geen oordeel","05","Ja","2025-05-13T00:00:00.000","2024-02-14T00:00:00.000","2016-02-24T00:00:00.000","2017-01-27T00:00:00.000",,,,,,,,,,,,,,,,,,,,,"E",,,,,,,"https://opendata.rdw.nl/resource/3huj-srit.json","https://opendata.rdw.nl/resource/8ys7-d773.json","https://opendata.rdw.nl/resource/vezc-m2t6.json","https://opendata.rdw.nl/resource/jhie-znh9.json","https://opendata.rdw.nl/resource/kmfi-hrps.json"
"NJ440Z","Personenauto","MERCEDES-BENZ","C 250 D","20250227","20210629","5923","coupe","4","ZWART","Niet geregistreerd","4","2143","1545","2125","1645","750","1800","20160205","20170213","Geen verstrekking in Open Data","77741","Ja",,,,,,,"2","4","0","0",,"0","0","M1",,,"r. bodemplaat by voorzitting","2125","204",,"e1*2001/116*0431*37","R304P0","CZAA0472","0","0.09","284","Nee","Ja",,"Nee","3995","0","0.00","2024","Geen oordeel","05","Ja","2025-02-27T00:00:00.000","2021-06-29T00:00:00.000","2016-02-05T00:00:00.000","2017-02-13T00:00:00.000",,,,,,,,,,,,,,,,,,,,,"D",,,,,,,"https://opendata.rdw.nl/resource/3huj-srit.json","https://opendata.rdw.nl/resource/8ys7-d773.json","https://opendata.rdw.nl/resource/vezc-m2t6.json","https://opendata.rdw.nl/resource/jhie-znh9.json","https://opendata.rdw.nl/resource/kmfi-hrps.json"
"NK821B","Personenauto","MERCEDES-BENZ","C 250 D","20241217","20200306","5230","coupe","4","ZWART","Niet geregistreerd","4","2143","1545","2125","1645","750","1800","20151217","20170227","Geen verstrekking in Open Data","67370","Ja",,,,,,,"2","4","0","0",,"0","0","M1",,,"r. bodemplaat by voorzitting","2125","204",,"e1*2001/116*0431*37","R304P0","CZAA0474","0","0.09","284","Nee","Nee",,"Nee","3995","0","0.00","2023","Geen oordeel","05","Ja","2024-12-17T00:00:00.000","2020-03-06T00:00:00.000","2015-12-17T00:00:00.000","2017-02-27T00:00:00.000",,,,,,,,,,,,,,,,,,,,,"C",,,,,,,"https://opendata.rdw.nl/resource/3huj-srit.json","https://opendata.rdw.nl/resource/8ys7-d773.json","https://opendata.rdw.nl/resource/vezc-m2t6.json","https://opendata.rdw.nl/resource/jhie-znh9.json","https://opendata.rdw.nl/resource/kmfi-hrps.json"
"NN524L","Personenauto","MERCEDES-BENZ","C 250 D","20240724","20170323","5442","coupe","4","ROOD","Niet geregistreerd","4","2143","1545","2105","1645","750","1800","20150724","20170323","Geen verstrekking in Open Data","76058","Ja",,,,,,,"2","4",,,,,,"M1",,,"r. dwarsbalk by voorzitting","2105",,,,,,,"0.09","284","Nee","Nee",,"Nee",,,,"2024","Geen oordeel","05","Ja","2024-07-24T00:00:00.000","2017-03-23T00:00:00.000","2015-07-24T00:00:00.000","2017-03-23T00:00:00.000",,,,,,,,,,,,,,,,,,,,,,,,,,,,"https://opendata.rdw.nl/resource/3huj-srit.json","https://opendata.rdw.nl/resource/8ys7-d773.json","https://opendata.rdw.nl/resource/vezc-m2t6.json","https://opendata.rdw.nl/resource/jhie-znh9.json","https://opendata.rdw.nl/resource/kmfi-hrps.json"