"kenteken","voertuigsoort","merk","handelsbenaming","vervaldatum_apk","datum_tenaamstelling","bruto_bpm","inrichting","aantal_zitplaatsen","eerste_kleur","tweede_kleur","aantal_cilinders","cilinderinhoud","massa_ledig_voertuig","toegestane_maximum_massa_voertuig","massa_rijklaar","maximum_massa_trekken_ongeremd","maximum_trekken_massa_geremd","datum_eerste_toelating","datum_eerste_tenaamstelling_in_nederland","wacht_op_keuren","catalogusprijs","wam_verzekerd","maximale_constructiesnelheid","laadvermogen","oplegger_geremd","aanhangwagen_autonoom_geremd","aanhangwagen_middenas_geremd","aantal_staanplaatsen","aantal_deuren","aantal_wielen","afstand_hart_koppeling_tot_achterzijde_voertuig","afstand_voorzijde_voertuig_tot_hart_koppeling","afwijkende_maximum_snelheid","lengte","breedte","europese_voertuigcategorie","europese_voertuigcategorie_toevoeging","europese_uitvoeringcategorie_toevoeging","plaats_chassisnummer","technische_max_massa_voertuig","type","type_gasinstallatie","typegoedkeuringsnummer","variant","uitvoering","volgnummer_wijziging_eu_typegoedkeuring","vermogen_massarijklaar","wielbasis","export_indicator","openstaande_terugroepactie_indicator","vervaldatum_tachograaf","taxi_indicator","maximum_massa_samenstelling","aantal_rolstoelplaatsen","maximum_ondersteunende_snelheid","jaar_laatste_registratie_tellerstand","tellerstandoordeel","code_toelichting_tellerstandoordeel","tenaamstellen_mogelijk","vervaldatum_apk_dt","datum_tenaamstelling_dt","datum_eerste_toelating_dt","datum_eerste_tenaamstelling_in_nederland_dt","vervaldatum_tachograaf_dt","maximum_last_onder_de_vooras_sen_tezamen_koppeling","type_remsysteem_voertuig_code","rupsonderstelconfiguratiecode","wielbasis_voertuig_minimum","wielbasis_voertuig_maximum","lengte_voertuig_minimum","lengte_voertuig_maximum","breedte_voertuig_minimum","breedte_voertuig_maximum","hoogte_voertuig","hoogte_voertuig_minimum","hoogte_voertuig_maximum","massa_bedrijfsklaar_minimaal","massa_bedrijfsklaar_maximaal","technisch_toelaatbaar_massa_koppelpunt","maximum_massa_technisch_maximaal","maximum_massa_technisch_minimaal","subcategorie_nederland","verticale_belasting_koppelpunt_getrokken_voertuig","zuinigheidsclassificatie","registratie_datum_goedkeuring_afschrijvingsmoment_bpm","registratie_datum_goedkeuring_afschrijvingsmoment_bpm_dt","gem_lading_wrde","aerodyn_voorz","massa_alt_aandr","verl_cab_ind","api_gekentekende_voertuigen_assen","api_gekentekende_voertuigen_brandstof","api_gekentekende_voertuigen_carrosserie","api_gekentekende_voertuigen_carrosserie_specifiek","api_gekentekende_voertuigen_voertuigklasse"
"G288FB","Personenauto","MERCEDES-BENZ","C 400 4MATIC","20250329","20190919","19781","cabriolet","4","ZWART","Niet geregistreerd","6","2996","1760","2325","1860","750","1800","20190329","20190919","Geen verstrekking in Open Data","101090","Ja","250",,,,,,"2","4","0","0",,"0","0","M1",,,,"2325","204",,"e1*2001/116*0431*51","R45ET1","CLAZ047A","0","0.13","284","Nee","Nee",,"Nee","4195","0","0.00","2023","Geen oordeel","05","Ja","2025-03-29T00:00:00.000","2019-09-19T00:00:00.000","2019-03-29T00:00:00.000","2019-09-19T00:00:00.000",,,,,,,,,,,,,,,,,,,,,,,,,,,,"https://opendata.rdw.nl/resource/3huj-srit.json","https://opendata.rdw.nl/resource/8ys7-d773.json","https://opendata.rdw.nl/resource/vezc-m2t6.json","https://opendata.rdw.nl/resource/jhie-znh9.json","https://opendata.rdw.nl/resource/kmfi-hrps.json"
"G526TT","Personenauto","MERCEDES-BENZ","C 400 4MATIC","20240709","20230421","5736","cabriolet","4","BLAUW","Niet geregistreerd","6","2996","1760","2325","1860","750","1800","20180709","20191129","Geen verstrekking in Open Data","100484","Ja","250",,,,,,"2","4","0","0",,"0","0","M1",,,"r. bodemplaat by voorzitting","2325","204",,"e1*2001/116*0431*48","R45ET1","CLAA047A","0","0.13","284","Nee","Ja",,"Nee","4195","0","0.00","2024","Geen oordeel","05","Ja","2024-07-09T00:00:00.000","2023-04-21T00:00:00.000","2018-07-09T00:00:00.000","2019-11-29T00:00:00.000",,,,,,,,,,,,,,,,,,,,,,,,,,,,"https://opendata.rdw.nl/resource/3huj-srit.json","https://opendata.rdw.nl/resource/8ys7-d773.json","https://opendata.rdw.nl/resource/vezc-m2t6.json","https://opendata.rdw.nl/resource/jhie-znh9.json","https://opendata.rdw.nl/resource/kmfi-hrps.json"
"J563RB","Personenauto","MERCEDES-BENZ","C 400 4MATIC","20240519","20200925","4640","cabriolet","4","ROOD","Niet geregistreerd","6","2996","1705","2285","1805","750","1800","20170720","20200925","Geen verstrekking in Open Data","107389","Nee","250",,,,,,"2","4","0","0",,"0","0","M1",,,,"2285","204",,"e1*2001/116*0431*44","R45EP1","CLAA0414","0","0.14","284","Nee","Nee",,"Nee","4155","0","0.00","2022","Geen oordeel","05","Ja","2024-05-19T00:00:00.000","2020-09-25T00:00:00.000","2017-07-20T00:00:00.000","2020-09-25T00:00:00.000",,,,,,,,,,,,,,,,,,,,,"G",,,,,,,"https://opendata.rdw.nl/resource/3huj-srit.json","https://opendata.rdw.nl/resource/8ys7-d773.json","https://opendata.rdw.nl/resource/vezc-m2t6.json","https://opendata.rdw.nl/resource/jhie-znh9.json","https://opendata.rdw.nl/resource/kmfi-hrps.json"
"K162BB","Personenauto","MERCEDES-BENZ","C 400 4MATIC","20241117","20210614","17867","cabriolet","4","BLAUW","Niet geregistreerd","6","2996","1705","2285","1805","750","1800","20170512","20201117","Geen verstrekking in Open Data","99932","Ja","250",,,,,,"2","4","0","0",,"0","0","M1",,,,"2285","204",,"e1*2001/116*0431*42","R45EP1","CLAA0414","0","0.14","284","Nee","Ja",,"Nee","4155","0","0.00","2023","Geen oordeel","05","Ja","2024-11-17T00:00:00.000","2021-06-14T00:00:00.000","2017-05-12T00:00:00.000","2020-11-17T00:00:00.000",,,,,,,,,,,,,,,,,,,,,"G",,,,,,,"https://opendata.rdw.nl/resource/3huj-srit.json","https://opendata.rdw.nl/resource/8ys7-d773.json","https://opendata.rdw.nl/resource/vezc-m2t6.json","https://opendata.rdw.nl/resource/jhie-znh9.json","https://opendata.rdw.nl/resource/kmfi-hrps.json"
"KZ493L","Personenauto","MERCEDES-BENZ","C 400 4MATIC","20250327","20210820","16475","cabriolet","4","ROOD","Niet geregistreerd","6","2996","1705","2285","1805","750","1800","20170103","20170103","Geen verstrekking in Open Data","97491","Ja",,,,,,,"2","4","0","0",,"476","188","M1",,,"onder r. voorzitting","2285","204",,"e1*2001/116*0431*40","R45EP1","CLAA0401","0","0.14","284","Nee","Nee",,"Nee","4155","0","0.00","2024","Onlogisch","04","Ja","2025-03-27T00:00:00.000","2021-08-20T00:00:00.000","2017-01-03T00:00:00.000","2017-01-03T00:00:00.000",,,,,,,,,,,"142",,,,,,,,,,"F",,,,,,,"https://opendata.rdw.nl/resource/3huj-srit.json","https://opendata.rdw.nl/resource/8ys7-d773.json","https://opendata.rdw.nl/resource/vezc-m2t6.json","https://opendata.rdw.nl/resource/jhie-znh9.json","https://opendata.rdw.nl/resource/kmfi-hrps.json"
"KZ516T","Personenauto","MERCEDES-BENZ","C 400 4MATIC","20250103","20240119","17909","cabriolet","4","ZWART","Niet geregistreerd","6","2996","1705","2285","1805","750","1800","20170103","20170103","Geen verstrekking in Open Data","94412","Ja",,,,,,,"2","4","0","0",,"476","188","M1",,,"onder r. voorzitting","2285","204",,"e1*2001/116*0431*39","R45EP1","CLAA0402","0","0.14","284","Nee","Nee",,"Nee","4155","0","0.00","2024","Logisch","00","Ja","2025-01-03T00:00:00.000","2024-01-19T00:00:00.000","2017-01-03T00:00:00.000","2017-01-03T00:00:00.000",,,,,,,,,,,"142",,,,,,,,,,"G",,,,,,,"https://opendata.rdw.nl/resource/3huj-srit.json","https://opendata.rdw.nl/resource/8ys7-d773.json","https://opendata.rdw.nl/resource/vezc-m2t6.json","https://opendata.rdw.nl/resource/jhie-znh9.json","https://opendata.rdw.nl/resource/kmfi-hrps.json"
"L322KP","Personenauto","MERCEDES-BENZ","C 400 4MATIC","20251024","20231219","17249","cabriolet","4","BLAUW","Niet geregistreerd","6","2996","1705","2285","1805","750","1800","20170517","20210607","Geen verstrekking in Open Data","91069","Ja","250",,,,,,"2","4",,,,,,"M1",,,,"2285","204",,"e1*2001/116*0431*42","R45EP1","CLAA0472","0","0.14","284","Nee","Ja",,"Nee","4155",,,"2023","Geen oordeel","05","Ja","2025-10-24T00:00:00.000","2023-12-19T00:00:00.000","2017-05-17T00:00:00.000","2021-06-07T00:00:00.000",,,,,,,,,,,,,,,,,,,,,,,,,,,,"https://opendata.rdw.nl/resource/3huj-srit.json","https://opendata.rdw.nl/resource/8ys7-d773.json","https://opendata.rdw.nl/resource/vezc-m2t6.json","https://opendata.rdw.nl/resource/jhie-znh9.json","https://opendata.rdw.nl/resource/kmfi-hrps.json"
"L396RD","Personenauto","MERCEDES-BENZ","C 400 4MATIC","20240929","20220930","14830","cabriolet","4","GRIJS","Niet geregistreerd","6","2996","1705","2285","1805","750","1800","20170327","20220930","Geen verstrekking in Open Data","87854","Ja","250",,,,,,"2","4","0","0",,"0","0","M1",,,,"2285","204",,"e1*2001/116*0431*39","R45EP1","CLAZ0414","0","0.14","284","Nee","Nee",,"Nee","4155","0","0.00","2024","Geen oordeel","05","Ja","2024-09-29T00:00:00.000","2022-09-30T00:00:00.000","2017-03-27T00:00:00.000","2022-09-30T00:00:00.000",,,,,,,,,,,,,,,,,,,,,,,,,,,,"https://opendata.rdw.nl/resource/3huj-srit.json","https://opendata.rdw.nl/resource/8ys7-d773.json","https://opendata.rdw.nl/resource/vezc-m2t6.json","https://opendata.rdw.nl/resource/jhie-znh9.json","https://opendata.rdw.nl/resource/kmfi-hrps.json"
"L622RR","Personenauto","MERCEDES-BENZ","C 400 4MATIC","20250131","20231123","12273","cabriolet","4","BLAUW","Niet geregistreerd","6","2996","1705","2285","1805","750","1800","20161107","20210714","Geen verstrekking in Open Data","93162","Nee","250",,,,,,"2","4",,,,,,"M1",,,,"2285","204",,"e1*2001/116*0431*39","R45EP1","CLAA0474","0","0.14","284","Nee","Ja",,"Nee","4155",,,"2023","Geen oordeel","05","Ja","2025-01-31T00:00:00.000","2023-11-23T00:00:00.000","2016-11-07T00:00:00.000","2021-07-14T00:00:00.000",,,,,,,,,,,,,,,,,,,,,,,,,,,,"https://opendata.rdw.nl/resource/3huj-srit.json","https://opendata.rdw.nl/resource/8ys7-d773.json","https://opendata.rdw.nl/resource/vezc-m2t6.json","https://opendata.rdw.nl/resource/jhie-znh9.json","https://opendata.rdw.nl/resource/kmfi-hrps.json"
"L838HX","Personenauto","MERCEDES-BENZ","C 400 4MATIC","20250111","20230112","10746","cabriolet","4","BLAUW","Niet geregistreerd","6","2996","1705","2285","1805","750","1800","20170316","20210529","Geen verstrekking in Open Data","108079","Ja","250",,,,,,"2","4","0","0",,"0","0","M1",,,,"2285","204",,"e1*2001/116*0431*41","R45EP1","CLAA0414","0","0.14","284","Nee","Nee",,"Nee","4155","0","0.00","2024","Geen oordeel","05","Ja","2025-01-11T00:00:00.000","2023-01-12T00:00:00.000","2017-03-16T00:00:00.000","2021-05-29T00:00:00.000",,,,,,,,,,,,,,,,,,,,,,,,,,,,"https://opendata.rdw.nl/resource/3huj-srit.json","https://opendata.rdw.nl/resource/8ys7-d773.json","https://opendata.rdw.nl/resource/vezc-m2t6.json","https://opendata.rdw.nl/resource/jhie-znh9.json","https://opendata.rdw.nl/resource/kmfi-hrps.json"
"N481KD","Personenauto","MERCEDES-BENZ","C 400 4MATIC","20251201","20211120","18142","cabriolet","4","WIT","Niet geregistreerd","6","2996","1760","2325","1860","750","1800","20180829","20211102","Geen verstrekking in Open Data","95564","Ja","250",,,,,,"2","4",,,,,,"M1",,,,"2325","204",,"e1*2001/116*0431*48","R45ET1","CLAZ047A","0","0.13","284","Nee","Ja",,"Nee","4195",,,"2023","Geen oordeel","05","Ja","2025-12-01T00:00:00.000","2021-11-20T00:00:00.000","2018-08-29T00:00:00.000","2021-11-02T00:00:00.000",,,,,,,,,,,,,,,,,,,,,,"20211027","2021-10-27T00:00:00.000",,,,,"https://opendata.rdw.nl/resource/3huj-srit.json","https://opendata.rdw.nl/resource/8ys7-d773.json","https://opendata.rdw.nl/resource/vezc-m2t6.json","https://opendata.rdw.nl/resource/jhie-znh9.json","https://opendata.rdw.nl/resource/kmfi-hrps.json"
"NB096N","Personenauto","MERCEDES-BENZ","C 400 4MATIC","20250805","20180227","20299","cabriolet","4","ROOD","Niet geregistreerd","6","2996","1705","2285","1805","750","1800","20170223","20170223","Geen verstrekking in Open Data","104972","Ja",,,,,,,"2","4","0","0",,"476","188","M1",,,"onder r. voorzitting","2285","204",,"e1*2001/116*0431*39","R45EP1","CLAZ0414","0","0.14","284","Nee","Nee",,"Nee","4155","0","0.00","2023","Logisch","00","Ja","2025-08-05T00:00:00.000","2018-02-27T00:00:00.000","2017-02-23T00:00:00.000","2017-02-23T00:00:00.000",,,,,,,,,,,"142",,,,,,,,,,"G",,,,,,,"https://opendata.rdw.nl/resource/3huj-srit.json","https://opendata.rdw.nl/resource/8ys7-d773.json","https://opendata.rdw.nl/resource/vezc-m2t6.json","https://opendata.rdw.nl/resource/jhie-znh9.json","https://opendata.rdw.nl/resource/kmfi-hrps.json"
"NB298N","Personenauto","MERCEDES-BENZ","C 400 4MATIC","20250130","20231229","20299","cabriolet","4","ZWART","Niet geregistreerd","6","2996","1705","2285","1805","750","1800","20170102","20170102","Geen verstrekking in Open Data","101068","Ja",,,,,,,"2","4","0","0",,"476","188","M1",,,"onder r. voorzitting","2285","204",,"e1*2001/116*0431*39","R45EP1","CLAA0414","0","0.14","284","Nee","Nee",,"Nee","4155","0","0.00","2024","Logisch","00","Ja","2025-01-30T00:00:00.000","2023-12-29T00:00:00.000","2017-01-02T00:00:00.000","2017-01-02T00:00:00.000",,,,,,,,,,,"142",,,,,,,,,,"G",,,,,,,"https://opendata.rdw.nl/resource/3huj-srit.json","https://opendata.rdw.nl/resource/8ys7-d773.json","https://opendata.rdw.nl/resource/vezc-m2t6.json","https://opendata.rdw.nl/resource/jhie-znh9.json","https://opendata.rdw.nl/resource/kmfi-hrps.json"
"NH431B","Personenauto","MERCEDES-BENZ","C 400 4MATIC","20251113","20231118","23440","cabriolet","4","GRIJS","Niet geregistreerd","6","2996","1705","2285","1805","750","1800","20170124","20170124","Geen verstrekking in Open Data","106928","Ja",,,,,,,"2","4","0","0",,"476","188","M1",,,"onder r. voorzitting","2285","204",,"e1*2001/116*0431*41","R45EP1","CLAA0414","0","0.14","284","Nee","Nee",,"Nee","4155","0","0.00","2023","Logisch","00","Ja","2025-11-13T00:00:00.000","2023-11-18T00:00:00.000","2017-01-24T00:00:00.000","2017-01-24T00:00:00.000",,,,,,,,,,,"142",,,,,,,,,,"G",,,,,,,"https://opendata.rdw.nl/resource/3huj-srit.json","https://opendata.rdw.nl/resource/8ys7-d773.json","https://opendata.rdw.nl/resource/vezc-m2t6.json","https://opendata.rdw.nl/resource/jhie-znh9.json","https://opendata.rdw.nl/resource/kmfi-hrps.json"
"NT342R","Personenauto","MERCEDES-BENZ","C 400 4MATIC","20240706","20230925","23440","cabriolet","4","ROOD","Niet geregistreerd","6","2996","1705","2285","1805","750","1800","20170421","20170421","Geen verstrekking in Open Data","112511","Ja",,,,,,,"2","4","0","0",,"476","188","M1",,,"onder r. voorzitting","2285","204",,"e1*2001/116*0431*42","R45EP1","CLAA0414","0","0.14","284","Nee","Nee",,"Nee","4155","0","0.00","2024","Logisch","00","Ja","2024-07-06T00:00:00.000","2023-09-25T00:00:00.000","2017-04-21T00:00:00.000","2017-04-21T00:00:00.000",,,,,,,,,,,"142",,,,,,,,,,"G",,,,,,,"https://opendata.rdw.nl/resource/3huj-srit.json","https://opendata.rdw.nl/resource/8ys7-d773.json","https://opendata.rdw.nl/resource/vezc-m2t6.json","https://opendata.rdw.nl/resource/jhie-znh9.json","https://opendata.rdw.nl/resource/kmfi-hrps.json"
"P695KJ","Personenauto","MERCEDES-BENZ","C 400 4MATIC","20240630","20231028","18563","cabriolet","4","WIT","Niet geregistreerd","6","2996","1705","2285","1805","750","1800","20170505","20220413","Geen verstrekking in Open Data","101612","Ja","250",,,,,,"2","4","0","0",,"0","0","M1",,,,"2285","204",,"e1*2001/116*0431*42","R45EP1","CLAA0474","0","0.14","284","Nee","Ja",,"Nee","4155","0","0.00","2023","Geen oordeel","05","Ja","2024-06-30T00:00:00.000","2023-10-28T00:00:00.000","2017-05-05T00:00:00.000","2022-04-13T00:00:00.000",,,,,,,,,,,,,,,,,,,,,,"20220330","2022-03-30T00:00:00.000",,,,,"https://opendata.rdw.nl/resource/3huj-srit.json","https://opendata.rdw.nl/resource/8ys7-d773.json","https://opendata.rdw.nl/resource/vezc-m2t6.json","https://opendata.rdw.nl/resource/jhie-znh9.json","https://opendata.rdw.nl/resource/kmfi-hrps.json"
"PP838V","Personenauto","MERCEDES-BENZ","C 400 4MATIC","20250825","20170825","21065","cabriolet","4","GRIJS","Niet geregistreerd","6","2996","1705","2285","1805","750","1800","20170825","20170825","Geen verstrekking in Open Data","104458","Nee",,,,,,,"2","4","0","0",,"476","188","M1",,,"onder r. voorzitting","2285","204",,"e1*2001/116*0431*44","R45EP1","CLAA0402","0","0.14","284","Nee","Nee",,"Nee","4155","0","0.00","2023","Logisch","00","Ja","2025-08-25T00:00:00.000","2017-08-25T00:00:00.000","2017-08-25T00:00:00.000","2017-08-25T00:00:00.000",,,,,,,,,,,"142",,,,,,,,,,"G",,,,,,,"https://opendata.rdw.nl/resource/3huj-srit.json","https://opendata.rdw.nl/resource/8ys7-d773.json","https://opendata.rdw.nl/resource/vezc-m2t6.json","https://opendata.rdw.nl/resource/jhie-znh9.json","https://opendata.rdw.nl/resource/kmfi-hrps.json"
"PR069B","Personenauto","MERCEDES-BENZ","C 400 4MATIC","20230823","20220518","19640","cabriolet","4","ROOD","Niet geregistreerd","6","2996","1705","2285","1805","750","1800","20170823","20170823","Geen verstrekking in Open Data","100483","Ja",,,,,,,"2","4","0","0",,"476","188","M1",,,"onder r. voorzitting","2285","204",,"e1*2001/116*0431*42","R45EP1","CLAA0401","0","0.14","284","Nee","Ja",,"Nee","4155","0","0.00","2022","Logisch","00","Ja","2023-08-23T00:00:00.000","2022-05-18T00:00:00.000","2017-08-23T00:00:00.000","2017-08-23T00:00:00.000",,,,,,,,,,,"142",,,,,,,,,,"F",,,,,,,"https://opendata.rdw.nl/resource/3huj-srit.json","https://opendata.rdw.nl/resource/8ys7-d773.json","https://opendata.rdw.nl/resource/vezc-m2t6.json","https://opendata.rdw.nl/resource/jhie-znh9.json","https://opendata.rdw.nl/resource/kmfi-hrps.json"
"PX152T","Personenauto","MERCEDES-BENZ","C 400 4MATIC","20241216","20231124","15598","cabriolet","4","WIT","Niet geregistreerd","6","2996","1705","2285","1805","750","1800","20160928","20170929","Geen verstrekking in Open Data","93224","Ja",,,,,,,"2","4",,,,,,"M1",,,"op dwarsbalk v. r. voorzitting","2285","204",,,,,,"0.14","284","Nee","Nee",,"Nee","4155",,,"2023","Geen oordeel","05","Ja","2024-12-16T00:00:00.000","2023-11-24T00:00:00.000","2016-09-28T00:00:00.000","2017-09-29T00:00:00.000",,,,,,,,,,,,,,,,,,,,,,,,,,,,"https://opendata.rdw.nl/resource/3huj-srit.json","https://opendata.rdw.nl/resource/8ys7-d773.json","https://opendata.rdw.nl/resource/vezc-m2t6.json","https://opendata.rdw.nl/resource/jhie-znh9.json","https://opendata.rdw.nl/resource/kmfi-hrps.json"
"PX360P","Personenauto","MERCEDES-BENZ","C 400 4MATIC","20251122","20211125","23440","cabriolet","4","WIT","Niet geregistreerd","6","2996","1705","2285","1805","750","1800","20171012","20171012","Geen verstrekking in Open Data","110420","Ja",,,,,,,"2","4","0","0",,"476","188","M1",,,"onder r. voorzitting","2285","204",,"e1*2001/116*0431*44","R45EP1","CLAA0414","0","0.14","284","Nee","Nee",,"Nee","4155","0","0.00","2024","Logisch","00","Ja","2025-11-22T00:00:00.000","2021-11-25T00:00:00.000","2017-10-12T00:00:00.000","2017-10-12T00:00:00.000",,,,,,,,,,,"142",,,,,,,,,,"G",,,,,,,"https://opendata.rdw.nl/resource/3huj-srit.json","https://opendata.rdw.nl/resource/8ys7-d773.json","https://opendata.rdw.nl/resource/vezc-m2t6.json","https://opendata.rdw.nl/resource/jhie-znh9.json","https://opendata.rdw.nl/resource/kmfi-hrps.json"
"RH154V","Personenauto","MERCEDES-BENZ","C 400 4MATIC","20260301","20171208","14476","cabriolet","4","BLAUW","Niet geregistreerd","6","2996","1705","2285","1805","750","1800","20170331","20171208","Geen verstrekking in Open Data","107142","Ja",,,,,,,"2","4","0","0",,"0","0","M1",,,"r. bodemplaat by voorzitting","2285","204",,"e1*2001/116*0431*42","R45EP1","CLAA0414","0","0.14","284","Nee","Nee",,"Nee","4155","0","0.00","2024","Geen oordeel","05","Ja","2026-03-01T00:00:00.000","2017-12-08T00:00:00.000","2017-03-31T00:00:00.000","2017-12-08T00:00:00.000",,,,,,,,,,,,,,,,,,,,,"G",,,,,,,"https://opendata.rdw.nl/resource/3huj-srit.json","https://opendata.rdw.nl/resource/8ys7-d773.json","https://opendata.rdw.nl/resource/vezc-m2t6.json","https://opendata.rdw.nl/resource/jhie-znh9.json","https://opendata.rdw.nl/resource/kmfi-hrps.json"
"RJ112N","Personenauto","MERCEDES-BENZ","C 400 4MATIC","20241125","20171129","16130","cabriolet","4","GRIJS","Niet geregistreerd","6","2996","1705","2285","1805","750","1800","20161125","20171129","Geen verstrekking in Open Data","88425","Ja",,,,,,,"2","4","0","0",,"0","0","M1",,,"r. bodemplaat by voorzitting","2285","204",,"e1*2001/116*0431*39","R45EP1","CLAA0412","0","0.14","284","Nee","Nee",,"Nee","4155","0","0.00","2023","Geen oordeel","05","Ja","2024-11-25T00:00:00.000","2017-11-29T00:00:00.000","2016-11-25T00:00:00.000","2017-11-29T00:00:00.000",,,,,,,,,,,,,,,,,,,,,"G",,,,,,,"https://opendata.rdw.nl/resource/3huj-srit.json","https://opendata.rdw.nl/resource/8ys7-d773.json","https://opendata.rdw.nl/resource/vezc-m2t6.json","https://opendata.rdw.nl/resource/jhie-znh9.json","https://opendata.rdw.nl/resource/kmfi-hrps.json"
"RR388S","Personenauto","MERCEDES-BENZ","C 400 4MATIC","20250407","20221207","13606","cabriolet","4","ZWART","Niet geregistreerd","6","2996","1705","2285","1805","750","1800","20170406","20180117","Geen verstrekking in Open Data","106034","Ja",,,,,,,"2","4","0","0",,"0","0","M1",,,"r. bodemplaat by voorzitting","2285","204",,"e1*2001/116*0431*42","R45EP1","CLAA0474","0","0.14","284","Nee","Nee",,"Nee","4155","0","0.00","2023","Geen oordeel","05","Ja","2025-04-07T00:00:00.000","2022-12-07T00:00:00.000","2017-04-06T00:00:00.000","2018-01-17T00:00:00.000",,,,,,,,,,,,,,,,,,,,,"G",,,,,,,"https://opendata.rdw.nl/resource/3huj-srit.json","https://opendata.rdw.nl/resource/8ys7-d773.json","https://opendata.rdw.nl/resource/vezc-m2t6.json","https://opendata.rdw.nl/resource/jhie-znh9.json","https://opendata.rdw.nl/resource/kmfi-hrps.json"
"S712XS","Personenauto","MERCEDES-BENZ","C 400 4MATIC","20251231","20230425","16906","cabriolet","4","BRUIN","Niet geregistreerd","6","2996","1705","2285","1805","750","1800","20170629","20230425","Geen verstrekking in Open Data","91578","Ja","250",,,,,,"2","4",,,,"476","188","M1",,,,"2285","204",,"e1*2001/116*0431*42","R45EP1","CLAA0472","0","0.14","284","Nee","Ja",,"Nee","4155",,,"2023","Geen oordeel","05","Ja","2025-12-31T00:00:00.000","2023-04-25T00:00:00.000","2017-06-29T00:00:00.000","2023-04-25T00:00:00.000",,,,,,,,,,,"142",,,,,,,,,,,"20230423","2023-04-23T00:00:00.000",,,,,"https://opendata.rdw.nl/resource/3huj-srit.json","https://opendata.rdw.nl/resource/8ys7-d773.json","https://opendata.rdw.nl/resource/vezc-m2t6.json","https://opendata.rdw.nl/resource/jhie-znh9.json","https://opendata.rdw.nl/resource/kmfi-hrps.json"
"SG522T","Personenauto","MERCEDES-BENZ","C 400 4MATIC","20250415","20200815","16060","cabriolet","4","BLAUW","Niet geregistreerd","6","2996","1705","2285","1805","750","1800","20160408","20180327","Geen verstrekking in Open Data","100744","Ja",,,,,,,"2","4",,,,,,"M1",,,"r. bodemplaat by voorzitting","2285","204",,,,,,"0.14","285","Nee","Ja",,"Nee",,,,"2024","Geen oordeel","05","Ja","2025-04-15T00:00:00.000","2020-08-15T00:00:00.000","2016-04-08T00:00:00.000","2018-03-27T00:00:00.000",,,,,,,,,,,,,,,,,,,,,,,,,,,,"https://opendata.rdw.nl/resource/3huj-srit.json","https://opendata.rdw.nl/resource/8ys7-d773.json","https://opendata.rdw.nl/resource/vezc-m2t6.json","https://opendata.rdw.nl/resource/jhie-znh9.json","https://opendata.rdw.nl/resource/kmfi-hrps.json"
"SP641H","Personenauto","MERCEDES-BENZ","C 400 4MATIC","20260105","20240116","24959","cabriolet","4","GRIJS","Niet geregistreerd","6","2996","1705","2285","1805","750","1800","20180519","20180519","Geen verstrekking in Open Data","101729","Ja",,,,,,,"2","4","0","0",,"476","188","M1",,,,"2285","204",,"e1*2001/116*0431*46","R45EP1","CLAA0414","0","0.14","284","Nee","Nee",,"Nee","4155","0","0.00","2024","Logisch","00","Ja","2026-01-05T00:00:00.000","2024-01-16T00:00:00.000","2018-05-19T00:00:00.000","2018-05-19T00:00:00.000",,,,,,,,,,,"142",,,,,,,,,,"G",,,,,,,"https://opendata.rdw.nl/resource/3huj-srit.json","https://opendata.rdw.nl/resource/8ys7-d773.json","https://opendata.rdw.nl/resource/vezc-m2t6.json","https://opendata.rdw.nl/resource/jhie-znh9.json","https://opendata.rdw.nl/resource/kmfi-hrps.json"