"kenteken","voertuigsoort","merk","handelsbenaming","vervaldatum_apk","datum_tenaamstelling","bruto_bpm","inrichting","aantal_zitplaatsen","eerste_kleur","tweede_kleur","aantal_cilinders","cilinderinhoud","massa_ledig_voertuig","toegestane_maximum_massa_voertuig","massa_rijklaar","maximum_massa_trekken_ongeremd","maximum_trekken_massa_geremd","datum_eerste_toelating","datum_eerste_tenaamstelling_in_nederland","wacht_op_keuren","catalogusprijs","wam_verzekerd","maximale_constructiesnelheid","laadvermogen","oplegger_geremd","aanhangwagen_autonoom_geremd","aanhangwagen_middenas_geremd","aantal_staanplaatsen","aantal_deuren","aantal_wielen","afstand_hart_koppeling_tot_achterzijde_voertuig","afstand_voorzijde_voertuig_tot_hart_koppeling","afwijkende_maximum_snelheid","lengte","breedte","europese_voertuigcategorie","europese_voertuigcategorie_toevoeging","europese_uitvoeringcategorie_toevoeging","plaats_chassisnummer","technische_max_massa_voertuig","type","type_gasinstallatie","typegoedkeuringsnummer","variant","uitvoering","volgnummer_wijziging_eu_typegoedkeuring","vermogen_massarijklaar","wielbasis","export_indicator","openstaande_terugroepactie_indicator","vervaldatum_tachograaf","taxi_indicator","maximum_massa_samenstelling","aantal_rolstoelplaatsen","maximum_ondersteunende_snelheid","jaar_laatste_registratie_tellerstand","tellerstandoordeel","code_toelichting_tellerstandoordeel","tenaamstellen_mogelijk","vervaldatum_apk_dt","datum_tenaamstelling_dt","datum_eerste_toelating_dt","datum_eerste_tenaamstelling_in_nederland_dt","vervaldatum_tachograaf_dt","maximum_last_onder_de_vooras_sen_tezamen_koppeling","type_remsysteem_voertuig_code","rupsonderstelconfiguratiecode","wielbasis_voertuig_minimum","wielbasis_voertuig_maximum","lengte_voertuig_minimum","lengte_voertuig_maximum","breedte_voertuig_minimum","breedte_voertuig_maximum","hoogte_voertuig","hoogte_voertuig_minimum","hoogte_voertuig_maximum","massa_bedrijfsklaar_minimaal","massa_bedrijfsklaar_maximaal","technisch_toelaatbaar_massa_koppelpunt","maximum_massa_technisch_maximaal","maximum_massa_technisch_minimaal","subcategorie_nederland","verticale_belasting_koppelpunt_getrokken_voertuig","zuinigheidsclassificatie","registratie_datum_goedkeuring_afschrijvingsmoment_bpm","registratie_datum_goedkeuring_afschrijvingsmoment_bpm_dt","gem_lading_wrde","aerodyn_voorz","massa_alt_aandr","verl_cab_ind","api_gekentekende_voertuigen_assen","api_gekentekende_voertuigen_brandstof","api_gekentekende_voertuigen_carrosserie","api_gekentekende_voertuigen_carrosserie_specifiek","api_gekentekende_voertuigen_voertuigklasse"
"2SLT41","Personenauto","MERCEDES-BENZ","B 200","20240915","20181002","7125","MPV","5","BRUIN","Niet geregistreerd","4","2035","1290","1880","1390","645","1500","20070929","20131118","Geen verstrekking in Open Data",,"Ja",,,,,,,"4","4",,,,,,"M1",,,"r. schutbord motorruimte","1880",,,,,,,"0.07","279","Nee","Nee",,"Nee",,,,"2023","Geen oordeel","05","Ja","2024-09-15T00:00:00.000","2018-10-02T00:00:00.000","2007-09-29T00:00:00.000","2013-11-18T00:00:00.000",,"0",,,,,,,,,,,,,,,,,,,,,,,,,,"https://opendata.rdw.nl/resource/3huj-srit.json","https://opendata.rdw.nl/resource/8ys7-d773.json","https://opendata.rdw.nl/resource/vezc-m2t6.json","https://opendata.rdw.nl/resource/jhie-znh9.json","https://opendata.rdw.nl/resource/kmfi-hrps.json"
"2ZFX96","Personenauto","MERCEDES-BENZ","B 200","20240823","20210413","8002","MPV","5","GRIJS","Niet geregistreerd","4","2035","1290","1880","1390","400","1500","20051007","20141224","Geen verstrekking in Open Data",,"Ja",,,,,,,"4","4",,,,,,"M1",,,"schutbord","1880",,,,,,,"0.07","278","Nee","Nee",,"Nee",,,,"2023","Geen oordeel","05","Ja","2024-08-23T00:00:00.000","2021-04-13T00:00:00.000","2005-10-07T00:00:00.000","2014-12-24T00:00:00.000",,"0",,,,,,,,,,,,,,,,,,,,,,,,,,"https://opendata.rdw.nl/resource/3huj-srit.json","https://opendata.rdw.nl/resource/8ys7-d773.json","https://opendata.rdw.nl/resource/vezc-m2t6.json","https://opendata.rdw.nl/resource/jhie-znh9.json","https://opendata.rdw.nl/resource/kmfi-hrps.json"
"36XRGN","Personenauto","MERCEDES-BENZ","B 200","20250512","20190406","9111","MPV","5","GRIJS","Niet geregistreerd","4","2035","1290","1880","1390","400","1500","20060112","20070830","Geen verstrekking in Open Data",,"Ja",,,,,,,"4","4",,,,,,"M1",,,"midden tegen schutbord onder motorkap","1880",,,,,,,"0.07","279","Nee","Nee",,"Nee","3380",,,"2024","Geen oordeel","05","Ja","2025-05-12T00:00:00.000","2019-04-06T00:00:00.000","2006-01-12T00:00:00.000","2007-08-30T00:00:00.000",,"0",,,,,,,,,,,,,,,,,,,,,,,,,,"https://opendata.rdw.nl/resource/3huj-srit.json","https://opendata.rdw.nl/resource/8ys7-d773.json","https://opendata.rdw.nl/resource/vezc-m2t6.json","https://opendata.rdw.nl/resource/jhie-znh9.json","https://opendata.rdw.nl/resource/kmfi-hrps.json"
"3SNB25","Personenauto","MERCEDES-BENZ","B 200 TURBO","20240610","20200904","516","MPV","5","GRIJS","Niet geregistreerd","4","2035","1305","1880","1405","400","1500","20060327","20131102","Geen verstrekking in Open Data","49064","Ja",,,,,,,"4","4",,,,,,"M1",,,"schutbord","1880","245",,,,,,"0.10","277","Nee","Nee",,"Nee",,,,"2023","Geen oordeel","05","Ja","2024-06-10T00:00:00.000","2020-09-04T00:00:00.000","2006-03-27T00:00:00.000","2013-11-02T00:00:00.000",,"0",,,,,,,,,,,,,,,,,,,,,,,,,,"https://opendata.rdw.nl/resource/3huj-srit.json","https://opendata.rdw.nl/resource/8ys7-d773.json","https://opendata.rdw.nl/resource/vezc-m2t6.json","https://opendata.rdw.nl/resource/jhie-znh9.json","https://opendata.rdw.nl/resource/kmfi-hrps.json"
"54NXL8","Personenauto","MERCEDES-BENZ","B 200","20241103","20130404","7705","MPV","5","GRIJS","Niet geregistreerd","4","2035","1290","1880","1390","400","1500","20060111","20101209","Geen verstrekking in Open Data",,"Ja",,,,,,,"4","4",,,,,,"M1",,,"v. by schutbord","1880",,,,,,,"0.07","278","Nee","Nee",,"Nee",,,,"2023","Geen oordeel","05","Ja","2024-11-03T00:00:00.000","2013-04-04T00:00:00.000","2006-01-11T00:00:00.000","2010-12-09T00:00:00.000",,"0",,,,,,,,,,,,,,,,,,,,,,,,,,"https://opendata.rdw.nl/resource/3huj-srit.json","https://opendata.rdw.nl/resource/8ys7-d773.json","https://opendata.rdw.nl/resource/vezc-m2t6.json","https://opendata.rdw.nl/resource/jhie-znh9.json","https://opendata.rdw.nl/resource/kmfi-hrps.json"
"56ZHV8","Personenauto","MERCEDES-BENZ","B 200","20240718","20220915","9542","MPV","5","ROOD","Niet geregistreerd","4","2034","1290","1880","1390",,,"20090908","20121116","Geen verstrekking in Open Data",,"Ja",,,,,,,"4","4",,,,,,"M1",,,"r. schutbord motorruimte","1880",,,,,,,"0.10","278","Nee","Nee",,"Nee",,,,"2023","Onlogisch","04","Ja","2024-07-18T00:00:00.000","2022-09-15T00:00:00.000","2009-09-08T00:00:00.000","2012-11-16T00:00:00.000",,"0",,,,,,,,,,,,,,,,,,,,,,,,,,"https://opendata.rdw.nl/resource/3huj-srit.json","https://opendata.rdw.nl/resource/8ys7-d773.json","https://opendata.rdw.nl/resource/vezc-m2t6.json","https://opendata.rdw.nl/resource/jhie-znh9.json","https://opendata.rdw.nl/resource/kmfi-hrps.json"
"6TGD02","Personenauto","MERCEDES-BENZ","B 200","20241010","20240214","8657","MPV","5","ZWART","Niet geregistreerd","4","2035","1290","1880","1390","400","1500","20051017","20140117","Geen verstrekking in Open Data",,"Ja",,,,,,,"4","4",,,,,,"M1",,,"r. by schutbord","1880",,,,,,,"0.07","277","Nee","Nee",,"Nee","3380",,,"2024","Geen oordeel","05","Ja","2024-10-10T00:00:00.000","2024-02-14T00:00:00.000","2005-10-17T00:00:00.000","2014-01-17T00:00:00.000",,"0",,,,,,,,,,,,,,,,,,,,,,,,,,"https://opendata.rdw.nl/resource/3huj-srit.json","https://opendata.rdw.nl/resource/8ys7-d773.json","https://opendata.rdw.nl/resource/vezc-m2t6.json","https://opendata.rdw.nl/resource/jhie-znh9.json","https://opendata.rdw.nl/resource/kmfi-hrps.json"
"7SVF26","Personenauto","MERCEDES-BENZ","B 200","20250202","20230901","7701","MPV","5","ZWART","Niet geregistreerd","4","2035","1290","1880","1390","400","1500","20060102","20131212","Geen verstrekking in Open Data",,"Ja",,,,,,,"4","4",,,,,,"M1",,,"r. schutbord","1880",,,,,,,"0.07","278","Nee","Nee",,"Nee",,,,"2024","Geen oordeel","05","Ja","2025-02-02T00:00:00.000","2023-09-01T00:00:00.000","2006-01-02T00:00:00.000","2013-12-12T00:00:00.000",,"0",,,,,,,,,,,,,,,,,,,,,,,,,,"https://opendata.rdw.nl/resource/3huj-srit.json","https://opendata.rdw.nl/resource/8ys7-d773.json","https://opendata.rdw.nl/resource/vezc-m2t6.json","https://opendata.rdw.nl/resource/jhie-znh9.json","https://opendata.rdw.nl/resource/kmfi-hrps.json"
"7ZLS85","Personenauto","MERCEDES-BENZ","B 200","20250511","20230524","7782","MPV","5","ZWART","Niet geregistreerd","4","2035","1290","1880","1390","400","1500","20051223","20150127","Geen verstrekking in Open Data",,"Ja",,,,,,,"5","4",,,,,,"M1",,,"schutbord","1880",,,,,,,"0.07","279","Nee","Nee",,"Nee",,,,"2024","Geen oordeel","05","Ja","2025-05-11T00:00:00.000","2023-05-24T00:00:00.000","2005-12-23T00:00:00.000","2015-01-27T00:00:00.000",,"0",,,,,,,,,,,,,,,,,,,,,,,,,,"https://opendata.rdw.nl/resource/3huj-srit.json","https://opendata.rdw.nl/resource/8ys7-d773.json","https://opendata.rdw.nl/resource/vezc-m2t6.json","https://opendata.rdw.nl/resource/jhie-znh9.json","https://opendata.rdw.nl/resource/kmfi-hrps.json"
"GG288G","Personenauto","MERCEDES-BENZ","B 200","20241125","20201127","7387","MPV","5","GRIJS","Niet geregistreerd","4","2035","1290","1880","1390","400","1500","20060412","20150512","Geen verstrekking in Open Data",,"Ja",,,,,,,"4","4",,,,,,"M1",,,"schutbord motorruimte","1880",,,,,,,"0.07","278","Nee","Nee",,"Nee",,,,"2023","Geen oordeel","05","Ja","2024-11-25T00:00:00.000","2020-11-27T00:00:00.000","2006-04-12T00:00:00.000","2015-05-12T00:00:00.000",,,,,,,,,,,,,,,,,,,,,,,,,,,,"https://opendata.rdw.nl/resource/3huj-srit.json","https://opendata.rdw.nl/resource/8ys7-d773.json","https://opendata.rdw.nl/resource/vezc-m2t6.json","https://opendata.rdw.nl/resource/jhie-znh9.json","https://opendata.rdw.nl/resource/kmfi-hrps.json"
"HB029G","Personenauto","MERCEDES-BENZ","B 200","20240701","20220702","7359","MPV","5","BLAUW","Niet geregistreerd","4","2035","1245","1880","1345","400","1500","20051122","20151003","Geen verstrekking in Open Data",,"Ja",,,,,,,"4","4",,,,,,"M1",,,"schutbord motorruimte","1880",,,,,,,"0.07","278","Nee","Nee",,"Nee",,,,"2023","Geen oordeel","05","Ja","2024-07-01T00:00:00.000","2022-07-02T00:00:00.000","2005-11-22T00:00:00.000","2015-10-03T00:00:00.000",,,,,,,,,,,,,,,,,,,,,,,,,,,,"https://opendata.rdw.nl/resource/3huj-srit.json","https://opendata.rdw.nl/resource/8ys7-d773.json","https://opendata.rdw.nl/resource/vezc-m2t6.json","https://opendata.rdw.nl/resource/jhie-znh9.json","https://opendata.rdw.nl/resource/kmfi-hrps.json"
"HF779T","Personenauto","MERCEDES-BENZ","B 200 TURBO","20250207","20240205","1058","MPV","5","GRIJS","Niet geregistreerd","4","2035","1314","1880","1414","400","1500","20050616","20151128","Geen verstrekking in Open Data","45519","Ja",,,,,,,"4","4",,,,,,"M1",,,"r. schutbord by motorruimte","1880",,"G3 gasinstallatie",,,,,"0.10","278","Nee","Nee",,"Nee","3380",,,"2024","Geen oordeel","05","Ja","2025-02-07T00:00:00.000","2024-02-05T00:00:00.000","2005-06-16T00:00:00.000","2015-11-28T00:00:00.000",,,,,,,,,,,,,,,,,,,,,,,,,,,,"https://opendata.rdw.nl/resource/3huj-srit.json","https://opendata.rdw.nl/resource/8ys7-d773.json","https://opendata.rdw.nl/resource/vezc-m2t6.json","https://opendata.rdw.nl/resource/jhie-znh9.json","https://opendata.rdw.nl/resource/kmfi-hrps.json"
"HG634J","Personenauto","MERCEDES-BENZ","B 200 TURBO","20250404","20220422","6605","MPV","5","GRIJS","Niet geregistreerd","4","2035","1305","1880","1405","400","1500","20060131","20160126","Geen verstrekking in Open Data","45085","Ja",,,,,,,"4","4",,,,,,"M1",,,"v. schutbord by motorruimte","1880",,,,,,,"0.10","278","Nee","Nee",,"Nee",,,,"2024","Geen oordeel","05","Ja","2025-04-04T00:00:00.000","2022-04-22T00:00:00.000","2006-01-31T00:00:00.000","2016-01-26T00:00:00.000",,,,,,,,,,,,,,,,,,,,,,,,,,,,"https://opendata.rdw.nl/resource/3huj-srit.json","https://opendata.rdw.nl/resource/8ys7-d773.json","https://opendata.rdw.nl/resource/vezc-m2t6.json","https://opendata.rdw.nl/resource/jhie-znh9.json","https://opendata.rdw.nl/resource/kmfi-hrps.json"
"HK811B","Personenauto","MERCEDES-BENZ","B 200 TURBO","20240618","20230929","3390","MPV","5","GEEL","Niet geregistreerd","4","2035","1305","1880","1405","400","1500","20060119","20151118","Geen verstrekking in Open Data","45338","Ja",,,,,,,"4","4",,,,,,"M1",,,"v. schutbord by motorruimte","1880","245",,,,,,"0.10","278","Nee","Nee",,"Nee","3380",,,"2023","Geen oordeel","05","Ja","2024-06-18T00:00:00.000","2023-09-29T00:00:00.000","2006-01-19T00:00:00.000","2015-11-18T00:00:00.000",,,,,,,,,,,,,,,,,,,,,,,,,,,,"https://opendata.rdw.nl/resource/3huj-srit.json","https://opendata.rdw.nl/resource/8ys7-d773.json","https://opendata.rdw.nl/resource/vezc-m2t6.json","https://opendata.rdw.nl/resource/jhie-znh9.json","https://opendata.rdw.nl/resource/kmfi-hrps.json"
"JL168R","Personenauto","MERCEDES-BENZ","B 200","20250322","20210921","7697","MPV","5","GRIJS","Niet geregistreerd","4","2035","1290","1880","1390","400","1500","20051128","20160526","Geen verstrekking in Open Data",,"Ja",,,,,,,"4","4",,,,,,"M1",,,"schutbord by motorruimte","1880","245",,,,,,"0.07","278","Nee","Nee",,"Nee",,,,"2024","Geen oordeel","05","Ja","2025-03-22T00:00:00.000","2021-09-21T00:00:00.000","2005-11-28T00:00:00.000","2016-05-26T00:00:00.000",,,,,,,,,,,,,,,,,,,,,,,,,,,,"https://opendata.rdw.nl/resource/3huj-srit.json","https://opendata.rdw.nl/resource/8ys7-d773.json","https://opendata.rdw.nl/resource/vezc-m2t6.json","https://opendata.rdw.nl/resource/jhie-znh9.json","https://opendata.rdw.nl/resource/kmfi-hrps.json"
"JT347T","Personenauto","MERCEDES-BENZ","B 200","20231007","20230417","940","MPV","5","ZWART","Niet geregistreerd","4","2035","1290","1880","1390","400","1500","20050729","20161007","Geen verstrekking in Open Data","38235","Ja",,,,,,,"4","4",,,,,,"M1",,,"schutbord motorruimte","1880","245",,,,,,"0.07","278","Nee","Nee",,"Nee","3380",,,"2023","Geen oordeel","05","Ja","2023-10-07T00:00:00.000","2023-04-17T00:00:00.000","2005-07-29T00:00:00.000","2016-10-07T00:00:00.000",,,,,,,,,,,,,,,,,,,,,,,,,,,,"https://opendata.rdw.nl/resource/3huj-srit.json","https://opendata.rdw.nl/resource/8ys7-d773.json","https://opendata.rdw.nl/resource/vezc-m2t6.json","https://opendata.rdw.nl/resource/jhie-znh9.json","https://opendata.rdw.nl/resource/kmfi-hrps.json"
"KB179D","Personenauto","MERCEDES-BENZ","B 200","20240722","20240228","7671","MPV","5","GRIJS","Niet geregistreerd","4","2035","1290","1880","1390","400","1500","20051025","20160723","Geen verstrekking in Open Data",,"Ja",,,,,,,"4","4",,,,,,"M1",,,"r. schutbord","1880","245",,,,,,"0.07","278","Nee","Nee",,"Nee","3380",,,"2024","Geen oordeel","05","Ja","2024-07-22T00:00:00.000","2024-02-28T00:00:00.000","2005-10-25T00:00:00.000","2016-07-23T00:00:00.000",,,,,,,,,,,,,,,,,,,,,,,,,,,,"https://opendata.rdw.nl/resource/3huj-srit.json","https://opendata.rdw.nl/resource/8ys7-d773.json","https://opendata.rdw.nl/resource/vezc-m2t6.json","https://opendata.rdw.nl/resource/jhie-znh9.json","https://opendata.rdw.nl/resource/kmfi-hrps.json"
"KN156B","Personenauto","MERCEDES-BENZ","B 200 TURBO","20250415","20231104","8359","MPV","5","ZWART","Niet geregistreerd","4","2035","1305","1880","1405","400","1500","20060410","20161024","Geen verstrekking in Open Data",,"Ja",,,,,,,"4","4",,,,,,"M1",,,"schutbord by motorruimte","1880","245",,,,,,"0.10","279","Nee","Nee",,"Nee",,,,"2024","Geen oordeel","05","Ja","2025-04-15T00:00:00.000","2023-11-04T00:00:00.000","2006-04-10T00:00:00.000","2016-10-24T00:00:00.000",,,,,,,,,,,,,,,,,,,,,,,,,,,,"https://opendata.rdw.nl/resource/3huj-srit.json","https://opendata.rdw.nl/resource/8ys7-d773.json","https://opendata.rdw.nl/resource/vezc-m2t6.json","https://opendata.rdw.nl/resource/jhie-znh9.json","https://opendata.rdw.nl/resource/kmfi-hrps.json"
"N514RV","Personenauto","MERCEDES-BENZ","B 200 TURBO","20240630","20220205","8600","MPV","5","GRIJS","Niet geregistreerd","4","2035","1270","1880","1370","400","1500","20050830","20220205","Geen verstrekking in Open Data",,"Ja","225",,,,,,"4","4",,,,,,"M1",,,,"1880","245",,,,,,"0.10","278","Nee","Nee",,"Nee",,,,"2023","Geen oordeel","05","Ja","2024-06-30T00:00:00.000","2022-02-05T00:00:00.000","2005-08-30T00:00:00.000","2022-02-05T00:00:00.000",,,,,,,,,,,,,,,,,,,,,,"20211126","2021-11-26T00:00:00.000",,,,,"https://opendata.rdw.nl/resource/3huj-srit.json","https://opendata.rdw.nl/resource/8ys7-d773.json","https://opendata.rdw.nl/resource/vezc-m2t6.json","https://opendata.rdw.nl/resource/jhie-znh9.json","https://opendata.rdw.nl/resource/kmfi-hrps.json"
"N901TG","Personenauto","MERCEDES-BENZ","B 200","20241228","20240425","6559","MPV","5","BLAUW","Niet geregistreerd","4","2035","1245","1880","1345","400","1500","20051222","20211229","Geen verstrekking in Open Data",,"Ja","196",,,,,,"4","4",,,,,,"M1",,,,"1880","245",,,,,,"0.07","278","Nee","Nee",,"Nee",,,,"2024","Geen oordeel","05","Ja","2024-12-28T00:00:00.000","2024-04-25T00:00:00.000","2005-12-22T00:00:00.000","2021-12-29T00:00:00.000",,,,,,,,,,,,,,,,,,,,,,"20211217","2021-12-17T00:00:00.000",,,,,"https://opendata.rdw.nl/resource/3huj-srit.json","https://opendata.rdw.nl/resource/8ys7-d773.json","https://opendata.rdw.nl/resource/vezc-m2t6.json","https://opendata.rdw.nl/resource/jhie-znh9.json","https://opendata.rdw.nl/resource/kmfi-hrps.json"
"NJ083K","Personenauto","MERCEDES-BENZ","B 200","20250425","20230426","11786","MPV","5","GRIJS","Niet geregistreerd","4","2035","1302","1880","1402","400","1500","20060322","20170209","Geen verstrekking in Open Data",,"Ja",,,,,,,"4","4",,,,,,"M1",,,"r. schutbord","1880","245",,,,,,"0.10","278","Nee","Nee",,"Nee","3380",,,"2024","Geen oordeel","05","Ja","2025-04-25T00:00:00.000","2023-04-26T00:00:00.000","2006-03-22T00:00:00.000","2017-02-09T00:00:00.000",,,,,,,,,,,,,,,,,,,,,,,,,,,,"https://opendata.rdw.nl/resource/3huj-srit.json","https://opendata.rdw.nl/resource/8ys7-d773.json","https://opendata.rdw.nl/resource/vezc-m2t6.json","https://opendata.rdw.nl/resource/jhie-znh9.json","https://opendata.rdw.nl/resource/kmfi-hrps.json"
"NK678S","Personenauto","MERCEDES-BENZ","B 200","20240724","20240430","7516","MPV","5","ZWART","Niet geregistreerd","4","2035","1290","1880","1390","400","1500","20051129","20170407","Geen verstrekking in Open Data",,"Ja",,,,,,,"4","4",,,,,,"M1",,,"schutbord motorruimte","1880","245",,,,,,"0.07","278","Nee","Nee",,"Nee",,,,"2024","Geen oordeel","05","Ja","2024-07-24T00:00:00.000","2024-04-30T00:00:00.000","2005-11-29T00:00:00.000","2017-04-07T00:00:00.000",,,,,,,,,,,,,,,,,,,,,,,,,,,,"https://opendata.rdw.nl/resource/3huj-srit.json","https://opendata.rdw.nl/resource/8ys7-d773.json","https://opendata.rdw.nl/resource/vezc-m2t6.json","https://opendata.rdw.nl/resource/jhie-znh9.json","https://opendata.rdw.nl/resource/kmfi-hrps.json"
"NN841B","Personenauto","MERCEDES-BENZ","B 200 TURBO","20250509","20220502","11933","MPV","5","ZWART","Niet geregistreerd","4","2035","1305","1880","1405","400","1500","20060509","20170325","Geen verstrekking in Open Data",,"Ja",,,,,,,"4","4",,,,,,"M1",,,"schutbord motorruimte","1880","245",,,,,,"0.10","278","Nee","Nee",,"Nee","3380",,,"2024","Onlogisch","04","Ja","2025-05-09T00:00:00.000","2022-05-02T00:00:00.000","2006-05-09T00:00:00.000","2017-03-25T00:00:00.000",,,,,,,,,,,,,,,,,,,,,,,,,,,,"https://opendata.rdw.nl/resource/3huj-srit.json","https://opendata.rdw.nl/resource/8ys7-d773.json","https://opendata.rdw.nl/resource/vezc-m2t6.json","https://opendata.rdw.nl/resource/jhie-znh9.json","https://opendata.rdw.nl/resource/kmfi-hrps.json"
"PB319S","Personenauto","MERCEDES-BENZ","B 200","20241220","20210224","6642","MPV","5","ZWART","Niet geregistreerd","4","2035","1245","1880","1345","400","1500","20060419","20170607","Geen verstrekking in Open Data",,"Ja",,,,,,,"4","4",,,,,,"M1",,,"schutbord","1880","245",,,,,,"0.07","279","Nee","Nee",,"Nee","3380",,,"2023","Geen oordeel","05","Ja","2024-12-20T00:00:00.000","2021-02-24T00:00:00.000","2006-04-19T00:00:00.000","2017-06-07T00:00:00.000",,,,,,,,,,,,,,,,,,,,,,,,,,,,"https://opendata.rdw.nl/resource/3huj-srit.json","https://opendata.rdw.nl/resource/8ys7-d773.json","https://opendata.rdw.nl/resource/vezc-m2t6.json","https://opendata.rdw.nl/resource/jhie-znh9.json","https://opendata.rdw.nl/resource/kmfi-hrps.json"
"PT986J","Personenauto","MERCEDES-BENZ","B 200 TURBO","20241013","20190706","9237","MPV","5","GRIJS","Niet geregistreerd","4","2035","1305","1880","1405","400","1500","20051220","20170913","Geen verstrekking in Open Data",,"Ja",,,,,,,"4","4",,,,,,"M1",,,"r. schutbord","1880","245",,,,,,"0.10","278","Nee","Nee",,"Nee","3380",,,"2023","Geen oordeel","05","Ja","2024-10-13T00:00:00.000","2019-07-06T00:00:00.000","2005-12-20T00:00:00.000","2017-09-13T00:00:00.000",,,,,,,,,,,,,,,,,,,,,,,,,,,,"https://opendata.rdw.nl/resource/3huj-srit.json","https://opendata.rdw.nl/resource/8ys7-d773.json","https://opendata.rdw.nl/resource/vezc-m2t6.json","https://opendata.rdw.nl/resource/jhie-znh9.json","https://opendata.rdw.nl/resource/kmfi-hrps.json"
"RS057G","Personenauto","MERCEDES-BENZ","B 200 TURBO","20240625","20200625","1728","MPV","5","GRIJS","Niet geregistreerd","4","2035","1305","1880","1405","400","1500","20060531","20180301","Geen verstrekking in Open Data","48859","Ja",,,,,,,"4","4",,,,,,"M1",,,"by schutbord","1880","245",,,,,,"0.10","278","Nee","Nee",,"Nee","3380",,,"2024","Geen oordeel","05","Ja","2024-06-25T00:00:00.000","2020-06-25T00:00:00.000","2006-05-31T00:00:00.000","2018-03-01T00:00:00.000",,,,,,,,,,,,,,,,,,,,,,,,,,,,"https://opendata.rdw.nl/resource/3huj-srit.json","https://opendata.rdw.nl/resource/8ys7-d773.json","https://opendata.rdw.nl/resource/vezc-m2t6.json","https://opendata.rdw.nl/resource/jhie-znh9.json","https://opendata.rdw.nl/resource/kmfi-hrps.json"
"S271LP","Personenauto","MERCEDES-BENZ","GLB 200 4MATIC","20250708","20230224","10152","MPV","5","GRIJS","Niet geregistreerd","4","1332","1525","2345","1625","750","1800","20210708","20230224","Geen verstrekking in Open Data","79290","Ja","202",,,,,,"5","4",,,,"464","183","M1",,,,"2345","F2B",,,,,,"0.07","283","Nee","Nee",,"Nee","4015",,,"2023","Geen oordeel","05","Ja","2025-07-08T00:00:00.000","2023-02-24T00:00:00.000","2021-07-08T00:00:00.000","2023-02-24T00:00:00.000",,,,,,,,,,,"165",,,,,,,,,,,"20230306","2023-03-06T00:00:00.000",,,,,"https://opendata.rdw.nl/resource/3huj-srit.json","https://opendata.rdw.nl/resource/8ys7-d773.json","https://opendata.rdw.nl/resource/vezc-m2t6.json","https://opendata.rdw.nl/resource/jhie-znh9.json","https://opendata.rdw.nl/resource/kmfi-hrps.json"
"SX698S","Personenauto","MERCEDES-BENZ","B 200","20250113","20200123","7142","MPV","5","GRIJS","Niet geregistreerd","4","2035","1290","1880","1390","400","1500","20060419","20180713","Geen verstrekking in Open Data",,"Ja",,,,,,,"4","4",,,,,,"M1",,,"midden op schutbord onder motorkap","1880","245",,,,,,"0.07","278","Nee","Nee",,"Nee","3380",,,"2023","Geen oordeel","05","Ja","2025-01-13T00:00:00.000","2020-01-23T00:00:00.000","2006-04-19T00:00:00.000","2018-07-13T00:00:00.000",,,,,,,,,,,,,,,,,,,,,,,,,,,,"https://opendata.rdw.nl/resource/3huj-srit.json","https://opendata.rdw.nl/resource/8ys7-d773.json","https://opendata.rdw.nl/resource/vezc-m2t6.json","https://opendata.rdw.nl/resource/jhie-znh9.json","https://opendata.rdw.nl/resource/kmfi-hrps.json"