"kenteken","voertuigsoort","merk","handelsbenaming","vervaldatum_apk","datum_tenaamstelling","bruto_bpm","inrichting","aantal_zitplaatsen","eerste_kleur","tweede_kleur","aantal_cilinders","cilinderinhoud","massa_ledig_voertuig","toegestane_maximum_massa_voertuig","massa_rijklaar","maximum_massa_trekken_ongeremd","maximum_trekken_massa_geremd","datum_eerste_toelating","datum_eerste_tenaamstelling_in_nederland","wacht_op_keuren","catalogusprijs","wam_verzekerd","maximale_constructiesnelheid","laadvermogen","oplegger_geremd","aanhangwagen_autonoom_geremd","aanhangwagen_middenas_geremd","aantal_staanplaatsen","aantal_deuren","aantal_wielen","afstand_hart_koppeling_tot_achterzijde_voertuig","afstand_voorzijde_voertuig_tot_hart_koppeling","afwijkende_maximum_snelheid","lengte","breedte","europese_voertuigcategorie","europese_voertuigcategorie_toevoeging","europese_uitvoeringcategorie_toevoeging","plaats_chassisnummer","technische_max_massa_voertuig","type","type_gasinstallatie","typegoedkeuringsnummer","variant","uitvoering","volgnummer_wijziging_eu_typegoedkeuring","vermogen_massarijklaar","wielbasis","export_indicator","openstaande_terugroepactie_indicator","vervaldatum_tachograaf","taxi_indicator","maximum_massa_samenstelling","aantal_rolstoelplaatsen","maximum_ondersteunende_snelheid","jaar_laatste_registratie_tellerstand","tellerstandoordeel","code_toelichting_tellerstandoordeel","tenaamstellen_mogelijk","vervaldatum_apk_dt","datum_tenaamstelling_dt","datum_eerste_toelating_dt","datum_eerste_tenaamstelling_in_nederland_dt","vervaldatum_tachograaf_dt","maximum_last_onder_de_vooras_sen_tezamen_koppeling","type_remsysteem_voertuig_code","rupsonderstelconfiguratiecode","wielbasis_voertuig_minimum","wielbasis_voertuig_maximum","lengte_voertuig_minimum","lengte_voertuig_maximum","breedte_voertuig_minimum","breedte_voertuig_maximum","hoogte_voertuig","hoogte_voertuig_minimum","hoogte_voertuig_maximum","massa_bedrijfsklaar_minimaal","massa_bedrijfsklaar_maximaal","technisch_toelaatbaar_massa_koppelpunt","maximum_massa_technisch_maximaal","maximum_massa_technisch_minimaal","subcategorie_nederland","verticale_belasting_koppelpunt_getrokken_voertuig","zuinigheidsclassificatie","registratie_datum_goedkeuring_afschrijvingsmoment_bpm","registratie_datum_goedkeuring_afschrijvingsmoment_bpm_dt","gem_lading_wrde","aerodyn_voorz","massa_alt_aandr","verl_cab_ind","api_gekentekende_voertuigen_assen","api_gekentekende_voertuigen_brandstof","api_gekentekende_voertuigen_carrosserie","api_gekentekende_voertuigen_carrosserie_specifiek","api_gekentekende_voertuigen_voertuigklasse"
"8ZBK38","Personenauto","MERCEDES-BENZ","A 170","20240803","20240322","6190","MPV","5","GRIJS","Niet geregistreerd","4","1699","1179","1770","1279","400","1300","20051202","20141230","Geen verstrekking in Open Data",,"Ja",,,,,,,"4","4",,,,,,"M1",,,"schutbord motorruimte","1770",,,,,,,"0.07","257","Nee","Nee",,"Nee",,,,"2023","Geen oordeel","05","Ja","2024-08-03T00:00:00.000","2024-03-22T00:00:00.000","2005-12-02T00:00:00.000","2014-12-30T00:00:00.000",,"0",,,,,,,,,,,,,,,,,,,,,,,,,,"https://opendata.rdw.nl/resource/3huj-srit.json","https://opendata.rdw.nl/resource/8ys7-d773.json","https://opendata.rdw.nl/resource/vezc-m2t6.json","https://opendata.rdw.nl/resource/jhie-znh9.json","https://opendata.rdw.nl/resource/kmfi-hrps.json"
"8ZKP51","Personenauto","MERCEDES-BENZ","A 170","20230131","20211030","5093","MPV","5","ZWART","Niet geregistreerd","4","1699","1140","1705","1240","400","1300","20050801","20150120","Geen verstrekking in Open Data",,"Ja",,,,,,,"4","4",,,,,,"M1",,,"schutbord motorruimte","1705",,,,,,,"0.07","257","Nee","Nee",,"Nee","3005",,,"2022","Onlogisch","04","Ja","2023-01-31T00:00:00.000","2021-10-30T00:00:00.000","2005-08-01T00:00:00.000","2015-01-20T00:00:00.000",,"0",,,,,,,,,,,,,,,,,,,,,,,,,,"https://opendata.rdw.nl/resource/3huj-srit.json","https://opendata.rdw.nl/resource/8ys7-d773.json","https://opendata.rdw.nl/resource/vezc-m2t6.json","https://opendata.rdw.nl/resource/jhie-znh9.json","https://opendata.rdw.nl/resource/kmfi-hrps.json"
"9XTX34","Personenauto","MERCEDES-BENZ","A 170","20241104","20160416","5193","MPV","5","ZWART","Niet geregistreerd","4","1699","1140","1705","1240","400","1300","20050425","20141029","Geen verstrekking in Open Data",,"Ja",,,,,,,"4","4",,,,,,"M1",,,"schutbord","1705",,,,,,,"0.07","260","Nee","Nee",,"Nee",,,,"2023","Geen oordeel","05","Ja","2024-11-04T00:00:00.000","2016-04-16T00:00:00.000","2005-04-25T00:00:00.000","2014-10-29T00:00:00.000",,"0",,,,,,,,,,,,,,,,,,,,,,,,,,"https://opendata.rdw.nl/resource/3huj-srit.json","https://opendata.rdw.nl/resource/8ys7-d773.json","https://opendata.rdw.nl/resource/vezc-m2t6.json","https://opendata.rdw.nl/resource/jhie-znh9.json","https://opendata.rdw.nl/resource/kmfi-hrps.json"
"G474GP","Personenauto","MERCEDES-BENZ","A 170","20250210","20200104","1612","MPV","5","GRIJS","Niet geregistreerd","4","1699","1179","1705","1279","400","1300","20050208","20200104","Geen verstrekking in Open Data",,"Ja","183",,,,,,"4","4",,,,,,"M1",,,"r. schutbord","1705","169",,,,,,"0.07","257","Nee","Nee",,"Nee","3005",,,"2024","Geen oordeel","05","Ja","2025-02-10T00:00:00.000","2020-01-04T00:00:00.000","2005-02-08T00:00:00.000","2020-01-04T00:00:00.000",,,,,,,,,,,,,,,,,,,,,,,,,,,,"https://opendata.rdw.nl/resource/3huj-srit.json","https://opendata.rdw.nl/resource/8ys7-d773.json","https://opendata.rdw.nl/resource/vezc-m2t6.json","https://opendata.rdw.nl/resource/jhie-znh9.json","https://opendata.rdw.nl/resource/kmfi-hrps.json"
"GF713F","Personenauto","MERCEDES-BENZ","A 170","20240622","20230202","5721","MPV","5","GRIJS","Niet geregistreerd","4","1699","1179","1705","1279","400","1300","20050509","20150821","Geen verstrekking in Open Data",,"Ja",,,,,,,"4","4",,,,,,"M1",,,"schutbord by motorruimte","1705",,,,,,,"0.07","257","Nee","Nee",,"Nee",,,,"2023","Geen oordeel","05","Ja","2024-06-22T00:00:00.000","2023-02-02T00:00:00.000","2005-05-09T00:00:00.000","2015-08-21T00:00:00.000",,,,,,,,,,,,,,,,,,,,,,,,,,,,"https://opendata.rdw.nl/resource/3huj-srit.json","https://opendata.rdw.nl/resource/8ys7-d773.json","https://opendata.rdw.nl/resource/vezc-m2t6.json","https://opendata.rdw.nl/resource/jhie-znh9.json","https://opendata.rdw.nl/resource/kmfi-hrps.json"
"GS555G","Personenauto","MERCEDES-BENZ","A 170","20220731","20211130","4845","MPV","5","GRIJS","Niet geregistreerd","4","1699","1140","1705","1240","400","1300","20041108","20150729","Geen verstrekking in Open Data",,"Nee",,,,,,,"5","4",,,,,,"M1",,,"schutbord","1705",,,,,,,"0.07","257","Nee","Nee",,"Nee",,,,"2021","Geen oordeel","05","Nee","2022-07-31T00:00:00.000","2021-11-30T00:00:00.000","2004-11-08T00:00:00.000","2015-07-29T00:00:00.000",,,,,,,,,,,,,,,,,,,,,,,,,,,,"https://opendata.rdw.nl/resource/3huj-srit.json","https://opendata.rdw.nl/resource/8ys7-d773.json","https://opendata.rdw.nl/resource/vezc-m2t6.json","https://opendata.rdw.nl/resource/jhie-znh9.json","https://opendata.rdw.nl/resource/kmfi-hrps.json"
"JP856S","Personenauto","MERCEDES-BENZ","A 170","20250215","20180130","5215","MPV","5","BLAUW","Niet geregistreerd","4","1699","1140","1705","1240","400","1300","20050518","20160520","Geen verstrekking in Open Data",,"Ja",,,,,,,"4","4",,,,,,"M1",,,"schutbord motorruimte","1705","169",,,,,,"0.07","257","Nee","Nee",,"Nee","3005",,,"2024","Geen oordeel","05","Ja","2025-02-15T00:00:00.000","2018-01-30T00:00:00.000","2005-05-18T00:00:00.000","2016-05-20T00:00:00.000",,,,,,,,,,,,,,,,,,,,,,,,,,,,"https://opendata.rdw.nl/resource/3huj-srit.json","https://opendata.rdw.nl/resource/8ys7-d773.json","https://opendata.rdw.nl/resource/vezc-m2t6.json","https://opendata.rdw.nl/resource/jhie-znh9.json","https://opendata.rdw.nl/resource/kmfi-hrps.json"
"KV218S","Personenauto","MERCEDES-BENZ","A 170","20250526","20240326","5744","MPV","5","GEEL","Niet geregistreerd","4","1699","1140","1705","1240","400","1300","20050616","20161210","Geen verstrekking in Open Data",,"Ja",,,,,,,"4","4",,,,,,"M1",,,"schutbord by motorruimte","1705","169",,,,,,"0.07","257","Nee","Nee",,"Nee","3005",,,"2024","Geen oordeel","05","Ja","2025-05-26T00:00:00.000","2024-03-26T00:00:00.000","2005-06-16T00:00:00.000","2016-12-10T00:00:00.000",,,,,,,,,,,,,,,,,,,,,,,,,,,,"https://opendata.rdw.nl/resource/3huj-srit.json","https://opendata.rdw.nl/resource/8ys7-d773.json","https://opendata.rdw.nl/resource/vezc-m2t6.json","https://opendata.rdw.nl/resource/jhie-znh9.json","https://opendata.rdw.nl/resource/kmfi-hrps.json"
"KX716X","Personenauto","MERCEDES-BENZ","A 170","20250409","20220201","1360","MPV","5","GRIJS","Niet geregistreerd","4","1699","1179","1705","1279","400","1300","20050902","20170422","Geen verstrekking in Open Data","33538","Ja",,,,,,,"4","4",,,,,,"M1",,,"motorruimte schutbord","1705","169",,,,,,"0.07","257","Nee","Nee",,"Nee","3005",,,"2024","Onlogisch","04","Ja","2025-04-09T00:00:00.000","2022-02-01T00:00:00.000","2005-09-02T00:00:00.000","2017-04-22T00:00:00.000",,,,,,,,,,,,,,,,,,,,,,,,,,,,"https://opendata.rdw.nl/resource/3huj-srit.json","https://opendata.rdw.nl/resource/8ys7-d773.json","https://opendata.rdw.nl/resource/vezc-m2t6.json","https://opendata.rdw.nl/resource/jhie-znh9.json","https://opendata.rdw.nl/resource/kmfi-hrps.json"
"N763NZ","Personenauto","MERCEDES-BENZ","A 170","20240430","20220225","4870","MPV","5","GRIJS","Niet geregistreerd","4","1699","1179","1770","1279","400","1300","20060104","20220225","Geen verstrekking in Open Data",,"Ja","183",,,,,,"4","4",,,,,,"M1",,,,"1770",,,,,,,"0.07","257","Nee","Nee",,"Nee","3070",,,"2023","Geen oordeel","05","Ja","2024-04-30T00:00:00.000","2022-02-25T00:00:00.000","2006-01-04T00:00:00.000","2022-02-25T00:00:00.000",,,,,,,,,,,,,,,,,,,,,,"20211116","2021-11-16T00:00:00.000",,,,,"https://opendata.rdw.nl/resource/3huj-srit.json","https://opendata.rdw.nl/resource/8ys7-d773.json","https://opendata.rdw.nl/resource/vezc-m2t6.json","https://opendata.rdw.nl/resource/jhie-znh9.json","https://opendata.rdw.nl/resource/kmfi-hrps.json"
"NN375G","Personenauto","MERCEDES-BENZ","A 170 CDI","20011028",,"6006","MPV","5","GRIJS","Niet geregistreerd","4","1689","1030","1560","1130","400","800","19981028",,"Geen verstrekking in Open Data",,"Nee",,,,,,,"4","4",,,,,,"M1",,,"schutbord by motorruimte","1560","168",,,,,,"0.06","243","Nee","Nee",,"Nee","2415",,,"2017","Geen oordeel","05","Ja","2001-10-28T00:00:00.000",,"1998-10-28T00:00:00.000",,,,,,,,,,,,,,,,,,,,,,,,,,,,,"https://opendata.rdw.nl/resource/3huj-srit.json","https://opendata.rdw.nl/resource/8ys7-d773.json","https://opendata.rdw.nl/resource/vezc-m2t6.json","https://opendata.rdw.nl/resource/jhie-znh9.json","https://opendata.rdw.nl/resource/kmfi-hrps.json"
"NN509T","Personenauto","MERCEDES-BENZ","A 170","20250511","20171129","1622","MPV","5","GEEL","Niet geregistreerd","4","1699","1140","1705","1240","400","1300","20050830","20170512","Geen verstrekking in Open Data","28905","Ja",,,,,,,"4","4",,,,,,"M1",,,"schutbord motorruimte","1705","169",,,,,,"0.07","258","Nee","Nee",,"Nee",,,,"2024","Geen oordeel","05","Ja","2025-05-11T00:00:00.000","2017-11-29T00:00:00.000","2005-08-30T00:00:00.000","2017-05-12T00:00:00.000",,,,,,,,,,,,,,,,,,,,,,,,,,,,"https://opendata.rdw.nl/resource/3huj-srit.json","https://opendata.rdw.nl/resource/8ys7-d773.json","https://opendata.rdw.nl/resource/vezc-m2t6.json","https://opendata.rdw.nl/resource/jhie-znh9.json","https://opendata.rdw.nl/resource/kmfi-hrps.json"
"NZ565F","Personenauto","MERCEDES-BENZ","A 170","20250518","20230517","5359","MPV","5","GRIJS","Niet geregistreerd","4","1699","1140","1705","1240","400","1300","20050810","20170825","Geen verstrekking in Open Data",,"Ja",,,,,,,"4","4",,,,,,"M1",,,"schutbord motorruimte","1705","169",,,,,,"0.07","257","Nee","Nee",,"Nee","3005",,,"2024","Geen oordeel","05","Ja","2025-05-18T00:00:00.000","2023-05-17T00:00:00.000","2005-08-10T00:00:00.000","2017-08-25T00:00:00.000",,,,,,,,,,,,,,,,,,,,,,,,,,,,"https://opendata.rdw.nl/resource/3huj-srit.json","https://opendata.rdw.nl/resource/8ys7-d773.json","https://opendata.rdw.nl/resource/vezc-m2t6.json","https://opendata.rdw.nl/resource/jhie-znh9.json","https://opendata.rdw.nl/resource/kmfi-hrps.json"
"PP549X","Personenauto","MERCEDES-BENZ","A 170","20241227","20191101","4971","MPV","5","GRIJS","Niet geregistreerd","4","1699","1140","1770","1240","400","1300","20060428","20170915","Geen verstrekking in Open Data",,"Ja",,,,,,,"4","4",,,,,,"M1",,,"r. schutbord onder motorruimte","1770","169",,,,,,"0.07","258","Nee","Nee",,"Nee","3070",,,"2023","Geen oordeel","05","Ja","2024-12-27T00:00:00.000","2019-11-01T00:00:00.000","2006-04-28T00:00:00.000","2017-09-15T00:00:00.000",,,,,,,,,,,,,,,,,,,,,,,,,,,,"https://opendata.rdw.nl/resource/3huj-srit.json","https://opendata.rdw.nl/resource/8ys7-d773.json","https://opendata.rdw.nl/resource/vezc-m2t6.json","https://opendata.rdw.nl/resource/jhie-znh9.json","https://opendata.rdw.nl/resource/kmfi-hrps.json"
"PP769R","Personenauto","MERCEDES-BENZ","A 170","20240531","20220406","5657","MPV","5","ZWART","Niet geregistreerd","4","1699","1179","1705","1279","400","1300","20050215","20171101","Geen verstrekking in Open Data",,"Ja",,,,,,,"4","4",,,,,,"M1",,,"r. schutbord by motorruimte","1705","169",,,,,,"0.07","257","Nee","Nee",,"Nee","3005",,,"2023","Geen oordeel","05","Ja","2024-05-31T00:00:00.000","2022-04-06T00:00:00.000","2005-02-15T00:00:00.000","2017-11-01T00:00:00.000",,,,,,,,,,,,,,,,,,,,,,,,,,,,"https://opendata.rdw.nl/resource/3huj-srit.json","https://opendata.rdw.nl/resource/8ys7-d773.json","https://opendata.rdw.nl/resource/vezc-m2t6.json","https://opendata.rdw.nl/resource/jhie-znh9.json","https://opendata.rdw.nl/resource/kmfi-hrps.json"
"PS857N","Personenauto","MERCEDES-BENZ","A 170","20240531","20180501","4926","MPV","5","GRIJS","Niet geregistreerd","4","1699","1140","1705","1240","400","1300","20050309","20170927","Geen verstrekking in Open Data",,"Ja",,,,,,,"4","4",,,,,,"M1",,,"schutbord by","1705","169",,,,,,"0.07","257","Nee","Nee",,"Nee","3005",,,"2023","Geen oordeel","05","Ja","2024-05-31T00:00:00.000","2018-05-01T00:00:00.000","2005-03-09T00:00:00.000","2017-09-27T00:00:00.000",,,,,,,,,,,,,,,,,,,,,,,,,,,,"https://opendata.rdw.nl/resource/3huj-srit.json","https://opendata.rdw.nl/resource/8ys7-d773.json","https://opendata.rdw.nl/resource/vezc-m2t6.json","https://opendata.rdw.nl/resource/jhie-znh9.json","https://opendata.rdw.nl/resource/kmfi-hrps.json"
"PZ558R","Personenauto","MERCEDES-BENZ","A 170","20240824","20240205","5879","MPV","5","ZWART","Niet geregistreerd","4","1699","1140","1705","1240","400","1300","20050913","20171204","Geen verstrekking in Open Data",,"Ja",,,,,,,"4","4",,,,,,"M1",,,,"1705",,,,,,,"0.07","257","Nee","Nee",,"Nee","3005",,,"2024","Geen oordeel","05","Ja","2024-08-24T00:00:00.000","2024-02-05T00:00:00.000","2005-09-13T00:00:00.000","2017-12-04T00:00:00.000",,,,,,,,,,,,,,,,,,,,,,,,,,,,"https://opendata.rdw.nl/resource/3huj-srit.json","https://opendata.rdw.nl/resource/8ys7-d773.json","https://opendata.rdw.nl/resource/vezc-m2t6.json","https://opendata.rdw.nl/resource/jhie-znh9.json","https://opendata.rdw.nl/resource/kmfi-hrps.json"
"R208NS","Personenauto","MERCEDES-BENZ","A 170","20250508","20230508","4946","MPV","5","BLAUW","Niet geregistreerd","4","1699","1140","1705","1240","400","1300","20050908","20230508","Geen verstrekking in Open Data",,"Ja","188",,,,,,"4","4",,,,,,"M1",,,,"1705","169",,,,,,"0.07","257","Nee","Ja",,"Nee","3005",,,"2024","Geen oordeel","05","Ja","2025-05-08T00:00:00.000","2023-05-08T00:00:00.000","2005-09-08T00:00:00.000","2023-05-08T00:00:00.000",,,,,,,,,,,,,,,,,,,,,,"20221013","2022-10-13T00:00:00.000",,,,,"https://opendata.rdw.nl/resource/3huj-srit.json","https://opendata.rdw.nl/resource/8ys7-d773.json","https://opendata.rdw.nl/resource/vezc-m2t6.json","https://opendata.rdw.nl/resource/jhie-znh9.json","https://opendata.rdw.nl/resource/kmfi-hrps.json"
"RV184B","Personenauto","MERCEDES-BENZ","A 170","20250508","20230516","5535","MPV","5","ZWART","Niet geregistreerd","4","1699","1140","1705","1240","400","1300","20050204","20180201","Geen verstrekking in Open Data",,"Ja",,,,,,,"4","4",,,,,,"M1",,,,"1705",,,,,,,"0.07","257","Nee","Nee",,"Nee","3005",,,"2024","Geen oordeel","05","Ja","2025-05-08T00:00:00.000","2023-05-16T00:00:00.000","2005-02-04T00:00:00.000","2018-02-01T00:00:00.000",,,,,,,,,,,,,,,,,,,,,,,,,,,,"https://opendata.rdw.nl/resource/3huj-srit.json","https://opendata.rdw.nl/resource/8ys7-d773.json","https://opendata.rdw.nl/resource/vezc-m2t6.json","https://opendata.rdw.nl/resource/jhie-znh9.json","https://opendata.rdw.nl/resource/kmfi-hrps.json"
"RX799S","Personenauto","MERCEDES-BENZ","A 170","20241010","20181107","6916","MPV","5","GRIJS","Niet geregistreerd","4","1699","1140","1770","1240","400","1300","20060320","20180220","Geen verstrekking in Open Data",,"Ja",,,,,,,"4","4",,,,,,"M1",,,,"1770","169",,,,,,"0.07","256","Nee","Nee",,"Nee","3070",,,"2023","Geen oordeel","05","Ja","2024-10-10T00:00:00.000","2018-11-07T00:00:00.000","2006-03-20T00:00:00.000","2018-02-20T00:00:00.000",,,,,,,,,,,,,,,,,,,,,,,,,,,,"https://opendata.rdw.nl/resource/3huj-srit.json","https://opendata.rdw.nl/resource/8ys7-d773.json","https://opendata.rdw.nl/resource/vezc-m2t6.json","https://opendata.rdw.nl/resource/jhie-znh9.json","https://opendata.rdw.nl/resource/kmfi-hrps.json"
"TJ325L","Personenauto","MERCEDES-BENZ","A 170","20240928","20180822","4945","MPV","5","ZWART","Niet geregistreerd","4","1699","1140","1705","1240","400","1300","20050518","20180822","Geen verstrekking in Open Data",,"Ja",,,,,,,"4","4",,,,,,"M1",,,,"1705","169",,,,,,"0.07","257","Nee","Nee",,"Nee",,,,"2023","Geen oordeel","05","Ja","2024-09-28T00:00:00.000","2018-08-22T00:00:00.000","2005-05-18T00:00:00.000","2018-08-22T00:00:00.000",,,,,,,,,,,,,,,,,,,,,,,,,,,,"https://opendata.rdw.nl/resource/3huj-srit.json","https://opendata.rdw.nl/resource/8ys7-d773.json","https://opendata.rdw.nl/resource/vezc-m2t6.json","https://opendata.rdw.nl/resource/jhie-znh9.json","https://opendata.rdw.nl/resource/kmfi-hrps.json"
