"kenteken","voertuigsoort","merk","handelsbenaming","vervaldatum_apk","datum_tenaamstelling","bruto_bpm","inrichting","aantal_zitplaatsen","eerste_kleur","tweede_kleur","aantal_cilinders","cilinderinhoud","massa_ledig_voertuig","toegestane_maximum_massa_voertuig","massa_rijklaar","maximum_massa_trekken_ongeremd","maximum_trekken_massa_geremd","datum_eerste_toelating","datum_eerste_tenaamstelling_in_nederland","wacht_op_keuren","catalogusprijs","wam_verzekerd","maximale_constructiesnelheid","laadvermogen","oplegger_geremd","aanhangwagen_autonoom_geremd","aanhangwagen_middenas_geremd","aantal_staanplaatsen","aantal_deuren","aantal_wielen","afstand_hart_koppeling_tot_achterzijde_voertuig","afstand_voorzijde_voertuig_tot_hart_koppeling","afwijkende_maximum_snelheid","lengte","breedte","europese_voertuigcategorie","europese_voertuigcategorie_toevoeging","europese_uitvoeringcategorie_toevoeging","plaats_chassisnummer","technische_max_massa_voertuig","type","type_gasinstallatie","typegoedkeuringsnummer","variant","uitvoering","volgnummer_wijziging_eu_typegoedkeuring","vermogen_massarijklaar","wielbasis","export_indicator","openstaande_terugroepactie_indicator","vervaldatum_tachograaf","taxi_indicator","maximum_massa_samenstelling","aantal_rolstoelplaatsen","maximum_ondersteunende_snelheid","jaar_laatste_registratie_tellerstand","tellerstandoordeel","code_toelichting_tellerstandoordeel","tenaamstellen_mogelijk","vervaldatum_apk_dt","datum_tenaamstelling_dt","datum_eerste_toelating_dt","datum_eerste_tenaamstelling_in_nederland_dt","vervaldatum_tachograaf_dt","maximum_last_onder_de_vooras_sen_tezamen_koppeling","type_remsysteem_voertuig_code","rupsonderstelconfiguratiecode","wielbasis_voertuig_minimum","wielbasis_voertuig_maximum","lengte_voertuig_minimum","lengte_voertuig_maximum","breedte_voertuig_minimum","breedte_voertuig_maximum","hoogte_voertuig","hoogte_voertuig_minimum","hoogte_voertuig_maximum","massa_bedrijfsklaar_minimaal","massa_bedrijfsklaar_maximaal","technisch_toelaatbaar_massa_koppelpunt","maximum_massa_technisch_maximaal","maximum_massa_technisch_minimaal","subcategorie_nederland","verticale_belasting_koppelpunt_getrokken_voertuig","zuinigheidsclassificatie","registratie_datum_goedkeuring_afschrijvingsmoment_bpm","registratie_datum_goedkeuring_afschrijvingsmoment_bpm_dt","gem_lading_wrde","aerodyn_voorz","massa_alt_aandr","verl_cab_ind","api_gekentekende_voertuigen_assen","api_gekentekende_voertuigen_brandstof","api_gekentekende_voertuigen_carrosserie","api_gekentekende_voertuigen_carrosserie_specifiek","api_gekentekende_voertuigen_voertuigklasse"
"GZ320K","Personenauto","MERCEDES-BENZ","GLE 500 E 4MATIC","20240906","20240422","805","stationwagen","5","GRIJS","Niet geregistreerd","6","2996","2365","3050","2465","750","2000","20150924","20150924","Geen verstrekking in Open Data","100570","Ja",,,,,,,"5","4","0","0",,"0","0","M1",,,"r. deurstyl","3050","166",,"e1*2007/46*0598*16","A25JP1","NZCCB544","0","0.02","292","Nee","Nee",,"Nee","5150","0","0.00","2024","Logisch","00","Ja","2024-09-06T00:00:00.000","2024-04-22T00:00:00.000","2015-09-24T00:00:00.000","2015-09-24T00:00:00.000",,,,,,,,,,,,,,,,,,,,,"A",,,,,,,"https://opendata.rdw.nl/resource/3huj-srit.json","https://opendata.rdw.nl/resource/8ys7-d773.json","https://opendata.rdw.nl/resource/vezc-m2t6.json","https://opendata.rdw.nl/resource/jhie-znh9.json","https://opendata.rdw.nl/resource/kmfi-hrps.json"
"GZ446T","Personenauto","MERCEDES-BENZ","GLE 500 E 4MATIC","20240703","20210910","805","stationwagen","5","ZWART","Niet geregistreerd","6","2996","2365","3050","2465","750","2000","20151003","20151003","Geen verstrekking in Open Data","109821","Ja",,,,,,,"5","4","0","0",,"0","0","M1",,,"r. deurstyl","3050","166",,"e1*2007/46*0598*16","A25JP1","NZCCB544","0","0.02","292","Nee","Nee",,"Nee","5150","0","0.00","2023","Logisch","00","Ja","2024-07-03T00:00:00.000","2021-09-10T00:00:00.000","2015-10-03T00:00:00.000","2015-10-03T00:00:00.000",,,,,,,,,,,,,,,,,,,,,"A",,,,,,,"https://opendata.rdw.nl/resource/3huj-srit.json","https://opendata.rdw.nl/resource/8ys7-d773.json","https://opendata.rdw.nl/resource/vezc-m2t6.json","https://opendata.rdw.nl/resource/jhie-znh9.json","https://opendata.rdw.nl/resource/kmfi-hrps.json"
"GZ468T","Personenauto","MERCEDES-BENZ","GLE 500 E 4MATIC","20240925","20231115","643","stationwagen","5","ZWART","Niet geregistreerd","6","2996","2365","3050","2465","750","2000","20150925","20150925","Geen verstrekking in Open Data","105470","Ja",,,,,,,"5","4","0","0",,"0","0","M1",,,"r. deurstyl","3050","166",,"e1*2007/46*0598*16","A25JP1","NZCCB532","0","0.02","292","Nee","Nee",,"Nee","5150","0","0.00","2023","Logisch","00","Ja","2024-09-25T00:00:00.000","2023-11-15T00:00:00.000","2015-09-25T00:00:00.000","2015-09-25T00:00:00.000",,,,,,,,,,,,,,,,,,,,,"A",,,,,,,"https://opendata.rdw.nl/resource/3huj-srit.json","https://opendata.rdw.nl/resource/8ys7-d773.json","https://opendata.rdw.nl/resource/vezc-m2t6.json","https://opendata.rdw.nl/resource/jhie-znh9.json","https://opendata.rdw.nl/resource/kmfi-hrps.json"
"H014GD","Personenauto","MERCEDES-BENZ","GLE 500 E 4MATIC","20250131","20200116","994","stationwagen","5","GRIJS","Niet geregistreerd","6","2996","2365","3050","2465","750","2000","20160628","20200116","Geen verstrekking in Open Data","106778","Ja","245",,,,,,"5","4","0","0",,"0","0","M1",,,,"3050","166",,"e1*2007/46*0598*18","A25JP1","NZCCA534","0","0.02","292","Nee","Ja",,"Nee","5150","0","0.00","2024","Geen oordeel","05","Ja","2025-01-31T00:00:00.000","2020-01-16T00:00:00.000","2016-06-28T00:00:00.000","2020-01-16T00:00:00.000",,,,,,,,,,,,,,,,,,,,,"A",,,,,,,"https://opendata.rdw.nl/resource/3huj-srit.json","https://opendata.rdw.nl/resource/8ys7-d773.json","https://opendata.rdw.nl/resource/vezc-m2t6.json","https://opendata.rdw.nl/resource/jhie-znh9.json","https://opendata.rdw.nl/resource/kmfi-hrps.json"
"H242JG","Personenauto","MERCEDES-BENZ","GLE 500 E 4MATIC","20240822","20200214","8269","stationwagen","5","GRIJS","Niet geregistreerd","6","2996","2365","3050","2465","750","2000","20180822","20200214","Geen verstrekking in Open Data","113796","Ja",,,,,,,"5","4","0","0",,"0","0","M1",,,,"3050","166",,"e1*2007/46*0598*23","A25JP1","NZCAA532","0","0.02","292","Nee","Nee",,"Nee","5150","0","0.00","2024","Geen oordeel","05","Ja","2024-08-22T00:00:00.000","2020-02-14T00:00:00.000","2018-08-22T00:00:00.000","2020-02-14T00:00:00.000",,,,,,,,,,,,,,,,,,,,,"A",,,,,,,"https://opendata.rdw.nl/resource/3huj-srit.json","https://opendata.rdw.nl/resource/8ys7-d773.json","https://opendata.rdw.nl/resource/vezc-m2t6.json","https://opendata.rdw.nl/resource/jhie-znh9.json","https://opendata.rdw.nl/resource/kmfi-hrps.json"
"H254FT","Personenauto","MERCEDES-BENZ","GLE 500 E 4MATIC","20250718","20240325","10402","stationwagen","5","GRIJS","Niet geregistreerd","6","2996","2365","3050","2465","750","2000","20170925","20200113","Geen verstrekking in Open Data","124938","Ja","245",,,,,,"5","4","0","0",,"0","0","M1",,,,"3050","166",,"e1*2007/46*0598*21","A25JP1","NZCAA532","0","0.02","292","Nee","Ja",,"Nee","5150","0","0.00","2024","Geen oordeel","05","Ja","2025-07-18T00:00:00.000","2024-03-25T00:00:00.000","2017-09-25T00:00:00.000","2020-01-13T00:00:00.000",,,,,,,,,,,,,,,,,,,,,"A",,,,,,,"https://opendata.rdw.nl/resource/3huj-srit.json","https://opendata.rdw.nl/resource/8ys7-d773.json","https://opendata.rdw.nl/resource/vezc-m2t6.json","https://opendata.rdw.nl/resource/jhie-znh9.json","https://opendata.rdw.nl/resource/kmfi-hrps.json"
"H322FJ","Personenauto","MERCEDES-BENZ","GLE 500 E 4MATIC","20260226","20200110","9778","stationwagen","5","WIT","Niet geregistreerd","6","2996","2365","3050","2465","750","2000","20180807","20200110","Geen verstrekking in Open Data","115436","Ja","245",,,,,,"5","4","0","0",,"0","0","M1",,,"r. deurstyl","3050","166",,"e1*2007/46*0598*23","A25JP1","NZCAA534","0","0.02","292","Nee","Nee",,"Nee","5150","0","0.00","2024","Geen oordeel","05","Ja","2026-02-26T00:00:00.000","2020-01-10T00:00:00.000","2018-08-07T00:00:00.000","2020-01-10T00:00:00.000",,,,,,,,,,,,,,,,,,,,,"A",,,,,,,"https://opendata.rdw.nl/resource/3huj-srit.json","https://opendata.rdw.nl/resource/8ys7-d773.json","https://opendata.rdw.nl/resource/vezc-m2t6.json","https://opendata.rdw.nl/resource/jhie-znh9.json","https://opendata.rdw.nl/resource/kmfi-hrps.json"
"H517PK","Personenauto","MERCEDES-BENZ","GLE 500 E 4MATIC","20250401","20200622","6047","stationwagen","5","ZWART","Niet geregistreerd","6","2996","2365","3050","2465","750","2000","20171013","20200622","Geen verstrekking in Open Data","115319","Ja",,,,,,,"5","4","0","0",,"0","0","M1",,,,"3050","166",,"e1*2007/46*0598*22","A25JP1","NZCAA532","0","0.02","292","Nee","Nee",,"Nee","5150","0","0.00","2024","Geen oordeel","05","Ja","2025-04-01T00:00:00.000","2020-06-22T00:00:00.000","2017-10-13T00:00:00.000","2020-06-22T00:00:00.000",,,,,,,,,,,,,,,,,,,,,"A",,,,,,,"https://opendata.rdw.nl/resource/3huj-srit.json","https://opendata.rdw.nl/resource/8ys7-d773.json","https://opendata.rdw.nl/resource/vezc-m2t6.json","https://opendata.rdw.nl/resource/jhie-znh9.json","https://opendata.rdw.nl/resource/kmfi-hrps.json"
"H771XJ","Personenauto","MERCEDES-BENZ","GLE 500 E 4MATIC","20240919","20210502","641","stationwagen","5","ZWART","Niet geregistreerd","6","2996","2365","3050","2465","750","2000","20160919","20200613","Geen verstrekking in Open Data","102162","Ja","245",,,,,,"5","4","0","0",,"0","0","M1",,,,"3050","166",,"e1*2007/46*0598*18","A25JP1","NZCCA532","0","0.02","292","Nee","Ja",,"Nee","5150","0","0.00","2024","Geen oordeel","05","Ja","2024-09-19T00:00:00.000","2021-05-02T00:00:00.000","2016-09-19T00:00:00.000","2020-06-13T00:00:00.000",,,,,,,,,,,,,,,,,,,,,"A",,,,,,,"https://opendata.rdw.nl/resource/3huj-srit.json","https://opendata.rdw.nl/resource/8ys7-d773.json","https://opendata.rdw.nl/resource/vezc-m2t6.json","https://opendata.rdw.nl/resource/jhie-znh9.json","https://opendata.rdw.nl/resource/kmfi-hrps.json"
"H880XD","Personenauto","MERCEDES-BENZ","GLE 500 E 4MATIC","20250419","20240315","7984","stationwagen","5","BLAUW","Niet geregistreerd","6","2996","2365","3050","2465","750","2000","20170110","20200609","Geen verstrekking in Open Data","112458","Ja",,,,,,,"5","4","0","0",,"0","0","M1",,,"r. deurstyl","3050","166",,"e1*2007/46*0598*18","A25JP1","NZCCA532","0","0.02","292","Nee","Nee",,"Nee","5150","0","0.00","2024","Geen oordeel","05","Ja","2025-04-19T00:00:00.000","2024-03-15T00:00:00.000","2017-01-10T00:00:00.000","2020-06-09T00:00:00.000",,,,,,,,,,,,,,,,,,,,,"A",,,,,,,"https://opendata.rdw.nl/resource/3huj-srit.json","https://opendata.rdw.nl/resource/8ys7-d773.json","https://opendata.rdw.nl/resource/vezc-m2t6.json","https://opendata.rdw.nl/resource/jhie-znh9.json","https://opendata.rdw.nl/resource/kmfi-hrps.json"
"HF288K","Personenauto","MERCEDES-BENZ","GLE 500 E 4MATIC","20241007","20200227","643","stationwagen","5","WIT","Niet geregistreerd","6","2996","2365","3050","2465","750","2000","20151005","20151014","Geen verstrekking in Open Data","109332","Ja",,,,,,,"5","4","0","0",,"0","0","M1",,,"r. deurstyl","3050","166",,"e1*2007/46*0598*16","A25JP1","NZCCB532","0","0.02","292","Nee","Nee",,"Nee","5150","0","0.00","2024","Logisch","00","Ja","2024-10-07T00:00:00.000","2020-02-27T00:00:00.000","2015-10-05T00:00:00.000","2015-10-14T00:00:00.000",,,,,,,,,,,,,,,,,,,,,"A",,,,,,,"https://opendata.rdw.nl/resource/3huj-srit.json","https://opendata.rdw.nl/resource/8ys7-d773.json","https://opendata.rdw.nl/resource/vezc-m2t6.json","https://opendata.rdw.nl/resource/jhie-znh9.json","https://opendata.rdw.nl/resource/kmfi-hrps.json"
"HF861B","Personenauto","MERCEDES-BENZ","GLE 500 E 4MATIC","20241016","20200627","643","stationwagen","5","GRIJS","Niet geregistreerd","6","2996","2365","3050","2465","750","2000","20151016","20151016","Geen verstrekking in Open Data","101618","Ja",,,,,,,"5","4","0","0",,"0","0","M1",,,"r. deurstyl","3050","166",,"e1*2007/46*0598*16","A25JP1","NZCCB502","0","0.02","292","Nee","Nee",,"Nee","5150","0","0.00","2024","Logisch","00","Ja","2024-10-16T00:00:00.000","2020-06-27T00:00:00.000","2015-10-16T00:00:00.000","2015-10-16T00:00:00.000",,,,,,,,,,,,,,,,,,,,,"A",,,,,,,"https://opendata.rdw.nl/resource/3huj-srit.json","https://opendata.rdw.nl/resource/8ys7-d773.json","https://opendata.rdw.nl/resource/vezc-m2t6.json","https://opendata.rdw.nl/resource/jhie-znh9.json","https://opendata.rdw.nl/resource/kmfi-hrps.json"
"HJ049N","Personenauto","MERCEDES-BENZ","GLE 500 E 4MATIC","20241114","20230416","643","stationwagen","5","WIT","Niet geregistreerd","6","2996","2365","3050","2465","750","2000","20151114","20151114","Geen verstrekking in Open Data","107305","Ja",,,,,,,"5","4","0","0",,"485","197","M1",,,"op r. deurstyl","3050","166",,"e1*2007/46*0598*16","A25JP1","NZCCB542","0","0.10","292","Nee","Nee",,"Nee","5150","0","0.00","2023","Logisch","00","Ja","2024-11-14T00:00:00.000","2023-04-16T00:00:00.000","2015-11-14T00:00:00.000","2015-11-14T00:00:00.000",,,,,,,,,,,"186",,,,,,,,,,"A",,,,,,,"https://opendata.rdw.nl/resource/3huj-srit.json","https://opendata.rdw.nl/resource/8ys7-d773.json","https://opendata.rdw.nl/resource/vezc-m2t6.json","https://opendata.rdw.nl/resource/jhie-znh9.json","https://opendata.rdw.nl/resource/kmfi-hrps.json"
"HK133F","Personenauto","MERCEDES-BENZ","GLE 500 E 4MATIC","20250103","20230302","643","stationwagen","5","WIT","Niet geregistreerd","6","2996","2365","3050","2465","750","2000","20151120","20151120","Geen verstrekking in Open Data","104268","Ja",,,,,,,"5","4","0","0",,"485","197","M1",,,"op r. deurstyl","3050","166",,"e1*2007/46*0598*16","A25JP1","NZCCB542","0","0.10","292","Nee","Ja",,"Nee","5150","0","0.00","2024","Logisch","00","Ja","2025-01-03T00:00:00.000","2023-03-02T00:00:00.000","2015-11-20T00:00:00.000","2015-11-20T00:00:00.000",,,,,,,,,,,"186",,,,,,,,,,"A",,,,,,,"https://opendata.rdw.nl/resource/3huj-srit.json","https://opendata.rdw.nl/resource/8ys7-d773.json","https://opendata.rdw.nl/resource/vezc-m2t6.json","https://opendata.rdw.nl/resource/jhie-znh9.json","https://opendata.rdw.nl/resource/kmfi-hrps.json"
"HK190F","Personenauto","MERCEDES-BENZ","GLE 500 E 4MATIC","20250104","20240112","643","stationwagen","5","ZWART","Niet geregistreerd","6","2996","2365","3050","2465","750","2000","20151123","20151123","Geen verstrekking in Open Data","103820","Ja",,,,,,,"5","4","0","0",,"485","197","M1",,,"op r. deurstyl","3050","166",,"e1*2007/46*0598*16","A25JP1","NZCCB532","0","0.10","292","Nee","Nee",,"Nee","5150","0","0.00","2024","Logisch","00","Ja","2025-01-04T00:00:00.000","2024-01-12T00:00:00.000","2015-11-23T00:00:00.000","2015-11-23T00:00:00.000",,,,,,,,,,,"186",,,,,,,,,,"A",,,,,,,"https://opendata.rdw.nl/resource/3huj-srit.json","https://opendata.rdw.nl/resource/8ys7-d773.json","https://opendata.rdw.nl/resource/vezc-m2t6.json","https://opendata.rdw.nl/resource/jhie-znh9.json","https://opendata.rdw.nl/resource/kmfi-hrps.json"
"HK196R","Personenauto","MERCEDES-BENZ","GLE 500 E 4MATIC","20240630","20230708","643","stationwagen","5","WIT","Niet geregistreerd","6","2996","2365","3050","2465","750","2000","20151201","20151201","Geen verstrekking in Open Data","109120","Ja",,,,,,,"5","4","0","0",,"485","197","M1",,,"op r. deurstyl","3050","166",,"e1*2007/46*0598*16","A25JP1","NZCCB542","0","0.10","292","Nee","Nee",,"Nee","5150","0","0.00","2023","Logisch","00","Ja","2024-06-30T00:00:00.000","2023-07-08T00:00:00.000","2015-12-01T00:00:00.000","2015-12-01T00:00:00.000",,,,,,,,,,,"186",,,,,,,,,,"A",,,,,,,"https://opendata.rdw.nl/resource/3huj-srit.json","https://opendata.rdw.nl/resource/8ys7-d773.json","https://opendata.rdw.nl/resource/vezc-m2t6.json","https://opendata.rdw.nl/resource/jhie-znh9.json","https://opendata.rdw.nl/resource/kmfi-hrps.json"
"HK404T","Personenauto","MERCEDES-BENZ","GLE 500 E 4MATIC","20241127","20201128","643","stationwagen","5","GRIJS","Niet geregistreerd","6","2996","2365","3050","2465","750","2000","20151127","20151127","Geen verstrekking in Open Data","104425","Ja",,,,,,,"5","4","0","0",,"485","197","M1",,,"op r. deurstyl","3050","166",,"e1*2007/46*0598*16","A25JP1","NZCCB532","0","0.10","292","Nee","Nee",,"Nee","5150","0","0.00","2024","Logisch","00","Ja","2024-11-27T00:00:00.000","2020-11-28T00:00:00.000","2015-11-27T00:00:00.000","2015-11-27T00:00:00.000",,,,,,,,,,,"186",,,,,,,,,,"A",,,,,,,"https://opendata.rdw.nl/resource/3huj-srit.json","https://opendata.rdw.nl/resource/8ys7-d773.json","https://opendata.rdw.nl/resource/vezc-m2t6.json","https://opendata.rdw.nl/resource/jhie-znh9.json","https://opendata.rdw.nl/resource/kmfi-hrps.json"
"HK417T","Personenauto","MERCEDES-BENZ","GLE 500 E 4MATIC","20241128","20240403","643","stationwagen","5","ZWART","Niet geregistreerd","6","2996","2365","3050","2465","750","2000","20151128","20151128","Geen verstrekking in Open Data","104111","Ja",,,,,,,"5","4","0","0",,"485","197","M1",,,"op r. deurstyl","3050","166",,"e1*2007/46*0598*16","A25JP1","NZCCB542","0","0.10","292","Nee","Nee",,"Nee","5150","0","0.00","2024","Logisch","00","Ja","2024-11-28T00:00:00.000","2024-04-03T00:00:00.000","2015-11-28T00:00:00.000","2015-11-28T00:00:00.000",,,,,,,,,,,"186",,,,,,,,,,"A",,,,,,,"https://opendata.rdw.nl/resource/3huj-srit.json","https://opendata.rdw.nl/resource/8ys7-d773.json","https://opendata.rdw.nl/resource/vezc-m2t6.json","https://opendata.rdw.nl/resource/jhie-znh9.json","https://opendata.rdw.nl/resource/kmfi-hrps.json"
"HK594H","Personenauto","MERCEDES-BENZ","GLE 500 E 4MATIC","20241125","20201219","643","stationwagen","5","BLAUW","Niet geregistreerd","6","2996","2365","3050","2465","750","2000","20151125","20151125","Geen verstrekking in Open Data","104425","Ja",,,,,,,"5","4","0","0",,"485","197","M1",,,"op r. deurstyl","3050","166",,"e1*2007/46*0598*16","A25JP1","NZCCB532","0","0.10","292","Nee","Nee",,"Nee","5150","0","0.00","2023","Logisch","00","Ja","2024-11-25T00:00:00.000","2020-12-19T00:00:00.000","2015-11-25T00:00:00.000","2015-11-25T00:00:00.000",,,,,,,,,,,"186",,,,,,,,,,"A",,,,,,,"https://opendata.rdw.nl/resource/3huj-srit.json","https://opendata.rdw.nl/resource/8ys7-d773.json","https://opendata.rdw.nl/resource/vezc-m2t6.json","https://opendata.rdw.nl/resource/jhie-znh9.json","https://opendata.rdw.nl/resource/kmfi-hrps.json"
"HK601H","Personenauto","MERCEDES-BENZ","GLE 500 E 4MATIC","20240909","20211011","643","stationwagen","5","BRUIN","Niet geregistreerd","6","2996","2365","3050","2465","750","2000","20151120","20151120","Geen verstrekking in Open Data","97456","Ja",,,,,,,"5","4","0","0",,"485","197","M1",,,"op r. deurstyl","3050","166",,"e1*2007/46*0598*16","A25JP1","NZCCB532","0","0.10","292","Nee","Nee",,"Nee","5150","0","0.00","2024","Logisch","00","Ja","2024-09-09T00:00:00.000","2021-10-11T00:00:00.000","2015-11-20T00:00:00.000","2015-11-20T00:00:00.000",,,,,,,,,,,"186",,,,,,,,,,"A",,,,,,,"https://opendata.rdw.nl/resource/3huj-srit.json","https://opendata.rdw.nl/resource/8ys7-d773.json","https://opendata.rdw.nl/resource/vezc-m2t6.json","https://opendata.rdw.nl/resource/jhie-znh9.json","https://opendata.rdw.nl/resource/kmfi-hrps.json"
"HK671X","Personenauto","MERCEDES-BENZ","GLE 500 E 4MATIC","20241129","20210108","643","stationwagen","5","GRIJS","Niet geregistreerd","6","2996","2365","3050","2465","750","2000","20151126","20151126","Geen verstrekking in Open Data","108176","Ja",,,,,,,"5","4","0","0",,"485","197","M1",,,"op r. deurstyl","3050","166",,"e1*2007/46*0598*16","A25JP1","NZCCB542","0","0.10","292","Nee","Ja",,"Nee","5150","0","0.00","2024","Logisch","00","Ja","2024-11-29T00:00:00.000","2021-01-08T00:00:00.000","2015-11-26T00:00:00.000","2015-11-26T00:00:00.000",,,,,,,,,,,"186",,,,,,,,,,"A",,,,,,,"https://opendata.rdw.nl/resource/3huj-srit.json","https://opendata.rdw.nl/resource/8ys7-d773.json","https://opendata.rdw.nl/resource/vezc-m2t6.json","https://opendata.rdw.nl/resource/jhie-znh9.json","https://opendata.rdw.nl/resource/kmfi-hrps.json"
"HK672X","Personenauto","MERCEDES-BENZ","GLE 500 E 4MATIC","20241207","20201001","643","stationwagen","5","GRIJS","Niet geregistreerd","6","2996","2365","3050","2465","750","2000","20151207","20151207","Geen verstrekking in Open Data","105127","Ja",,,,,,,"5","4","0","0",,"485","197","M1",,,"op r. deurstyl","3050","166",,"e1*2007/46*0598*16","A25JP1","NZCCB532","0","0.10","292","Nee","Nee",,"Nee","5150","0","0.00","2023","Logisch","00","Ja","2024-12-07T00:00:00.000","2020-10-01T00:00:00.000","2015-12-07T00:00:00.000","2015-12-07T00:00:00.000",,,,,,,,,,,"186",,,,,,,,,,"A",,,,,,,"https://opendata.rdw.nl/resource/3huj-srit.json","https://opendata.rdw.nl/resource/8ys7-d773.json","https://opendata.rdw.nl/resource/vezc-m2t6.json","https://opendata.rdw.nl/resource/jhie-znh9.json","https://opendata.rdw.nl/resource/kmfi-hrps.json"
"HK676X","Personenauto","MERCEDES-BENZ","GLE 500 E 4MATIC","20250328","20190329","643","stationwagen","5","ZWART","Niet geregistreerd","6","2996","2365","3050","2465","750","2000","20151201","20151201","Geen verstrekking in Open Data","105448","Ja",,,,,,,"5","4","0","0",,"485","197","M1",,,"op r. deurstyl","3050","166",,"e1*2007/46*0598*16","A25JP1","NZCCB542","0","0.10","292","Nee","Nee",,"Nee","5150","0","0.00","2024","Logisch","00","Ja","2025-03-28T00:00:00.000","2019-03-29T00:00:00.000","2015-12-01T00:00:00.000","2015-12-01T00:00:00.000",,,,,,,,,,,"186",,,,,,,,,,"A",,,,,,,"https://opendata.rdw.nl/resource/3huj-srit.json","https://opendata.rdw.nl/resource/8ys7-d773.json","https://opendata.rdw.nl/resource/vezc-m2t6.json","https://opendata.rdw.nl/resource/jhie-znh9.json","https://opendata.rdw.nl/resource/kmfi-hrps.json"
"HK688X","Personenauto","MERCEDES-BENZ","GLE 500 E 4MATIC","20250428","20210428","643","stationwagen","5","GRIJS","Niet geregistreerd","6","2996","2365","3050","2465","750","2000","20151127","20151127","Geen verstrekking in Open Data","95484","Ja",,,,,,,"5","4","0","0",,"485","197","M1",,,"op r. deurstyl","3050","166",,"e1*2007/46*0598*16","A25JP1","NZCCB542","0","0.10","292","Nee","Nee",,"Nee","5150","0","0.00","2024","Logisch","00","Ja","2025-04-28T00:00:00.000","2021-04-28T00:00:00.000","2015-11-27T00:00:00.000","2015-11-27T00:00:00.000",,,,,,,,,,,"186",,,,,,,,,,"A",,,,,,,"https://opendata.rdw.nl/resource/3huj-srit.json","https://opendata.rdw.nl/resource/8ys7-d773.json","https://opendata.rdw.nl/resource/vezc-m2t6.json","https://opendata.rdw.nl/resource/jhie-znh9.json","https://opendata.rdw.nl/resource/kmfi-hrps.json"
"HL135D","Personenauto","MERCEDES-BENZ","GLE 500 E 4MATIC","20241221","20230110","643","stationwagen","5","ZWART","Niet geregistreerd","6","2996","2365","3050","2465","750","2000","20151221","20151221","Geen verstrekking in Open Data","106616","Ja",,,,,,,"5","4","0","0",,"485","197","M1",,,"op r. deurstyl","3050","166",,"e1*2007/46*0598*16","A25JP1","NZCCB542","0","0.10","292","Nee","Ja",,"Nee","5150","0","0.00","2023","Logisch","00","Ja","2024-12-21T00:00:00.000","2023-01-10T00:00:00.000","2015-12-21T00:00:00.000","2015-12-21T00:00:00.000",,,,,,,,,,,"186",,,,,,,,,,"A",,,,,,,"https://opendata.rdw.nl/resource/3huj-srit.json","https://opendata.rdw.nl/resource/8ys7-d773.json","https://opendata.rdw.nl/resource/vezc-m2t6.json","https://opendata.rdw.nl/resource/jhie-znh9.json","https://opendata.rdw.nl/resource/kmfi-hrps.json"