"kenteken","voertuigsoort","merk","handelsbenaming","vervaldatum_apk","datum_tenaamstelling","bruto_bpm","inrichting","aantal_zitplaatsen","eerste_kleur","tweede_kleur","aantal_cilinders","cilinderinhoud","massa_ledig_voertuig","toegestane_maximum_massa_voertuig","massa_rijklaar","maximum_massa_trekken_ongeremd","maximum_trekken_massa_geremd","datum_eerste_toelating","datum_eerste_tenaamstelling_in_nederland","wacht_op_keuren","catalogusprijs","wam_verzekerd","maximale_constructiesnelheid","laadvermogen","oplegger_geremd","aanhangwagen_autonoom_geremd","aanhangwagen_middenas_geremd","aantal_staanplaatsen","aantal_deuren","aantal_wielen","afstand_hart_koppeling_tot_achterzijde_voertuig","afstand_voorzijde_voertuig_tot_hart_koppeling","afwijkende_maximum_snelheid","lengte","breedte","europese_voertuigcategorie","europese_voertuigcategorie_toevoeging","europese_uitvoeringcategorie_toevoeging","plaats_chassisnummer","technische_max_massa_voertuig","type","type_gasinstallatie","typegoedkeuringsnummer","variant","uitvoering","volgnummer_wijziging_eu_typegoedkeuring","vermogen_massarijklaar","wielbasis","export_indicator","openstaande_terugroepactie_indicator","vervaldatum_tachograaf","taxi_indicator","maximum_massa_samenstelling","aantal_rolstoelplaatsen","maximum_ondersteunende_snelheid","jaar_laatste_registratie_tellerstand","tellerstandoordeel","code_toelichting_tellerstandoordeel","tenaamstellen_mogelijk","vervaldatum_apk_dt","datum_tenaamstelling_dt","datum_eerste_toelating_dt","datum_eerste_tenaamstelling_in_nederland_dt","vervaldatum_tachograaf_dt","maximum_last_onder_de_vooras_sen_tezamen_koppeling","type_remsysteem_voertuig_code","rupsonderstelconfiguratiecode","wielbasis_voertuig_minimum","wielbasis_voertuig_maximum","lengte_voertuig_minimum","lengte_voertuig_maximum","breedte_voertuig_minimum","breedte_voertuig_maximum","hoogte_voertuig","hoogte_voertuig_minimum","hoogte_voertuig_maximum","massa_bedrijfsklaar_minimaal","massa_bedrijfsklaar_maximaal","technisch_toelaatbaar_massa_koppelpunt","maximum_massa_technisch_maximaal","maximum_massa_technisch_minimaal","subcategorie_nederland","verticale_belasting_koppelpunt_getrokken_voertuig","zuinigheidsclassificatie","registratie_datum_goedkeuring_afschrijvingsmoment_bpm","registratie_datum_goedkeuring_afschrijvingsmoment_bpm_dt","gem_lading_wrde","aerodyn_voorz","massa_alt_aandr","verl_cab_ind","api_gekentekende_voertuigen_assen","api_gekentekende_voertuigen_brandstof","api_gekentekende_voertuigen_carrosserie","api_gekentekende_voertuigen_carrosserie_specifiek","api_gekentekende_voertuigen_voertuigklasse"
"1ZSR60","Personenauto","MERCEDES-BENZ","CLS 350 BLUETEC","20240623","20150318","8597","sedan","4","ZWART","Niet geregistreerd","6","2987","1745","2330","1845",,,"20140618","20150318","Geen verstrekking in Open Data","110413","Ja",,,,,,,"4","4","0","0",,"0","0","M1",,,"r. voorzitting","2330","218",,"e1*2007/46*0485*09","G3BDP0","NZAAB401","0","0.10","287","Nee","Nee",,"Nee","0","0","0.00","2023","Geen oordeel","05","Ja","2024-06-23T00:00:00.000","2015-03-18T00:00:00.000","2014-06-18T00:00:00.000","2015-03-18T00:00:00.000",,,,,,,,,,,,,,,,,,,,,"C",,,,,,,"https://opendata.rdw.nl/resource/3huj-srit.json","https://opendata.rdw.nl/resource/8ys7-d773.json","https://opendata.rdw.nl/resource/vezc-m2t6.json","https://opendata.rdw.nl/resource/jhie-znh9.json","https://opendata.rdw.nl/resource/kmfi-hrps.json"
"3XVT19","Personenauto","MERCEDES-BENZ","CLS 350 BLUETEC","20240907","20210824","12493","sedan","4","GRIJS","Niet geregistreerd","6","2987","1745","2330","1845",,,"20140210","20150109","Geen verstrekking in Open Data","101129","Ja",,,,,,,"4","4","0","0",,"0","0","M1",,,"r. voorzitting","2330","218",,"e1*2007/46*0485*11","G3BDP0","NZAAB402","0","0.10","287","Nee","Nee",,"Nee","0","0","0.00","2023","Geen oordeel","05","Ja","2024-09-07T00:00:00.000","2021-08-24T00:00:00.000","2014-02-10T00:00:00.000","2015-01-09T00:00:00.000",,"0",,,,,,,,,,,,,,,,,,,"C",,,,,,,"https://opendata.rdw.nl/resource/3huj-srit.json","https://opendata.rdw.nl/resource/8ys7-d773.json","https://opendata.rdw.nl/resource/vezc-m2t6.json","https://opendata.rdw.nl/resource/jhie-znh9.json","https://opendata.rdw.nl/resource/kmfi-hrps.json"
"3ZFK16","Personenauto","MERCEDES-BENZ","CLS 350 BLUETEC","20250102","20180804","13090","stationwagen","5","GRIJS","Niet geregistreerd","6","2987","1835","2460","1935","750","2100","20150102","20150102","Geen verstrekking in Open Data","103611","Ja",,,,,,,"5","4","0","0",,"0","0","M1",,,"r. voorzitting","2460","218",,"e1*2007/46*0485*12","G2BFP0","CZCCB501","0","0.10","287","Nee","Nee",,"Nee","4660","0","0.00","2023","Logisch","00","Ja","2025-01-02T00:00:00.000","2018-08-04T00:00:00.000","2015-01-02T00:00:00.000","2015-01-02T00:00:00.000",,,,,,,,,,,,,,,,,,,,,"D",,,,,,,"https://opendata.rdw.nl/resource/3huj-srit.json","https://opendata.rdw.nl/resource/8ys7-d773.json","https://opendata.rdw.nl/resource/vezc-m2t6.json","https://opendata.rdw.nl/resource/jhie-znh9.json","https://opendata.rdw.nl/resource/kmfi-hrps.json"
"4THJ45","Personenauto","MERCEDES-BENZ","CLS 350 BLUETEC 4MATIC","20240818","20170309","16074","sedan","4","ZWART","Niet geregistreerd","6","2987","1835","2420","1935",,,"20140207","20140207","Geen verstrekking in Open Data","106469","Ja",,,,,,,"4","4","0","0",,"0","0","M1",,,"r. voorzitting","2420","218",,"e1*2007/46*0485*11","G3BDP1","NZAAB402","0","0.10","287","Nee","Nee",,"Nee","0","0","0.00","2024","Logisch","00","Ja","2024-08-18T00:00:00.000","2017-03-09T00:00:00.000","2014-02-07T00:00:00.000","2014-02-07T00:00:00.000",,,,,,,,,,,,,,,,,,,,,"E",,,,,,,"https://opendata.rdw.nl/resource/3huj-srit.json","https://opendata.rdw.nl/resource/8ys7-d773.json","https://opendata.rdw.nl/resource/vezc-m2t6.json","https://opendata.rdw.nl/resource/jhie-znh9.json","https://opendata.rdw.nl/resource/kmfi-hrps.json"
"4ZPZ62","Personenauto","MERCEDES-BENZ","CLS 350 BLUETEC","20240722","20200626","12375","sedan","4","ZWART","Niet geregistreerd","6","2987","1745","2330","1845",,,"20150227","20150227","Geen verstrekking in Open Data","103340","Ja",,,,,,,"4","4","0","0",,"0","0","M1",,,"r. voorzitting","2330","218",,"e1*2007/46*0485*12","G3BFP0","CZCCB411","0","0.10","287","Nee","Nee",,"Nee","0","0","0.00","2024","Logisch","00","Ja","2024-07-22T00:00:00.000","2020-06-26T00:00:00.000","2015-02-27T00:00:00.000","2015-02-27T00:00:00.000",,,,,,,,,,,,,,,,,,,,,"C",,,,,,,"https://opendata.rdw.nl/resource/3huj-srit.json","https://opendata.rdw.nl/resource/8ys7-d773.json","https://opendata.rdw.nl/resource/vezc-m2t6.json","https://opendata.rdw.nl/resource/jhie-znh9.json","https://opendata.rdw.nl/resource/kmfi-hrps.json"
"5ZJF83","Personenauto","MERCEDES-BENZ","CLS 350 BLUETEC","20250122","20210429","11697","sedan","4","ZWART","Niet geregistreerd","6","2987","1745","2330","1845",,,"20150102","20150102","Geen verstrekking in Open Data","94492","Nee",,,,,,,"4","4","0","0",,"0","0","M1",,,"r. voorzitting","2330","218",,"e1*2007/46*0485*12","G3BFP0","CZCCB411","0","0.10","287","Nee","Nee",,"Nee","0","0","0.00","2024","Logisch","00","Ja","2025-01-22T00:00:00.000","2021-04-29T00:00:00.000","2015-01-02T00:00:00.000","2015-01-02T00:00:00.000",,,,,,,,,,,,,,,,,,,,,"C",,,,,,,"https://opendata.rdw.nl/resource/3huj-srit.json","https://opendata.rdw.nl/resource/8ys7-d773.json","https://opendata.rdw.nl/resource/vezc-m2t6.json","https://opendata.rdw.nl/resource/jhie-znh9.json","https://opendata.rdw.nl/resource/kmfi-hrps.json"
"5ZNT81","Personenauto","MERCEDES-BENZ","CLS 350 BLUETEC 4MATIC","20240819","20240322","21393","stationwagen","5","WIT","Niet geregistreerd","6","2987","1895","2520","1995","750","2100","20150212","20150212","Geen verstrekking in Open Data","128750","Ja",,,,,,,"5","4","0","0",,"0","0","M1",,,"r. voorzitting","2520","218",,"e1*2007/46*0485*12","G2BDP1","NZCCB521","0","0.09","287","Nee","Nee",,"Nee","4720","0","0.00","2024","Logisch","00","Ja","2024-08-19T00:00:00.000","2024-03-22T00:00:00.000","2015-02-12T00:00:00.000","2015-02-12T00:00:00.000",,,,,,,,,,,,,,,,,,,,,"F",,,,,,,"https://opendata.rdw.nl/resource/3huj-srit.json","https://opendata.rdw.nl/resource/8ys7-d773.json","https://opendata.rdw.nl/resource/vezc-m2t6.json","https://opendata.rdw.nl/resource/jhie-znh9.json","https://opendata.rdw.nl/resource/kmfi-hrps.json"
"7ZSB47","Personenauto","MERCEDES-BENZ","CLS 350 BLUETEC","20240610","20151130","13761","stationwagen","5","GRIJS","Niet geregistreerd","6","2987","1835","2460","1935","750","2100","20150312","20150312","Geen verstrekking in Open Data","109768","Ja",,,,,,,"5","4",,,,,,"M1",,,"r. voorzitting","2460","218",,,,,,"0.10","287","Nee","Nee",,"Nee","4660",,,"2023","Logisch","00","Ja","2024-06-10T00:00:00.000","2015-11-30T00:00:00.000","2015-03-12T00:00:00.000","2015-03-12T00:00:00.000",,,,,,,,,,,,,,,,,,,,,"D",,,,,,,"https://opendata.rdw.nl/resource/3huj-srit.json","https://opendata.rdw.nl/resource/8ys7-d773.json","https://opendata.rdw.nl/resource/vezc-m2t6.json","https://opendata.rdw.nl/resource/jhie-znh9.json","https://opendata.rdw.nl/resource/kmfi-hrps.json"
"9XZT33","Personenauto","MERCEDES-BENZ","CLS 350 BLUETEC","20241227","20230704","12294","sedan","4","GRIJS","Niet geregistreerd","6","2987","1745","2330","1845",,,"20141128","20141128","Geen verstrekking in Open Data","101985","Ja",,,,,,,"4","4","0","0",,"0","0","M1",,,"r. voorzitting","2330","218",,"e1*2007/46*0485*11","G3BDP0","NZAAB401","0","0.10","287","Nee","Nee",,"Ja","0","0","0.00","2023","Logisch","03","Ja","2024-12-27T00:00:00.000","2023-07-04T00:00:00.000","2014-11-28T00:00:00.000","2014-11-28T00:00:00.000",,,,,,,,,,,,,,,,,,,,,"C","20230706","2023-07-06T00:00:00.000",,,,,"https://opendata.rdw.nl/resource/3huj-srit.json","https://opendata.rdw.nl/resource/8ys7-d773.json","https://opendata.rdw.nl/resource/vezc-m2t6.json","https://opendata.rdw.nl/resource/jhie-znh9.json","https://opendata.rdw.nl/resource/kmfi-hrps.json"
"G618GS","Personenauto","MERCEDES-BENZ","CLS 350 BLUETEC","20241204","20210320","2258","sedan","4","ZWART","Niet geregistreerd","6","2987","1745","2330","1845",,,"20150223","20190919","Geen verstrekking in Open Data","92906","Ja","250",,,,,,"4","4","0","0",,"0","188","M1",,,,"2330","218",,"e1*2007/46*0485*12","G3BFP0","CZCCB411","0","0.10","287","Nee","Nee",,"Nee","0","0","0.00","2023","Geen oordeel","05","Ja","2024-12-04T00:00:00.000","2021-03-20T00:00:00.000","2015-02-23T00:00:00.000","2019-09-19T00:00:00.000",,,,,,,,,,,,,,,,,,,,,"C",,,,,,,"https://opendata.rdw.nl/resource/3huj-srit.json","https://opendata.rdw.nl/resource/8ys7-d773.json","https://opendata.rdw.nl/resource/vezc-m2t6.json","https://opendata.rdw.nl/resource/jhie-znh9.json","https://opendata.rdw.nl/resource/kmfi-hrps.json"
"GD715F","Personenauto","MERCEDES-BENZ","CLS 350 BLUETEC","20240622","20190109","13761","stationwagen","5","BLAUW","Niet geregistreerd","6","2987","1835","2460","1935","750","2100","20150421","20150421","Geen verstrekking in Open Data","101292","Ja",,,,,,,"5","4","0","0",,"0","0","M1",,,"r. voorzitting","2460","218",,"e1*2007/46*0485*12","G2BFP0","CZCCB521","0","0.10","287","Nee","Nee",,"Nee","4660","0","0.00","2023","Logisch","00","Ja","2024-06-22T00:00:00.000","2019-01-09T00:00:00.000","2015-04-21T00:00:00.000","2015-04-21T00:00:00.000",,,,,,,,,,,,,,,,,,,,,"D",,,,,,,"https://opendata.rdw.nl/resource/3huj-srit.json","https://opendata.rdw.nl/resource/8ys7-d773.json","https://opendata.rdw.nl/resource/vezc-m2t6.json","https://opendata.rdw.nl/resource/jhie-znh9.json","https://opendata.rdw.nl/resource/kmfi-hrps.json"
"GD717F","Personenauto","MERCEDES-BENZ","CLS 350 BLUETEC","20250430","20160916","13761","stationwagen","5","BLAUW","Niet geregistreerd","6","2987","1835","2460","1935","750","2100","20150420","20150420","Geen verstrekking in Open Data","105061","Ja",,,,,,,"5","4","0","0",,"0","0","M1",,,"r. voorzitting","2460","218",,"e1*2007/46*0485*12","G2BFP0","CZCCB501","0","0.10","287","Nee","Nee",,"Nee","4660","0","0.00","2024","Logisch","00","Ja","2025-04-30T00:00:00.000","2016-09-16T00:00:00.000","2015-04-20T00:00:00.000","2015-04-20T00:00:00.000",,,,,,,,,,,,,,,,,,,,,"D",,,,,,,"https://opendata.rdw.nl/resource/3huj-srit.json","https://opendata.rdw.nl/resource/8ys7-d773.json","https://opendata.rdw.nl/resource/vezc-m2t6.json","https://opendata.rdw.nl/resource/jhie-znh9.json","https://opendata.rdw.nl/resource/kmfi-hrps.json"
"GH556S","Personenauto","MERCEDES-BENZ","CLS 350 BLUETEC","20241022","20161014","13761","stationwagen","5","BLAUW","Niet geregistreerd","6","2987","1835","2460","1935","750","2100","20151006","20151006","Geen verstrekking in Open Data","101292","Ja",,,,,,,"5","4","0","0",,"0","0","M1",,,"r. voorzitting","2460","218",,"e1*2007/46*0485*12","G2BFP0","CZCCB521","0","0.10","287","Nee","Nee",,"Nee","4660","0","0.00","2023","Logisch","00","Ja","2024-10-22T00:00:00.000","2016-10-14T00:00:00.000","2015-10-06T00:00:00.000","2015-10-06T00:00:00.000",,,,,,,,,,,,,,,,,,,,,"D",,,,,,,"https://opendata.rdw.nl/resource/3huj-srit.json","https://opendata.rdw.nl/resource/8ys7-d773.json","https://opendata.rdw.nl/resource/vezc-m2t6.json","https://opendata.rdw.nl/resource/jhie-znh9.json","https://opendata.rdw.nl/resource/kmfi-hrps.json"
"GH683N","Personenauto","MERCEDES-BENZ","CLS 350 BLUETEC","20241127","20231028","13761","stationwagen","5","GRIJS","Niet geregistreerd","6","2987","1835","2460","1935","750","2100","20150528","20150528","Geen verstrekking in Open Data","101292","Ja",,,,,,,"5","4","0","0",,"0","0","M1",,,"r. voorzitting","2460","218",,"e1*2007/46*0485*12","G2BFP0","CZCCB521","0","0.10","287","Nee","Nee",,"Nee","4660","0","0.00","2023","Logisch","00","Ja","2024-11-27T00:00:00.000","2023-10-28T00:00:00.000","2015-05-28T00:00:00.000","2015-05-28T00:00:00.000",,,,,,,,,,,,,,,,,,,,,"D",,,,,,,"https://opendata.rdw.nl/resource/3huj-srit.json","https://opendata.rdw.nl/resource/8ys7-d773.json","https://opendata.rdw.nl/resource/vezc-m2t6.json","https://opendata.rdw.nl/resource/jhie-znh9.json","https://opendata.rdw.nl/resource/kmfi-hrps.json"
"GH685N","Personenauto","MERCEDES-BENZ","CLS 350 BLUETEC","20240711","20240501","13761","stationwagen","5","GRIJS","Niet geregistreerd","6","2987","1835","2460","1935","750","2100","20150529","20150529","Geen verstrekking in Open Data","101292","Ja",,,,,,,"5","4","0","0",,"0","0","M1",,,"r. voorzitting","2460","218",,"e1*2007/46*0485*12","G2BFP0","CZCCB521","0","0.10","287","Nee","Nee",,"Nee","4660","0","0.00","2024","Logisch","00","Ja","2024-07-11T00:00:00.000","2024-05-01T00:00:00.000","2015-05-29T00:00:00.000","2015-05-29T00:00:00.000",,,,,,,,,,,,,,,,,,,,,"D",,,,,,,"https://opendata.rdw.nl/resource/3huj-srit.json","https://opendata.rdw.nl/resource/8ys7-d773.json","https://opendata.rdw.nl/resource/vezc-m2t6.json","https://opendata.rdw.nl/resource/jhie-znh9.json","https://opendata.rdw.nl/resource/kmfi-hrps.json"
"GH901J","Personenauto","MERCEDES-BENZ","CLS 350 BLUETEC","20240628","20220609","13761","stationwagen","5","ZWART","Niet geregistreerd","6","2987","1835","2460","1935","750","2100","20150528","20150528","Geen verstrekking in Open Data","101292","Ja",,,,,,,"5","4","0","0",,"0","0","M1",,,"r. voorzitting","2460","218",,"e1*2007/46*0485*12","G2BFP0","CZCCB521","0","0.10","287","Nee","Nee",,"Nee","4660","0","0.00","2023","Logisch","00","Ja","2024-06-28T00:00:00.000","2022-06-09T00:00:00.000","2015-05-28T00:00:00.000","2015-05-28T00:00:00.000",,,,,,,,,,,,,,,,,,,,,"D",,,,,,,"https://opendata.rdw.nl/resource/3huj-srit.json","https://opendata.rdw.nl/resource/8ys7-d773.json","https://opendata.rdw.nl/resource/vezc-m2t6.json","https://opendata.rdw.nl/resource/jhie-znh9.json","https://opendata.rdw.nl/resource/kmfi-hrps.json"
"GH944G","Personenauto","MERCEDES-BENZ","CLS 350 BLUETEC 4MATIC","20250210","20160305","11752","sedan","4","ZWART","Niet geregistreerd","6","2987","1835","2420","1935",,,"20150210","20150526","Geen verstrekking in Open Data","114329","Ja",,,,,,,"4","4","0","0",,"0","0","M1",,,"r. voorzitting","2420","218",,"e1*2007/46*0485*09","G3BDP1","NZAAB402","0","0.10","287","Nee","Nee",,"Nee","0","0","0.00","2024","Geen oordeel","05","Ja","2025-02-10T00:00:00.000","2016-03-05T00:00:00.000","2015-02-10T00:00:00.000","2015-05-26T00:00:00.000",,,,,,,,,,,,,,,,,,,,,"E",,,,,,,"https://opendata.rdw.nl/resource/3huj-srit.json","https://opendata.rdw.nl/resource/8ys7-d773.json","https://opendata.rdw.nl/resource/vezc-m2t6.json","https://opendata.rdw.nl/resource/jhie-znh9.json","https://opendata.rdw.nl/resource/kmfi-hrps.json"
"GJ444T","Personenauto","MERCEDES-BENZ","CLS 350 BLUETEC","20250204","20180202","8898","sedan","4","WIT","Niet geregistreerd","6","2987","1745","2330","1845",,,"20140110","20150612","Geen verstrekking in Open Data","105482","Ja",,,,,,,"4","4","0","0",,"0","0","M1",,,"r. voorzitting","2330","218",,"e1*2007/46*0485*11","G3BDP0","NZAAB402","0","0.10","287","Nee","Nee",,"Nee","0","0","0.00","2023","Geen oordeel","05","Ja","2025-02-04T00:00:00.000","2018-02-02T00:00:00.000","2014-01-10T00:00:00.000","2015-06-12T00:00:00.000",,,,,,,,,,,,,,,,,,,,,"C",,,,,,,"https://opendata.rdw.nl/resource/3huj-srit.json","https://opendata.rdw.nl/resource/8ys7-d773.json","https://opendata.rdw.nl/resource/vezc-m2t6.json","https://opendata.rdw.nl/resource/jhie-znh9.json","https://opendata.rdw.nl/resource/kmfi-hrps.json"
"GK957V","Personenauto","MERCEDES-BENZ","CLS 350 BLUETEC","20240706","20170201","13761","stationwagen","5","GRIJS","Niet geregistreerd","6","2987","1835","2460","1935","750","2100","20150625","20150625","Geen verstrekking in Open Data","105061","Ja",,,,,,,"5","4","0","0",,"0","0","M1",,,"r. voorzitting","2460","218",,"e1*2007/46*0485*12","G2BFP0","CZCCB501","0","0.10","287","Nee","Nee",,"Nee","4660","0","0.00","2023","Logisch","00","Ja","2024-07-06T00:00:00.000","2017-02-01T00:00:00.000","2015-06-25T00:00:00.000","2015-06-25T00:00:00.000",,,,,,,,,,,,,,,,,,,,,"D",,,,,,,"https://opendata.rdw.nl/resource/3huj-srit.json","https://opendata.rdw.nl/resource/8ys7-d773.json","https://opendata.rdw.nl/resource/vezc-m2t6.json","https://opendata.rdw.nl/resource/jhie-znh9.json","https://opendata.rdw.nl/resource/kmfi-hrps.json"
"GL488K","Personenauto","MERCEDES-BENZ","CLS 350 BLUETEC 4MATIC","20250311","20210202","15170","stationwagen","5","ZWART","Niet geregistreerd","6","2987","1895","2520","1995","750","2100","20150216","20150629","Geen verstrekking in Open Data","115766","Ja",,,,,,,"4","4","0","0",,"0","0","M1",,,"r. voorzitting","2520","218",,"e1*2007/46*0485*12","G2BDP1","NZCCB521","0","0.09","287","Nee","Nee",,"Nee","4720","0","0.00","2024","Geen oordeel","05","Ja","2025-03-11T00:00:00.000","2021-02-02T00:00:00.000","2015-02-16T00:00:00.000","2015-06-29T00:00:00.000",,,,,,,,,,,,,,,,,,,,,"F",,,,,,,"https://opendata.rdw.nl/resource/3huj-srit.json","https://opendata.rdw.nl/resource/8ys7-d773.json","https://opendata.rdw.nl/resource/vezc-m2t6.json","https://opendata.rdw.nl/resource/jhie-znh9.json","https://opendata.rdw.nl/resource/kmfi-hrps.json"
"GL580J","Personenauto","MERCEDES-BENZ","CLS 350 BLUETEC","20250318","20231004","13090","stationwagen","5","ZWART","Niet geregistreerd","6","2987","1835","2460","1935","750","2100","20150630","20150630","Geen verstrekking in Open Data","70696","Ja",,,,,,,"5","4","0","0",,"0","0","M1",,,"r. voorzitting","2460","218",,"e1*2007/46*0485*12","G2BFP0","CZCCB521","0","0.10","287","Nee","Nee",,"Nee","4660","0","0.00","2024","Logisch","00","Ja","2025-03-18T00:00:00.000","2023-10-04T00:00:00.000","2015-06-30T00:00:00.000","2015-06-30T00:00:00.000",,,,,,,,,,,,,,,,,,,,,"D",,,,,,,"https://opendata.rdw.nl/resource/3huj-srit.json","https://opendata.rdw.nl/resource/8ys7-d773.json","https://opendata.rdw.nl/resource/vezc-m2t6.json","https://opendata.rdw.nl/resource/jhie-znh9.json","https://opendata.rdw.nl/resource/kmfi-hrps.json"
"HR405J","Personenauto","MERCEDES-BENZ","CLS 350 BLUETEC 4MATIC","20250313","20230208","11219","sedan","4","ZWART","Niet geregistreerd","6","2987","1815","2400","1915",,,"20141017","20151218","Geen verstrekking in Open Data","86511","Ja",,,,,,,"4","4","0","0",,"0","0","M1",,,"r. voorzitting","2400","218",,"e1*2007/46*0485*12","G3BDP1","NZCCB411","0","0.10","287","Nee","Nee",,"Nee","0","0","0.00","2024","Geen oordeel","05","Ja","2025-03-13T00:00:00.000","2023-02-08T00:00:00.000","2014-10-17T00:00:00.000","2015-12-18T00:00:00.000",,,,,,,,,,,,,,,,,,,,,"E",,,,,,,"https://opendata.rdw.nl/resource/3huj-srit.json","https://opendata.rdw.nl/resource/8ys7-d773.json","https://opendata.rdw.nl/resource/vezc-m2t6.json","https://opendata.rdw.nl/resource/jhie-znh9.json","https://opendata.rdw.nl/resource/kmfi-hrps.json"
"HR983Z","Personenauto","MERCEDES-BENZ","CLS 350 BLUETEC","20250220","20230908","12375","sedan","4","WIT","Niet geregistreerd","6","2987","1745","2330","1845",,,"20160218","20160218","Geen verstrekking in Open Data","112512","Ja",,,,,,,"4","4","0","0",,"497","188","M1",,,"onder r. voorzitting","2330","218",,"e1*2007/46*0485*13","G3BFP0","CZCCB414","0","0.10","287","Nee","Nee",,"Nee","0","0","0.00","2024","Logisch","00","Ja","2025-02-20T00:00:00.000","2023-09-08T00:00:00.000","2016-02-18T00:00:00.000","2016-02-18T00:00:00.000",,,,,,,,,,,"143",,,,,,,,,,"D",,,,,,,"https://opendata.rdw.nl/resource/3huj-srit.json","https://opendata.rdw.nl/resource/8ys7-d773.json","https://opendata.rdw.nl/resource/vezc-m2t6.json","https://opendata.rdw.nl/resource/jhie-znh9.json","https://opendata.rdw.nl/resource/kmfi-hrps.json"
"J494FH","Personenauto","MERCEDES-BENZ","CLS 350 BLUETEC","20240715","20200710","8901","stationwagen","5","GRIJS","Niet geregistreerd","6","2987","1835","2460","1935","750","2100","20140926","20200710","Geen verstrekking in Open Data","94953","Ja","245",,,,,,"5","4","0","0",,"0","188","M1",,,,"2460","218",,"e1*2007/46*0485*12","G2BFP0","CZCCB521","0","0.10","287","Nee","Nee",,"Nee","4660","0","0.00","2023","Geen oordeel","05","Ja","2024-07-15T00:00:00.000","2020-07-10T00:00:00.000","2014-09-26T00:00:00.000","2020-07-10T00:00:00.000",,,,,,,,,,,,,,,,,,,,,"D",,,,,,,"https://opendata.rdw.nl/resource/3huj-srit.json","https://opendata.rdw.nl/resource/8ys7-d773.json","https://opendata.rdw.nl/resource/vezc-m2t6.json","https://opendata.rdw.nl/resource/jhie-znh9.json","https://opendata.rdw.nl/resource/kmfi-hrps.json"
"JG119P","Personenauto","MERCEDES-BENZ","CLS 350 BLUETEC 4MATIC","20240620","20220726","15748","stationwagen","5","GRIJS","Niet geregistreerd","6","2987","1895","2520","1995","750","2100","20150317","20170117","Geen verstrekking in Open Data","106807","Ja",,,,,,,"4","4","0","0",,"0","0","M1",,,"r. voorzitting","2520","218",,"e1*2007/46*0485*13","G2BDP1","NZCCB524","0","0.09","287","Nee","Nee",,"Nee","4720","0","0.00","2023","Geen oordeel","05","Ja","2024-06-20T00:00:00.000","2022-07-26T00:00:00.000","2015-03-17T00:00:00.000","2017-01-17T00:00:00.000",,,,,,,,,,,,,,,,,,,,,"F",,,,,,,"https://opendata.rdw.nl/resource/3huj-srit.json","https://opendata.rdw.nl/resource/8ys7-d773.json","https://opendata.rdw.nl/resource/vezc-m2t6.json","https://opendata.rdw.nl/resource/jhie-znh9.json","https://opendata.rdw.nl/resource/kmfi-hrps.json"
"JG400G","Personenauto","MERCEDES-BENZ","CLS 350 BLUETEC","20250403","20190322","14931","stationwagen","5","ZWART","Niet geregistreerd","6","2987","1835","2460","1935","750","2100","20160309","20160309","Geen verstrekking in Open Data","106231","Ja",,,,,,,"5","4","0","0",,"498","188","M1",,,"onder r. voorzitting","2460","218",,"e1*2007/46*0485*12","G2BFP0","CZCCB501","0","0.10","287","Nee","Nee",,"Nee","4660","0","0.00","2024","Logisch","00","Ja","2025-04-03T00:00:00.000","2019-03-22T00:00:00.000","2016-03-09T00:00:00.000","2016-03-09T00:00:00.000",,,,,,,,,,,"143",,,,,,,,,,"E",,,,,,,"https://opendata.rdw.nl/resource/3huj-srit.json","https://opendata.rdw.nl/resource/8ys7-d773.json","https://opendata.rdw.nl/resource/vezc-m2t6.json","https://opendata.rdw.nl/resource/jhie-znh9.json","https://opendata.rdw.nl/resource/kmfi-hrps.json"